You are viewing a plain text version of this content. The canonical link for it is here.
Posted to dev@kafka.apache.org by Apache Jenkins Server <je...@builds.apache.org> on 2019/05/30 03:07:13 UTC
Build failed in Jenkins: kafka-2.2-jdk8 #126
See <https://builds.apache.org/job/kafka-2.2-jdk8/126/display/redirect?page=changes>
Changes:
[rhauch] MINOR: Fix red herring when ConnectDistributedTest.test_bounce fails.
------------------------------------------
[...truncated 2.74 MB...]
kafka.zk.KafkaZkClientTest > testRetryRegisterBrokerInfo STARTED
kafka.zk.KafkaZkClientTest > testRetryRegisterBrokerInfo PASSED
kafka.zk.KafkaZkClientTest > testConsumerOffsetPath STARTED
kafka.zk.KafkaZkClientTest > testConsumerOffsetPath PASSED
kafka.zk.KafkaZkClientTest > testDeleteRecursiveWithControllerEpochVersionCheck STARTED
kafka.zk.KafkaZkClientTest > testDeleteRecursiveWithControllerEpochVersionCheck PASSED
kafka.zk.KafkaZkClientTest > testControllerManagementMethods STARTED
kafka.zk.KafkaZkClientTest > testControllerManagementMethods PASSED
kafka.zk.KafkaZkClientTest > testTopicAssignmentMethods STARTED
kafka.zk.KafkaZkClientTest > testTopicAssignmentMethods PASSED
kafka.zk.KafkaZkClientTest > testPropagateIsrChanges STARTED
kafka.zk.KafkaZkClientTest > testPropagateIsrChanges PASSED
kafka.zk.KafkaZkClientTest > testControllerEpochMethods STARTED
kafka.zk.KafkaZkClientTest > testControllerEpochMethods PASSED
kafka.zk.KafkaZkClientTest > testDeleteRecursive STARTED
kafka.zk.KafkaZkClientTest > testDeleteRecursive PASSED
kafka.zk.KafkaZkClientTest > testGetTopicPartitionStates STARTED
kafka.zk.KafkaZkClientTest > testGetTopicPartitionStates PASSED
kafka.zk.KafkaZkClientTest > testCreateConfigChangeNotification STARTED
kafka.zk.KafkaZkClientTest > testCreateConfigChangeNotification PASSED
kafka.zk.KafkaZkClientTest > testDelegationTokenMethods STARTED
kafka.zk.KafkaZkClientTest > testDelegationTokenMethods PASSED
kafka.zk.ReassignPartitionsZNodeTest > testDecodeInvalidJson STARTED
kafka.zk.ReassignPartitionsZNodeTest > testDecodeInvalidJson PASSED
kafka.zk.ReassignPartitionsZNodeTest > testEncode STARTED
kafka.zk.ReassignPartitionsZNodeTest > testEncode PASSED
kafka.zk.ReassignPartitionsZNodeTest > testDecodeValidJson STARTED
kafka.zk.ReassignPartitionsZNodeTest > testDecodeValidJson PASSED
kafka.zk.LiteralAclStoreTest > shouldHaveCorrectPaths STARTED
kafka.zk.LiteralAclStoreTest > shouldHaveCorrectPaths PASSED
kafka.zk.LiteralAclStoreTest > shouldRoundTripChangeNode STARTED
kafka.zk.LiteralAclStoreTest > shouldRoundTripChangeNode PASSED
kafka.zk.LiteralAclStoreTest > shouldThrowFromEncodeOnNoneLiteral STARTED
kafka.zk.LiteralAclStoreTest > shouldThrowFromEncodeOnNoneLiteral PASSED
kafka.zk.LiteralAclStoreTest > shouldWriteChangesToTheWritePath STARTED
kafka.zk.LiteralAclStoreTest > shouldWriteChangesToTheWritePath PASSED
kafka.zk.LiteralAclStoreTest > shouldHaveCorrectPatternType STARTED
kafka.zk.LiteralAclStoreTest > shouldHaveCorrectPatternType PASSED
kafka.zk.LiteralAclStoreTest > shouldDecodeResourceUsingTwoPartLogic STARTED
kafka.zk.LiteralAclStoreTest > shouldDecodeResourceUsingTwoPartLogic PASSED
kafka.cluster.BrokerEndPointTest > testEndpointFromUri STARTED
kafka.cluster.BrokerEndPointTest > testEndpointFromUri PASSED
kafka.cluster.BrokerEndPointTest > testHashAndEquals STARTED
kafka.cluster.BrokerEndPointTest > testHashAndEquals PASSED
kafka.cluster.BrokerEndPointTest > testFromJsonV4WithNoRack STARTED
kafka.cluster.BrokerEndPointTest > testFromJsonV4WithNoRack PASSED
kafka.cluster.BrokerEndPointTest > testFromJsonFutureVersion STARTED
kafka.cluster.BrokerEndPointTest > testFromJsonFutureVersion PASSED
kafka.cluster.BrokerEndPointTest > testFromJsonV4WithNullRack STARTED
kafka.cluster.BrokerEndPointTest > testFromJsonV4WithNullRack PASSED
kafka.cluster.BrokerEndPointTest > testBrokerEndpointFromUri STARTED
kafka.cluster.BrokerEndPointTest > testBrokerEndpointFromUri PASSED
kafka.cluster.BrokerEndPointTest > testFromJsonV1 STARTED
kafka.cluster.BrokerEndPointTest > testFromJsonV1 PASSED
kafka.cluster.BrokerEndPointTest > testFromJsonV2 STARTED
kafka.cluster.BrokerEndPointTest > testFromJsonV2 PASSED
kafka.cluster.BrokerEndPointTest > testFromJsonV3 STARTED
kafka.cluster.BrokerEndPointTest > testFromJsonV3 PASSED
kafka.cluster.PartitionTest > testMakeLeaderDoesNotUpdateEpochCacheForOldFormats STARTED
kafka.cluster.PartitionTest > testMakeLeaderDoesNotUpdateEpochCacheForOldFormats PASSED
kafka.cluster.PartitionTest > testReadRecordEpochValidationForLeader STARTED
kafka.cluster.PartitionTest > testReadRecordEpochValidationForLeader PASSED
kafka.cluster.PartitionTest > testFetchOffsetForTimestampEpochValidationForFollower STARTED
kafka.cluster.PartitionTest > testFetchOffsetForTimestampEpochValidationForFollower PASSED
kafka.cluster.PartitionTest > testListOffsetIsolationLevels STARTED
kafka.cluster.PartitionTest > testListOffsetIsolationLevels PASSED
kafka.cluster.PartitionTest > testAppendRecordsAsFollowerBelowLogStartOffset STARTED
kafka.cluster.PartitionTest > testAppendRecordsAsFollowerBelowLogStartOffset PASSED
kafka.cluster.PartitionTest > testFetchLatestOffsetIncludesLeaderEpoch STARTED
kafka.cluster.PartitionTest > testFetchLatestOffsetIncludesLeaderEpoch PASSED
kafka.cluster.PartitionTest > testFetchOffsetSnapshotEpochValidationForFollower STARTED
kafka.cluster.PartitionTest > testFetchOffsetSnapshotEpochValidationForFollower PASSED
kafka.cluster.PartitionTest > testMonotonicOffsetsAfterLeaderChange STARTED
kafka.cluster.PartitionTest > testMonotonicOffsetsAfterLeaderChange PASSED
kafka.cluster.PartitionTest > testMakeFollowerWithNoLeaderIdChange STARTED
kafka.cluster.PartitionTest > testMakeFollowerWithNoLeaderIdChange PASSED
kafka.cluster.PartitionTest > testAppendRecordsToFollowerWithNoReplicaThrowsException STARTED
kafka.cluster.PartitionTest > testAppendRecordsToFollowerWithNoReplicaThrowsException PASSED
kafka.cluster.PartitionTest > testFollowerDoesNotJoinISRUntilCaughtUpToOffsetWithinCurrentLeaderEpoch STARTED
kafka.cluster.PartitionTest > testFollowerDoesNotJoinISRUntilCaughtUpToOffsetWithinCurrentLeaderEpoch PASSED
kafka.cluster.PartitionTest > testFetchOffsetSnapshotEpochValidationForLeader STARTED
kafka.cluster.PartitionTest > testFetchOffsetSnapshotEpochValidationForLeader PASSED
kafka.cluster.PartitionTest > testOffsetForLeaderEpochValidationForLeader STARTED
kafka.cluster.PartitionTest > testOffsetForLeaderEpochValidationForLeader PASSED
kafka.cluster.PartitionTest > testOffsetForLeaderEpochValidationForFollower STARTED
kafka.cluster.PartitionTest > testOffsetForLeaderEpochValidationForFollower PASSED
kafka.cluster.PartitionTest > testDelayedFetchAfterAppendRecords STARTED
kafka.cluster.PartitionTest > testDelayedFetchAfterAppendRecords PASSED
kafka.cluster.PartitionTest > testMakeLeaderUpdatesEpochCache STARTED
kafka.cluster.PartitionTest > testMakeLeaderUpdatesEpochCache PASSED
kafka.cluster.PartitionTest > testMaybeReplaceCurrentWithFutureReplicaDifferentBaseOffsets STARTED
kafka.cluster.PartitionTest > testMaybeReplaceCurrentWithFutureReplicaDifferentBaseOffsets PASSED
kafka.cluster.PartitionTest > testFetchOffsetForTimestampEpochValidationForLeader STARTED
kafka.cluster.PartitionTest > testFetchOffsetForTimestampEpochValidationForLeader PASSED
kafka.cluster.PartitionTest > testGetReplica STARTED
kafka.cluster.PartitionTest > testGetReplica PASSED
kafka.cluster.PartitionTest > testReadRecordEpochValidationForFollower STARTED
kafka.cluster.PartitionTest > testReadRecordEpochValidationForFollower PASSED
kafka.cluster.PartitionTest > testMaybeReplaceCurrentWithFutureReplica STARTED
kafka.cluster.PartitionTest > testMaybeReplaceCurrentWithFutureReplica PASSED
kafka.cluster.ReplicaTest > testCannotIncrementLogStartOffsetPastHighWatermark STARTED
kafka.cluster.ReplicaTest > testCannotIncrementLogStartOffsetPastHighWatermark PASSED
kafka.cluster.ReplicaTest > testSegmentDeletionWithHighWatermarkInitialization STARTED
kafka.cluster.ReplicaTest > testSegmentDeletionWithHighWatermarkInitialization PASSED
kafka.cluster.ReplicaTest > testCannotDeleteSegmentsAtOrAboveHighWatermark STARTED
kafka.cluster.ReplicaTest > testCannotDeleteSegmentsAtOrAboveHighWatermark PASSED
2277 tests completed, 1 failed, 4 skipped
> Task :kafka-2.2-jdk8:core:test FAILED
> Task :testScala_2_12 FAILED
FAILURE: Build failed with an exception.
* What went wrong:
Execution failed for task ':kafka-2.2-jdk8:core:test'.
> There were failing tests. See the report at: file://<https://builds.apache.org/job/kafka-2.2-jdk8/ws/core/build/reports/tests/test/index.html>
* Try:
Run with --stacktrace option to get the stack trace. Run with --info or --debug option to get more log output. Run with --scan to get full insights.
* Get more help at https://help.gradle.org
Deprecated Gradle features were used in this build, making it incompatible with Gradle 6.0.
Use '--warning-mode all' to show the individual deprecation warnings.
See https://docs.gradle.org/5.1.1/userguide/command_line_interface.html#sec:command_line_warnings
BUILD FAILED in 4h 2m 43s
139 actionable tasks: 114 executed, 25 up-to-date
Build step 'Execute shell' marked build as failure
[FINDBUGS] Collecting findbugs analysis files...
Setting GRADLE_4_8_1_HOME=/home/jenkins/tools/gradle/4.8.1
[FINDBUGS] Searching for all files in <https://builds.apache.org/job/kafka-2.2-jdk8/ws/> that match the pattern **/build/reports/findbugs/*.xml
[FINDBUGS] No files found. Configuration error?
Setting GRADLE_4_8_1_HOME=/home/jenkins/tools/gradle/4.8.1
No credentials specified
Setting GRADLE_4_8_1_HOME=/home/jenkins/tools/gradle/4.8.1
<Git Blamer> Using GitBlamer to create author and commit information for all warnings.
<Git Blamer> GIT_COMMIT=0779740f9b676af7704f8211b6929d161c1baa89, workspace=<https://builds.apache.org/job/kafka-2.2-jdk8/ws/>
[FINDBUGS] Computing warning deltas based on reference build #123
Recording test results
Setting GRADLE_4_8_1_HOME=/home/jenkins/tools/gradle/4.8.1
Setting GRADLE_4_8_1_HOME=/home/jenkins/tools/gradle/4.8.1
Jenkins build is back to normal : kafka-2.2-jdk8 #127
Posted by Apache Jenkins Server <je...@builds.apache.org>.
See <https://builds.apache.org/job/kafka-2.2-jdk8/127/display/redirect?page=changes>