You are viewing a plain text version of this content. The canonical link for it is here.
Posted to commits@beam.apache.org by Apache Jenkins Server <je...@builds.apache.org> on 2018/04/13 00:33:47 UTC
Build failed in Jenkins: beam_PerformanceTests_HadoopInputFormat
#134
See <https://builds.apache.org/job/beam_PerformanceTests_HadoopInputFormat/134/display/redirect?page=changes>
Changes:
[tgroh] Add a ModelCoders class for Coder Utilities
[tgroh] Use ModelCoders in LengthPrefixUnknownCoders
[tgroh] Format UrnUtils
[XuMingmin] [BEAM-3983] [SQL] Tables interface supports BigQuery (#4991)
[kedin] [SQL] Infer Row type from input elements
------------------------------------------
[...truncated 141.78 KB...]
[INFO] Excluding com.google.cloud.bigdataoss:gcsio:jar:1.4.5 from the shaded jar.
[INFO] Excluding com.google.apis:google-api-services-cloudresourcemanager:jar:v1-rev6-1.22.0 from the shaded jar.
[INFO] Excluding org.apache.beam:beam-sdks-java-io-google-cloud-platform:jar:2.5.0-SNAPSHOT from the shaded jar.
[INFO] Excluding org.apache.beam:beam-sdks-java-extensions-protobuf:jar:2.5.0-SNAPSHOT from the shaded jar.
[INFO] Excluding io.grpc:grpc-core:jar:1.2.0 from the shaded jar.
[INFO] Excluding com.google.errorprone:error_prone_annotations:jar:2.0.15 from the shaded jar.
[INFO] Excluding io.grpc:grpc-context:jar:1.2.0 from the shaded jar.
[INFO] Excluding com.google.instrumentation:instrumentation-api:jar:0.3.0 from the shaded jar.
[INFO] Excluding com.google.apis:google-api-services-bigquery:jar:v2-rev374-1.22.0 from the shaded jar.
[INFO] Excluding com.google.api:gax-grpc:jar:0.20.0 from the shaded jar.
[INFO] Excluding io.grpc:grpc-protobuf:jar:1.2.0 from the shaded jar.
[INFO] Excluding com.google.api:api-common:jar:1.0.0-rc2 from the shaded jar.
[INFO] Excluding com.google.api:gax:jar:1.3.1 from the shaded jar.
[INFO] Excluding org.threeten:threetenbp:jar:1.3.3 from the shaded jar.
[INFO] Excluding com.google.cloud:google-cloud-core-grpc:jar:1.2.0 from the shaded jar.
[INFO] Excluding com.google.apis:google-api-services-pubsub:jar:v1-rev10-1.22.0 from the shaded jar.
[INFO] Excluding com.google.api.grpc:grpc-google-cloud-pubsub-v1:jar:0.1.18 from the shaded jar.
[INFO] Excluding com.google.api.grpc:proto-google-cloud-pubsub-v1:jar:0.1.18 from the shaded jar.
[INFO] Excluding com.google.api.grpc:proto-google-iam-v1:jar:0.1.18 from the shaded jar.
[INFO] Excluding com.google.cloud.datastore:datastore-v1-proto-client:jar:1.4.0 from the shaded jar.
[INFO] Excluding com.google.http-client:google-http-client-protobuf:jar:1.22.0 from the shaded jar.
[INFO] Excluding com.google.http-client:google-http-client-jackson:jar:1.22.0 from the shaded jar.
[INFO] Excluding com.google.cloud.datastore:datastore-v1-protos:jar:1.3.0 from the shaded jar.
[INFO] Excluding com.google.api.grpc:grpc-google-common-protos:jar:0.1.9 from the shaded jar.
[INFO] Excluding io.grpc:grpc-auth:jar:1.2.0 from the shaded jar.
[INFO] Excluding io.grpc:grpc-netty:jar:1.2.0 from the shaded jar.
[INFO] Excluding io.netty:netty-codec-http2:jar:4.1.8.Final from the shaded jar.
[INFO] Excluding io.netty:netty-handler-proxy:jar:4.1.8.Final from the shaded jar.
[INFO] Excluding io.netty:netty-codec-socks:jar:4.1.8.Final from the shaded jar.
[INFO] Excluding io.grpc:grpc-stub:jar:1.2.0 from the shaded jar.
[INFO] Excluding com.google.cloud:google-cloud-core:jar:1.0.2 from the shaded jar.
[INFO] Excluding org.json:json:jar:20160810 from the shaded jar.
[INFO] Excluding com.google.cloud:google-cloud-spanner:jar:0.20.0b-beta from the shaded jar.
[INFO] Excluding com.google.api.grpc:proto-google-cloud-spanner-v1:jar:0.1.11b from the shaded jar.
[INFO] Excluding com.google.api.grpc:proto-google-cloud-spanner-admin-instance-v1:jar:0.1.11 from the shaded jar.
[INFO] Excluding com.google.api.grpc:grpc-google-cloud-spanner-v1:jar:0.1.11b from the shaded jar.
[INFO] Excluding com.google.api.grpc:grpc-google-cloud-spanner-admin-database-v1:jar:0.1.11 from the shaded jar.
[INFO] Excluding com.google.api.grpc:grpc-google-cloud-spanner-admin-instance-v1:jar:0.1.11 from the shaded jar.
[INFO] Excluding com.google.api.grpc:grpc-google-longrunning-v1:jar:0.1.11 from the shaded jar.
[INFO] Excluding com.google.api.grpc:proto-google-longrunning-v1:jar:0.1.11 from the shaded jar.
[INFO] Excluding com.google.cloud.bigtable:bigtable-protos:jar:1.0.0-pre3 from the shaded jar.
[INFO] Excluding com.google.cloud.bigtable:bigtable-client-core:jar:1.0.0 from the shaded jar.
[INFO] Excluding com.google.auth:google-auth-library-appengine:jar:0.7.0 from the shaded jar.
[INFO] Excluding io.opencensus:opencensus-contrib-grpc-util:jar:0.7.0 from the shaded jar.
[INFO] Excluding io.opencensus:opencensus-api:jar:0.7.0 from the shaded jar.
[INFO] Excluding com.google.api.grpc:proto-google-cloud-spanner-admin-database-v1:jar:0.1.9 from the shaded jar.
[INFO] Excluding com.google.api.grpc:proto-google-common-protos:jar:0.1.9 from the shaded jar.
[INFO] Excluding io.grpc:grpc-all:jar:1.2.0 from the shaded jar.
[INFO] Excluding io.grpc:grpc-okhttp:jar:1.2.0 from the shaded jar.
[INFO] Excluding com.squareup.okhttp:okhttp:jar:2.5.0 from the shaded jar.
[INFO] Excluding com.squareup.okio:okio:jar:1.6.0 from the shaded jar.
[INFO] Excluding io.grpc:grpc-protobuf-lite:jar:1.2.0 from the shaded jar.
[INFO] Excluding io.grpc:grpc-protobuf-nano:jar:1.2.0 from the shaded jar.
[INFO] Excluding com.google.protobuf.nano:protobuf-javanano:jar:3.0.0-alpha-5 from the shaded jar.
[INFO] Excluding io.netty:netty-tcnative-boringssl-static:jar:1.1.33.Fork26 from the shaded jar.
[INFO] Excluding org.apache.beam:beam-runners-core-construction-java:jar:2.5.0-SNAPSHOT from the shaded jar.
[INFO] Excluding org.apache.beam:beam-model-job-management:jar:2.5.0-SNAPSHOT from the shaded jar.
[INFO] Excluding com.google.protobuf:protobuf-java-util:jar:3.2.0 from the shaded jar.
[INFO] Excluding com.google.api-client:google-api-client:jar:1.22.0 from the shaded jar.
[INFO] Excluding com.google.oauth-client:google-oauth-client:jar:1.22.0 from the shaded jar.
[INFO] Excluding com.google.http-client:google-http-client:jar:1.22.0 from the shaded jar.
[INFO] Excluding com.google.http-client:google-http-client-jackson2:jar:1.22.0 from the shaded jar.
[INFO] Excluding com.google.apis:google-api-services-dataflow:jar:v1b3-rev221-1.22.0 from the shaded jar.
[INFO] Excluding com.google.apis:google-api-services-clouddebugger:jar:v2-rev8-1.22.0 from the shaded jar.
[INFO] Excluding com.google.apis:google-api-services-storage:jar:v1-rev71-1.22.0 from the shaded jar.
[INFO] Excluding com.google.auth:google-auth-library-credentials:jar:0.7.1 from the shaded jar.
[INFO] Excluding com.google.auth:google-auth-library-oauth2-http:jar:0.7.1 from the shaded jar.
[INFO] Excluding com.google.cloud.bigdataoss:util:jar:1.4.5 from the shaded jar.
[INFO] Excluding com.google.api-client:google-api-client-java6:jar:1.22.0 from the shaded jar.
[INFO] Excluding com.google.api-client:google-api-client-jackson2:jar:1.22.0 from the shaded jar.
[INFO] Excluding com.google.oauth-client:google-oauth-client-java6:jar:1.22.0 from the shaded jar.
[INFO] Replacing original artifact with shaded artifact.
[INFO] Replacing <https://builds.apache.org/job/beam_PerformanceTests_HadoopInputFormat/ws/runs/295f0d42/beam/sdks/java/io/hadoop-input-format/target/beam-sdks-java-io-hadoop-input-format-2.5.0-SNAPSHOT.jar> with <https://builds.apache.org/job/beam_PerformanceTests_HadoopInputFormat/ws/runs/295f0d42/beam/sdks/java/io/hadoop-input-format/target/beam-sdks-java-io-hadoop-input-format-2.5.0-SNAPSHOT-shaded.jar>
[INFO] Replacing original test artifact with shaded test artifact.
[INFO] Replacing <https://builds.apache.org/job/beam_PerformanceTests_HadoopInputFormat/ws/runs/295f0d42/beam/sdks/java/io/hadoop-input-format/target/beam-sdks-java-io-hadoop-input-format-2.5.0-SNAPSHOT-tests.jar> with <https://builds.apache.org/job/beam_PerformanceTests_HadoopInputFormat/ws/runs/295f0d42/beam/sdks/java/io/hadoop-input-format/target/beam-sdks-java-io-hadoop-input-format-2.5.0-SNAPSHOT-shaded-tests.jar>
[INFO] Dependency-reduced POM written at: <https://builds.apache.org/job/beam_PerformanceTests_HadoopInputFormat/ws/runs/295f0d42/beam/sdks/java/io/hadoop-input-format/dependency-reduced-pom.xml>
[INFO]
[INFO] --- maven-failsafe-plugin:2.21.0:integration-test (default) @ beam-sdks-java-io-hadoop-input-format ---
[INFO] Failsafe report directory: <https://builds.apache.org/job/beam_PerformanceTests_HadoopInputFormat/ws/runs/295f0d42/beam/sdks/java/io/hadoop-input-format/target/failsafe-reports>
[INFO] parallel='all', perCoreThreadCount=true, threadCount=4, useUnlimitedThreads=false, threadCountSuites=0, threadCountClasses=0, threadCountMethods=0, parallelOptimized=true
[INFO]
[INFO] -------------------------------------------------------
[INFO] T E S T S
[INFO] -------------------------------------------------------
[INFO] Running org.apache.beam.sdk.io.hadoop.inputformat.HadoopInputFormatIOIT
[ERROR] Tests run: 1, Failures: 0, Errors: 1, Skipped: 0, Time elapsed: 1.94 s <<< FAILURE! - in org.apache.beam.sdk.io.hadoop.inputformat.HadoopInputFormatIOIT
[ERROR] readUsingHadoopInputFormat(org.apache.beam.sdk.io.hadoop.inputformat.HadoopInputFormatIOIT) Time elapsed: 1.94 s <<< ERROR!
java.lang.NoSuchMethodError: com.google.common.base.Preconditions.checkArgument(ZLjava/lang/String;Ljava/lang/Object;Ljava/lang/Object;)V
at org.apache.beam.runners.core.construction.PTransformReplacements.getSingletonMainInput(PTransformReplacements.java:50)
at org.apache.beam.runners.core.construction.PTransformReplacements.getSingletonMainInput(PTransformReplacements.java:41)
at org.apache.beam.runners.dataflow.ReshuffleOverrideFactory.getReplacementTransform(ReshuffleOverrideFactory.java:53)
at org.apache.beam.sdk.Pipeline.applyReplacement(Pipeline.java:552)
at org.apache.beam.sdk.Pipeline.replace(Pipeline.java:288)
at org.apache.beam.sdk.Pipeline.replaceAll(Pipeline.java:209)
at org.apache.beam.runners.dataflow.DataflowRunner.replaceTransforms(DataflowRunner.java:865)
at org.apache.beam.runners.dataflow.DataflowRunner.run(DataflowRunner.java:656)
at org.apache.beam.runners.dataflow.TestDataflowRunner.run(TestDataflowRunner.java:98)
at org.apache.beam.runners.dataflow.TestDataflowRunner.run(TestDataflowRunner.java:90)
at org.apache.beam.runners.dataflow.TestDataflowRunner.run(TestDataflowRunner.java:55)
at org.apache.beam.sdk.Pipeline.run(Pipeline.java:311)
at org.apache.beam.sdk.testing.TestPipeline.run(TestPipeline.java:346)
at org.apache.beam.sdk.testing.TestPipeline.run(TestPipeline.java:328)
at org.apache.beam.sdk.io.hadoop.inputformat.HadoopInputFormatIOIT.readUsingHadoopInputFormat(HadoopInputFormatIOIT.java:134)
at sun.reflect.NativeMethodAccessorImpl.invoke0(Native Method)
at sun.reflect.NativeMethodAccessorImpl.invoke(NativeMethodAccessorImpl.java:62)
at sun.reflect.DelegatingMethodAccessorImpl.invoke(DelegatingMethodAccessorImpl.java:43)
at java.lang.reflect.Method.invoke(Method.java:498)
at org.junit.runners.model.FrameworkMethod$1.runReflectiveCall(FrameworkMethod.java:50)
at org.junit.internal.runners.model.ReflectiveCallable.run(ReflectiveCallable.java:12)
at org.junit.runners.model.FrameworkMethod.invokeExplosively(FrameworkMethod.java:47)
at org.junit.internal.runners.statements.InvokeMethod.evaluate(InvokeMethod.java:17)
at org.apache.beam.sdk.testing.TestPipeline$1.evaluate(TestPipeline.java:317)
at org.apache.beam.sdk.testing.TestPipeline$1.evaluate(TestPipeline.java:317)
at org.junit.rules.RunRules.evaluate(RunRules.java:20)
at org.junit.runners.ParentRunner.runLeaf(ParentRunner.java:325)
at org.junit.runners.BlockJUnit4ClassRunner.runChild(BlockJUnit4ClassRunner.java:78)
at org.junit.runners.BlockJUnit4ClassRunner.runChild(BlockJUnit4ClassRunner.java:57)
at org.junit.runners.ParentRunner$3.run(ParentRunner.java:290)
at org.apache.maven.surefire.junitcore.pc.Scheduler$1.run(Scheduler.java:410)
at java.util.concurrent.Executors$RunnableAdapter.call(Executors.java:511)
at java.util.concurrent.FutureTask.run(FutureTask.java:266)
at java.util.concurrent.ThreadPoolExecutor.runWorker(ThreadPoolExecutor.java:1149)
at java.util.concurrent.ThreadPoolExecutor$Worker.run(ThreadPoolExecutor.java:624)
at java.lang.Thread.run(Thread.java:748)
[INFO]
[INFO] Results:
[INFO]
[ERROR] Errors:
[ERROR] HadoopInputFormatIOIT.readUsingHadoopInputFormat:134 NoSuchMethod com.google...
[INFO]
[ERROR] Tests run: 1, Failures: 0, Errors: 1, Skipped: 0
[INFO]
[INFO]
[INFO] --- maven-dependency-plugin:3.0.2:analyze-only (default) @ beam-sdks-java-io-hadoop-input-format ---
[INFO] No dependency problems found
[INFO]
[INFO] --- maven-failsafe-plugin:2.21.0:verify (default) @ beam-sdks-java-io-hadoop-input-format ---
[INFO] Failsafe report directory: <https://builds.apache.org/job/beam_PerformanceTests_HadoopInputFormat/ws/runs/295f0d42/beam/sdks/java/io/hadoop-input-format/target/failsafe-reports>
[INFO] ------------------------------------------------------------------------
[INFO] BUILD FAILURE
[INFO] ------------------------------------------------------------------------
[INFO] Total time: 35.737 s
[INFO] Finished at: 2018-04-13T00:33:45Z
[INFO] Final Memory: 129M/1478M
[INFO] ------------------------------------------------------------------------
[ERROR] Failed to execute goal org.apache.maven.plugins:maven-failsafe-plugin:2.21.0:verify (default) on project beam-sdks-java-io-hadoop-input-format: There are test failures.
[ERROR]
[ERROR] Please refer to <https://builds.apache.org/job/beam_PerformanceTests_HadoopInputFormat/ws/runs/295f0d42/beam/sdks/java/io/hadoop-input-format/target/failsafe-reports> for the individual test results.
[ERROR] Please refer to dump files (if any exist) [date]-jvmRun[N].dump, [date].dumpstream and [date]-jvmRun[N].dumpstream.
[ERROR] -> [Help 1]
org.apache.maven.lifecycle.LifecycleExecutionException: Failed to execute goal org.apache.maven.plugins:maven-failsafe-plugin:2.21.0:verify (default) on project beam-sdks-java-io-hadoop-input-format: There are test failures.
Please refer to <https://builds.apache.org/job/beam_PerformanceTests_HadoopInputFormat/ws/runs/295f0d42/beam/sdks/java/io/hadoop-input-format/target/failsafe-reports> for the individual test results.
Please refer to dump files (if any exist) [date]-jvmRun[N].dump, [date].dumpstream and [date]-jvmRun[N].dumpstream.
at org.apache.maven.lifecycle.internal.MojoExecutor.execute (MojoExecutor.java:213)
at org.apache.maven.lifecycle.internal.MojoExecutor.execute (MojoExecutor.java:154)
at org.apache.maven.lifecycle.internal.MojoExecutor.execute (MojoExecutor.java:146)
at org.apache.maven.lifecycle.internal.LifecycleModuleBuilder.buildProject (LifecycleModuleBuilder.java:117)
at org.apache.maven.lifecycle.internal.LifecycleModuleBuilder.buildProject (LifecycleModuleBuilder.java:81)
at org.apache.maven.lifecycle.internal.builder.singlethreaded.SingleThreadedBuilder.build (SingleThreadedBuilder.java:51)
at org.apache.maven.lifecycle.internal.LifecycleStarter.execute (LifecycleStarter.java:128)
at org.apache.maven.DefaultMaven.doExecute (DefaultMaven.java:309)
at org.apache.maven.DefaultMaven.doExecute (DefaultMaven.java:194)
at org.apache.maven.DefaultMaven.execute (DefaultMaven.java:107)
at org.apache.maven.cli.MavenCli.execute (MavenCli.java:955)
at org.apache.maven.cli.MavenCli.doMain (MavenCli.java:290)
at org.apache.maven.cli.MavenCli.main (MavenCli.java:194)
at sun.reflect.NativeMethodAccessorImpl.invoke0 (Native Method)
at sun.reflect.NativeMethodAccessorImpl.invoke (NativeMethodAccessorImpl.java:62)
at sun.reflect.DelegatingMethodAccessorImpl.invoke (DelegatingMethodAccessorImpl.java:43)
at java.lang.reflect.Method.invoke (Method.java:498)
at org.codehaus.plexus.classworlds.launcher.Launcher.launchEnhanced (Launcher.java:289)
at org.codehaus.plexus.classworlds.launcher.Launcher.launch (Launcher.java:229)
at org.codehaus.plexus.classworlds.launcher.Launcher.mainWithExitCode (Launcher.java:415)
at org.codehaus.plexus.classworlds.launcher.Launcher.main (Launcher.java:356)
Caused by: org.apache.maven.plugin.MojoFailureException: There are test failures.
Please refer to <https://builds.apache.org/job/beam_PerformanceTests_HadoopInputFormat/ws/runs/295f0d42/beam/sdks/java/io/hadoop-input-format/target/failsafe-reports> for the individual test results.
Please refer to dump files (if any exist) [date]-jvmRun[N].dump, [date].dumpstream and [date]-jvmRun[N].dumpstream.
at org.apache.maven.plugin.surefire.SurefireHelper.throwException (SurefireHelper.java:240)
at org.apache.maven.plugin.surefire.SurefireHelper.reportExecution (SurefireHelper.java:112)
at org.apache.maven.plugin.failsafe.VerifyMojo.execute (VerifyMojo.java:192)
at org.apache.maven.plugin.DefaultBuildPluginManager.executeMojo (DefaultBuildPluginManager.java:134)
at org.apache.maven.lifecycle.internal.MojoExecutor.execute (MojoExecutor.java:208)
at org.apache.maven.lifecycle.internal.MojoExecutor.execute (MojoExecutor.java:154)
at org.apache.maven.lifecycle.internal.MojoExecutor.execute (MojoExecutor.java:146)
at org.apache.maven.lifecycle.internal.LifecycleModuleBuilder.buildProject (LifecycleModuleBuilder.java:117)
at org.apache.maven.lifecycle.internal.LifecycleModuleBuilder.buildProject (LifecycleModuleBuilder.java:81)
at org.apache.maven.lifecycle.internal.builder.singlethreaded.SingleThreadedBuilder.build (SingleThreadedBuilder.java:51)
at org.apache.maven.lifecycle.internal.LifecycleStarter.execute (LifecycleStarter.java:128)
at org.apache.maven.DefaultMaven.doExecute (DefaultMaven.java:309)
at org.apache.maven.DefaultMaven.doExecute (DefaultMaven.java:194)
at org.apache.maven.DefaultMaven.execute (DefaultMaven.java:107)
at org.apache.maven.cli.MavenCli.execute (MavenCli.java:955)
at org.apache.maven.cli.MavenCli.doMain (MavenCli.java:290)
at org.apache.maven.cli.MavenCli.main (MavenCli.java:194)
at sun.reflect.NativeMethodAccessorImpl.invoke0 (Native Method)
at sun.reflect.NativeMethodAccessorImpl.invoke (NativeMethodAccessorImpl.java:62)
at sun.reflect.DelegatingMethodAccessorImpl.invoke (DelegatingMethodAccessorImpl.java:43)
at java.lang.reflect.Method.invoke (Method.java:498)
at org.codehaus.plexus.classworlds.launcher.Launcher.launchEnhanced (Launcher.java:289)
at org.codehaus.plexus.classworlds.launcher.Launcher.launch (Launcher.java:229)
at org.codehaus.plexus.classworlds.launcher.Launcher.mainWithExitCode (Launcher.java:415)
at org.codehaus.plexus.classworlds.launcher.Launcher.main (Launcher.java:356)
[ERROR]
[ERROR] Re-run Maven using the -X switch to enable full debug logging.
[ERROR]
[ERROR] For more information about the errors and possible solutions, please read the following articles:
[ERROR] [Help 1] http://cwiki.apache.org/confluence/display/MAVEN/MojoFailureException
STDERR:
2018-04-13 00:33:45,919 295f0d42 MainThread beam_integration_benchmark(1/1) ERROR Error during benchmark beam_integration_benchmark
Traceback (most recent call last):
File "<https://builds.apache.org/job/beam_PerformanceTests_HadoopInputFormat/ws/PerfKitBenchmarker/perfkitbenchmarker/pkb.py",> line 623, in RunBenchmark
DoRunPhase(spec, collector, detailed_timer)
File "<https://builds.apache.org/job/beam_PerformanceTests_HadoopInputFormat/ws/PerfKitBenchmarker/perfkitbenchmarker/pkb.py",> line 526, in DoRunPhase
samples = spec.BenchmarkRun(spec)
File "<https://builds.apache.org/job/beam_PerformanceTests_HadoopInputFormat/ws/PerfKitBenchmarker/perfkitbenchmarker/linux_benchmarks/beam_integration_benchmark.py",> line 159, in Run
job_type=job_type)
File "<https://builds.apache.org/job/beam_PerformanceTests_HadoopInputFormat/ws/PerfKitBenchmarker/perfkitbenchmarker/providers/gcp/gcp_dpb_dataflow.py",> line 90, in SubmitJob
assert retcode == 0, "Integration Test Failed."
AssertionError: Integration Test Failed.
2018-04-13 00:33:45,920 295f0d42 MainThread beam_integration_benchmark(1/1) INFO Cleaning up benchmark beam_integration_benchmark
2018-04-13 00:33:45,920 295f0d42 MainThread beam_integration_benchmark(1/1) INFO Running: kubectl --kubeconfig=<https://builds.apache.org/job/beam_PerformanceTests_HadoopInputFormat/ws/config-hadoopinputformatioit-1523563299822> delete -f <https://builds.apache.org/job/beam_PerformanceTests_HadoopInputFormat/ws/src/.test-infra/kubernetes/postgres/postgres-service-for-local-dev.yml>
2018-04-13 00:33:46,258 295f0d42 MainThread beam_integration_benchmark(1/1) ERROR Exception running benchmark
Traceback (most recent call last):
File "<https://builds.apache.org/job/beam_PerformanceTests_HadoopInputFormat/ws/PerfKitBenchmarker/perfkitbenchmarker/pkb.py",> line 757, in RunBenchmarkTask
RunBenchmark(spec, collector)
File "<https://builds.apache.org/job/beam_PerformanceTests_HadoopInputFormat/ws/PerfKitBenchmarker/perfkitbenchmarker/pkb.py",> line 623, in RunBenchmark
DoRunPhase(spec, collector, detailed_timer)
File "<https://builds.apache.org/job/beam_PerformanceTests_HadoopInputFormat/ws/PerfKitBenchmarker/perfkitbenchmarker/pkb.py",> line 526, in DoRunPhase
samples = spec.BenchmarkRun(spec)
File "<https://builds.apache.org/job/beam_PerformanceTests_HadoopInputFormat/ws/PerfKitBenchmarker/perfkitbenchmarker/linux_benchmarks/beam_integration_benchmark.py",> line 159, in Run
job_type=job_type)
File "<https://builds.apache.org/job/beam_PerformanceTests_HadoopInputFormat/ws/PerfKitBenchmarker/perfkitbenchmarker/providers/gcp/gcp_dpb_dataflow.py",> line 90, in SubmitJob
assert retcode == 0, "Integration Test Failed."
AssertionError: Integration Test Failed.
2018-04-13 00:33:46,259 295f0d42 MainThread beam_integration_benchmark(1/1) ERROR Benchmark 1/1 beam_integration_benchmark (UID: beam_integration_benchmark0) failed. Execution will continue.
2018-04-13 00:33:46,314 295f0d42 MainThread INFO Benchmark run statuses:
---------------------------------------------------------------------------------
Name UID Status Failed Substatus
---------------------------------------------------------------------------------
beam_integration_benchmark beam_integration_benchmark0 FAILED
---------------------------------------------------------------------------------
Success rate: 0.00% (0/1)
2018-04-13 00:33:46,315 295f0d42 MainThread INFO Complete logs can be found at: <https://builds.apache.org/job/beam_PerformanceTests_HadoopInputFormat/ws/runs/295f0d42/pkb.log>
2018-04-13 00:33:46,315 295f0d42 MainThread INFO Completion statuses can be found at: <https://builds.apache.org/job/beam_PerformanceTests_HadoopInputFormat/ws/runs/295f0d42/completion_statuses.json>
Build step 'Execute shell' marked build as failure
Jenkins build is back to normal :
beam_PerformanceTests_HadoopInputFormat #140
Posted by Apache Jenkins Server <je...@builds.apache.org>.
See <https://builds.apache.org/job/beam_PerformanceTests_HadoopInputFormat/140/display/redirect>
Build failed in Jenkins: beam_PerformanceTests_HadoopInputFormat
#139
Posted by Apache Jenkins Server <je...@builds.apache.org>.
See <https://builds.apache.org/job/beam_PerformanceTests_HadoopInputFormat/139/display/redirect?page=changes>
Changes:
[altay] Cythonize DistributionAccumulator
------------------------------------------
[...truncated 101.91 KB...]
[INFO] Excluding com.google.cloud.bigdataoss:gcsio:jar:1.4.5 from the shaded jar.
[INFO] Excluding com.google.apis:google-api-services-cloudresourcemanager:jar:v1-rev6-1.22.0 from the shaded jar.
[INFO] Excluding org.apache.beam:beam-sdks-java-io-google-cloud-platform:jar:2.5.0-SNAPSHOT from the shaded jar.
[INFO] Excluding org.apache.beam:beam-sdks-java-extensions-protobuf:jar:2.5.0-SNAPSHOT from the shaded jar.
[INFO] Excluding io.grpc:grpc-core:jar:1.2.0 from the shaded jar.
[INFO] Excluding com.google.errorprone:error_prone_annotations:jar:2.0.15 from the shaded jar.
[INFO] Excluding io.grpc:grpc-context:jar:1.2.0 from the shaded jar.
[INFO] Excluding com.google.instrumentation:instrumentation-api:jar:0.3.0 from the shaded jar.
[INFO] Excluding com.google.apis:google-api-services-bigquery:jar:v2-rev374-1.22.0 from the shaded jar.
[INFO] Excluding com.google.api:gax-grpc:jar:0.20.0 from the shaded jar.
[INFO] Excluding io.grpc:grpc-protobuf:jar:1.2.0 from the shaded jar.
[INFO] Excluding com.google.api:api-common:jar:1.0.0-rc2 from the shaded jar.
[INFO] Excluding com.google.api:gax:jar:1.3.1 from the shaded jar.
[INFO] Excluding org.threeten:threetenbp:jar:1.3.3 from the shaded jar.
[INFO] Excluding com.google.cloud:google-cloud-core-grpc:jar:1.2.0 from the shaded jar.
[INFO] Excluding com.google.apis:google-api-services-pubsub:jar:v1-rev10-1.22.0 from the shaded jar.
[INFO] Excluding com.google.api.grpc:grpc-google-cloud-pubsub-v1:jar:0.1.18 from the shaded jar.
[INFO] Excluding com.google.api.grpc:proto-google-cloud-pubsub-v1:jar:0.1.18 from the shaded jar.
[INFO] Excluding com.google.api.grpc:proto-google-iam-v1:jar:0.1.18 from the shaded jar.
[INFO] Excluding com.google.cloud.datastore:datastore-v1-proto-client:jar:1.4.0 from the shaded jar.
[INFO] Excluding com.google.http-client:google-http-client-protobuf:jar:1.22.0 from the shaded jar.
[INFO] Excluding com.google.http-client:google-http-client-jackson:jar:1.22.0 from the shaded jar.
[INFO] Excluding com.google.cloud.datastore:datastore-v1-protos:jar:1.3.0 from the shaded jar.
[INFO] Excluding com.google.api.grpc:grpc-google-common-protos:jar:0.1.9 from the shaded jar.
[INFO] Excluding io.grpc:grpc-auth:jar:1.2.0 from the shaded jar.
[INFO] Excluding io.grpc:grpc-netty:jar:1.2.0 from the shaded jar.
[INFO] Excluding io.netty:netty-codec-http2:jar:4.1.8.Final from the shaded jar.
[INFO] Excluding io.netty:netty-handler-proxy:jar:4.1.8.Final from the shaded jar.
[INFO] Excluding io.netty:netty-codec-socks:jar:4.1.8.Final from the shaded jar.
[INFO] Excluding io.grpc:grpc-stub:jar:1.2.0 from the shaded jar.
[INFO] Excluding com.google.cloud:google-cloud-core:jar:1.0.2 from the shaded jar.
[INFO] Excluding org.json:json:jar:20160810 from the shaded jar.
[INFO] Excluding com.google.cloud:google-cloud-spanner:jar:0.20.0b-beta from the shaded jar.
[INFO] Excluding com.google.api.grpc:proto-google-cloud-spanner-v1:jar:0.1.11b from the shaded jar.
[INFO] Excluding com.google.api.grpc:proto-google-cloud-spanner-admin-instance-v1:jar:0.1.11 from the shaded jar.
[INFO] Excluding com.google.api.grpc:grpc-google-cloud-spanner-v1:jar:0.1.11b from the shaded jar.
[INFO] Excluding com.google.api.grpc:grpc-google-cloud-spanner-admin-database-v1:jar:0.1.11 from the shaded jar.
[INFO] Excluding com.google.api.grpc:grpc-google-cloud-spanner-admin-instance-v1:jar:0.1.11 from the shaded jar.
[INFO] Excluding com.google.api.grpc:grpc-google-longrunning-v1:jar:0.1.11 from the shaded jar.
[INFO] Excluding com.google.api.grpc:proto-google-longrunning-v1:jar:0.1.11 from the shaded jar.
[INFO] Excluding com.google.cloud.bigtable:bigtable-protos:jar:1.0.0-pre3 from the shaded jar.
[INFO] Excluding com.google.cloud.bigtable:bigtable-client-core:jar:1.0.0 from the shaded jar.
[INFO] Excluding com.google.auth:google-auth-library-appengine:jar:0.7.0 from the shaded jar.
[INFO] Excluding io.opencensus:opencensus-contrib-grpc-util:jar:0.7.0 from the shaded jar.
[INFO] Excluding io.opencensus:opencensus-api:jar:0.7.0 from the shaded jar.
[INFO] Excluding com.google.api.grpc:proto-google-cloud-spanner-admin-database-v1:jar:0.1.9 from the shaded jar.
[INFO] Excluding com.google.api.grpc:proto-google-common-protos:jar:0.1.9 from the shaded jar.
[INFO] Excluding io.grpc:grpc-all:jar:1.2.0 from the shaded jar.
[INFO] Excluding io.grpc:grpc-okhttp:jar:1.2.0 from the shaded jar.
[INFO] Excluding com.squareup.okhttp:okhttp:jar:2.5.0 from the shaded jar.
[INFO] Excluding com.squareup.okio:okio:jar:1.6.0 from the shaded jar.
[INFO] Excluding io.grpc:grpc-protobuf-lite:jar:1.2.0 from the shaded jar.
[INFO] Excluding io.grpc:grpc-protobuf-nano:jar:1.2.0 from the shaded jar.
[INFO] Excluding com.google.protobuf.nano:protobuf-javanano:jar:3.0.0-alpha-5 from the shaded jar.
[INFO] Excluding io.netty:netty-tcnative-boringssl-static:jar:1.1.33.Fork26 from the shaded jar.
[INFO] Excluding org.apache.beam:beam-runners-core-construction-java:jar:2.5.0-SNAPSHOT from the shaded jar.
[INFO] Excluding org.apache.beam:beam-model-job-management:jar:2.5.0-SNAPSHOT from the shaded jar.
[INFO] Excluding com.google.protobuf:protobuf-java-util:jar:3.2.0 from the shaded jar.
[INFO] Excluding com.google.api-client:google-api-client:jar:1.22.0 from the shaded jar.
[INFO] Excluding com.google.oauth-client:google-oauth-client:jar:1.22.0 from the shaded jar.
[INFO] Excluding com.google.http-client:google-http-client:jar:1.22.0 from the shaded jar.
[INFO] Excluding com.google.http-client:google-http-client-jackson2:jar:1.22.0 from the shaded jar.
[INFO] Excluding com.google.apis:google-api-services-dataflow:jar:v1b3-rev221-1.22.0 from the shaded jar.
[INFO] Excluding com.google.apis:google-api-services-clouddebugger:jar:v2-rev8-1.22.0 from the shaded jar.
[INFO] Excluding com.google.apis:google-api-services-storage:jar:v1-rev71-1.22.0 from the shaded jar.
[INFO] Excluding com.google.auth:google-auth-library-credentials:jar:0.7.1 from the shaded jar.
[INFO] Excluding com.google.auth:google-auth-library-oauth2-http:jar:0.7.1 from the shaded jar.
[INFO] Excluding com.google.cloud.bigdataoss:util:jar:1.4.5 from the shaded jar.
[INFO] Excluding com.google.api-client:google-api-client-java6:jar:1.22.0 from the shaded jar.
[INFO] Excluding com.google.api-client:google-api-client-jackson2:jar:1.22.0 from the shaded jar.
[INFO] Excluding com.google.oauth-client:google-oauth-client-java6:jar:1.22.0 from the shaded jar.
[INFO] Replacing original artifact with shaded artifact.
[INFO] Replacing <https://builds.apache.org/job/beam_PerformanceTests_HadoopInputFormat/ws/runs/2a718993/beam/sdks/java/io/hadoop-input-format/target/beam-sdks-java-io-hadoop-input-format-2.5.0-SNAPSHOT.jar> with <https://builds.apache.org/job/beam_PerformanceTests_HadoopInputFormat/ws/runs/2a718993/beam/sdks/java/io/hadoop-input-format/target/beam-sdks-java-io-hadoop-input-format-2.5.0-SNAPSHOT-shaded.jar>
[INFO] Replacing original test artifact with shaded test artifact.
[INFO] Replacing <https://builds.apache.org/job/beam_PerformanceTests_HadoopInputFormat/ws/runs/2a718993/beam/sdks/java/io/hadoop-input-format/target/beam-sdks-java-io-hadoop-input-format-2.5.0-SNAPSHOT-tests.jar> with <https://builds.apache.org/job/beam_PerformanceTests_HadoopInputFormat/ws/runs/2a718993/beam/sdks/java/io/hadoop-input-format/target/beam-sdks-java-io-hadoop-input-format-2.5.0-SNAPSHOT-shaded-tests.jar>
[INFO] Dependency-reduced POM written at: <https://builds.apache.org/job/beam_PerformanceTests_HadoopInputFormat/ws/runs/2a718993/beam/sdks/java/io/hadoop-input-format/dependency-reduced-pom.xml>
[INFO]
[INFO] --- maven-failsafe-plugin:2.21.0:integration-test (default) @ beam-sdks-java-io-hadoop-input-format ---
[INFO] Failsafe report directory: <https://builds.apache.org/job/beam_PerformanceTests_HadoopInputFormat/ws/runs/2a718993/beam/sdks/java/io/hadoop-input-format/target/failsafe-reports>
[INFO] parallel='all', perCoreThreadCount=true, threadCount=4, useUnlimitedThreads=false, threadCountSuites=0, threadCountClasses=0, threadCountMethods=0, parallelOptimized=true
[INFO]
[INFO] -------------------------------------------------------
[INFO] T E S T S
[INFO] -------------------------------------------------------
[INFO] Running org.apache.beam.sdk.io.hadoop.inputformat.HadoopInputFormatIOIT
[ERROR] Tests run: 1, Failures: 0, Errors: 1, Skipped: 0, Time elapsed: 3.956 s <<< FAILURE! - in org.apache.beam.sdk.io.hadoop.inputformat.HadoopInputFormatIOIT
[ERROR] readUsingHadoopInputFormat(org.apache.beam.sdk.io.hadoop.inputformat.HadoopInputFormatIOIT) Time elapsed: 3.956 s <<< ERROR!
java.lang.NoSuchMethodError: com.google.common.base.Preconditions.checkArgument(ZLjava/lang/String;Ljava/lang/Object;Ljava/lang/Object;)V
at org.apache.beam.runners.core.construction.PTransformReplacements.getSingletonMainInput(PTransformReplacements.java:50)
at org.apache.beam.runners.core.construction.PTransformReplacements.getSingletonMainInput(PTransformReplacements.java:41)
at org.apache.beam.runners.dataflow.ReshuffleOverrideFactory.getReplacementTransform(ReshuffleOverrideFactory.java:53)
at org.apache.beam.sdk.Pipeline.applyReplacement(Pipeline.java:552)
at org.apache.beam.sdk.Pipeline.replace(Pipeline.java:288)
at org.apache.beam.sdk.Pipeline.replaceAll(Pipeline.java:209)
at org.apache.beam.runners.dataflow.DataflowRunner.replaceTransforms(DataflowRunner.java:865)
at org.apache.beam.runners.dataflow.DataflowRunner.run(DataflowRunner.java:656)
at org.apache.beam.runners.dataflow.TestDataflowRunner.run(TestDataflowRunner.java:98)
at org.apache.beam.runners.dataflow.TestDataflowRunner.run(TestDataflowRunner.java:90)
at org.apache.beam.runners.dataflow.TestDataflowRunner.run(TestDataflowRunner.java:55)
at org.apache.beam.sdk.Pipeline.run(Pipeline.java:311)
at org.apache.beam.sdk.testing.TestPipeline.run(TestPipeline.java:346)
at org.apache.beam.sdk.testing.TestPipeline.run(TestPipeline.java:328)
at org.apache.beam.sdk.io.hadoop.inputformat.HadoopInputFormatIOIT.readUsingHadoopInputFormat(HadoopInputFormatIOIT.java:134)
at sun.reflect.NativeMethodAccessorImpl.invoke0(Native Method)
at sun.reflect.NativeMethodAccessorImpl.invoke(NativeMethodAccessorImpl.java:62)
at sun.reflect.DelegatingMethodAccessorImpl.invoke(DelegatingMethodAccessorImpl.java:43)
at java.lang.reflect.Method.invoke(Method.java:498)
at org.junit.runners.model.FrameworkMethod$1.runReflectiveCall(FrameworkMethod.java:50)
at org.junit.internal.runners.model.ReflectiveCallable.run(ReflectiveCallable.java:12)
at org.junit.runners.model.FrameworkMethod.invokeExplosively(FrameworkMethod.java:47)
at org.junit.internal.runners.statements.InvokeMethod.evaluate(InvokeMethod.java:17)
at org.apache.beam.sdk.testing.TestPipeline$1.evaluate(TestPipeline.java:317)
at org.apache.beam.sdk.testing.TestPipeline$1.evaluate(TestPipeline.java:317)
at org.junit.rules.RunRules.evaluate(RunRules.java:20)
at org.junit.runners.ParentRunner.runLeaf(ParentRunner.java:325)
at org.junit.runners.BlockJUnit4ClassRunner.runChild(BlockJUnit4ClassRunner.java:78)
at org.junit.runners.BlockJUnit4ClassRunner.runChild(BlockJUnit4ClassRunner.java:57)
at org.junit.runners.ParentRunner$3.run(ParentRunner.java:290)
at org.apache.maven.surefire.junitcore.pc.Scheduler$1.run(Scheduler.java:410)
at java.util.concurrent.Executors$RunnableAdapter.call(Executors.java:511)
at java.util.concurrent.FutureTask.run(FutureTask.java:266)
at java.util.concurrent.ThreadPoolExecutor.runWorker(ThreadPoolExecutor.java:1149)
at java.util.concurrent.ThreadPoolExecutor$Worker.run(ThreadPoolExecutor.java:624)
at java.lang.Thread.run(Thread.java:748)
[INFO]
[INFO] Results:
[INFO]
[ERROR] Errors:
[ERROR] HadoopInputFormatIOIT.readUsingHadoopInputFormat:134 NoSuchMethod com.google...
[INFO]
[ERROR] Tests run: 1, Failures: 0, Errors: 1, Skipped: 0
[INFO]
[INFO]
[INFO] --- maven-dependency-plugin:3.0.2:analyze-only (default) @ beam-sdks-java-io-hadoop-input-format ---
[INFO] No dependency problems found
[INFO]
[INFO] --- maven-failsafe-plugin:2.21.0:verify (default) @ beam-sdks-java-io-hadoop-input-format ---
[INFO] Failsafe report directory: <https://builds.apache.org/job/beam_PerformanceTests_HadoopInputFormat/ws/runs/2a718993/beam/sdks/java/io/hadoop-input-format/target/failsafe-reports>
[INFO] ------------------------------------------------------------------------
[INFO] BUILD FAILURE
[INFO] ------------------------------------------------------------------------
[INFO] Total time: 01:14 min
[INFO] Finished at: 2018-04-14T06:04:01Z
[INFO] Final Memory: 128M/1419M
[INFO] ------------------------------------------------------------------------
[ERROR] Failed to execute goal org.apache.maven.plugins:maven-failsafe-plugin:2.21.0:verify (default) on project beam-sdks-java-io-hadoop-input-format: There are test failures.
[ERROR]
[ERROR] Please refer to <https://builds.apache.org/job/beam_PerformanceTests_HadoopInputFormat/ws/runs/2a718993/beam/sdks/java/io/hadoop-input-format/target/failsafe-reports> for the individual test results.
[ERROR] Please refer to dump files (if any exist) [date]-jvmRun[N].dump, [date].dumpstream and [date]-jvmRun[N].dumpstream.
[ERROR] -> [Help 1]
org.apache.maven.lifecycle.LifecycleExecutionException: Failed to execute goal org.apache.maven.plugins:maven-failsafe-plugin:2.21.0:verify (default) on project beam-sdks-java-io-hadoop-input-format: There are test failures.
Please refer to <https://builds.apache.org/job/beam_PerformanceTests_HadoopInputFormat/ws/runs/2a718993/beam/sdks/java/io/hadoop-input-format/target/failsafe-reports> for the individual test results.
Please refer to dump files (if any exist) [date]-jvmRun[N].dump, [date].dumpstream and [date]-jvmRun[N].dumpstream.
at org.apache.maven.lifecycle.internal.MojoExecutor.execute (MojoExecutor.java:213)
at org.apache.maven.lifecycle.internal.MojoExecutor.execute (MojoExecutor.java:154)
at org.apache.maven.lifecycle.internal.MojoExecutor.execute (MojoExecutor.java:146)
at org.apache.maven.lifecycle.internal.LifecycleModuleBuilder.buildProject (LifecycleModuleBuilder.java:117)
at org.apache.maven.lifecycle.internal.LifecycleModuleBuilder.buildProject (LifecycleModuleBuilder.java:81)
at org.apache.maven.lifecycle.internal.builder.singlethreaded.SingleThreadedBuilder.build (SingleThreadedBuilder.java:51)
at org.apache.maven.lifecycle.internal.LifecycleStarter.execute (LifecycleStarter.java:128)
at org.apache.maven.DefaultMaven.doExecute (DefaultMaven.java:309)
at org.apache.maven.DefaultMaven.doExecute (DefaultMaven.java:194)
at org.apache.maven.DefaultMaven.execute (DefaultMaven.java:107)
at org.apache.maven.cli.MavenCli.execute (MavenCli.java:955)
at org.apache.maven.cli.MavenCli.doMain (MavenCli.java:290)
at org.apache.maven.cli.MavenCli.main (MavenCli.java:194)
at sun.reflect.NativeMethodAccessorImpl.invoke0 (Native Method)
at sun.reflect.NativeMethodAccessorImpl.invoke (NativeMethodAccessorImpl.java:62)
at sun.reflect.DelegatingMethodAccessorImpl.invoke (DelegatingMethodAccessorImpl.java:43)
at java.lang.reflect.Method.invoke (Method.java:498)
at org.codehaus.plexus.classworlds.launcher.Launcher.launchEnhanced (Launcher.java:289)
at org.codehaus.plexus.classworlds.launcher.Launcher.launch (Launcher.java:229)
at org.codehaus.plexus.classworlds.launcher.Launcher.mainWithExitCode (Launcher.java:415)
at org.codehaus.plexus.classworlds.launcher.Launcher.main (Launcher.java:356)
Caused by: org.apache.maven.plugin.MojoFailureException: There are test failures.
Please refer to <https://builds.apache.org/job/beam_PerformanceTests_HadoopInputFormat/ws/runs/2a718993/beam/sdks/java/io/hadoop-input-format/target/failsafe-reports> for the individual test results.
Please refer to dump files (if any exist) [date]-jvmRun[N].dump, [date].dumpstream and [date]-jvmRun[N].dumpstream.
at org.apache.maven.plugin.surefire.SurefireHelper.throwException (SurefireHelper.java:240)
at org.apache.maven.plugin.surefire.SurefireHelper.reportExecution (SurefireHelper.java:112)
at org.apache.maven.plugin.failsafe.VerifyMojo.execute (VerifyMojo.java:192)
at org.apache.maven.plugin.DefaultBuildPluginManager.executeMojo (DefaultBuildPluginManager.java:134)
at org.apache.maven.lifecycle.internal.MojoExecutor.execute (MojoExecutor.java:208)
at org.apache.maven.lifecycle.internal.MojoExecutor.execute (MojoExecutor.java:154)
at org.apache.maven.lifecycle.internal.MojoExecutor.execute (MojoExecutor.java:146)
at org.apache.maven.lifecycle.internal.LifecycleModuleBuilder.buildProject (LifecycleModuleBuilder.java:117)
at org.apache.maven.lifecycle.internal.LifecycleModuleBuilder.buildProject (LifecycleModuleBuilder.java:81)
at org.apache.maven.lifecycle.internal.builder.singlethreaded.SingleThreadedBuilder.build (SingleThreadedBuilder.java:51)
at org.apache.maven.lifecycle.internal.LifecycleStarter.execute (LifecycleStarter.java:128)
at org.apache.maven.DefaultMaven.doExecute (DefaultMaven.java:309)
at org.apache.maven.DefaultMaven.doExecute (DefaultMaven.java:194)
at org.apache.maven.DefaultMaven.execute (DefaultMaven.java:107)
at org.apache.maven.cli.MavenCli.execute (MavenCli.java:955)
at org.apache.maven.cli.MavenCli.doMain (MavenCli.java:290)
at org.apache.maven.cli.MavenCli.main (MavenCli.java:194)
at sun.reflect.NativeMethodAccessorImpl.invoke0 (Native Method)
at sun.reflect.NativeMethodAccessorImpl.invoke (NativeMethodAccessorImpl.java:62)
at sun.reflect.DelegatingMethodAccessorImpl.invoke (DelegatingMethodAccessorImpl.java:43)
at java.lang.reflect.Method.invoke (Method.java:498)
at org.codehaus.plexus.classworlds.launcher.Launcher.launchEnhanced (Launcher.java:289)
at org.codehaus.plexus.classworlds.launcher.Launcher.launch (Launcher.java:229)
at org.codehaus.plexus.classworlds.launcher.Launcher.mainWithExitCode (Launcher.java:415)
at org.codehaus.plexus.classworlds.launcher.Launcher.main (Launcher.java:356)
[ERROR]
[ERROR] Re-run Maven using the -X switch to enable full debug logging.
[ERROR]
[ERROR] For more information about the errors and possible solutions, please read the following articles:
[ERROR] [Help 1] http://cwiki.apache.org/confluence/display/MAVEN/MojoFailureException
STDERR:
2018-04-14 06:04:02,554 2a718993 MainThread beam_integration_benchmark(1/1) ERROR Error during benchmark beam_integration_benchmark
Traceback (most recent call last):
File "<https://builds.apache.org/job/beam_PerformanceTests_HadoopInputFormat/ws/PerfKitBenchmarker/perfkitbenchmarker/pkb.py",> line 623, in RunBenchmark
DoRunPhase(spec, collector, detailed_timer)
File "<https://builds.apache.org/job/beam_PerformanceTests_HadoopInputFormat/ws/PerfKitBenchmarker/perfkitbenchmarker/pkb.py",> line 526, in DoRunPhase
samples = spec.BenchmarkRun(spec)
File "<https://builds.apache.org/job/beam_PerformanceTests_HadoopInputFormat/ws/PerfKitBenchmarker/perfkitbenchmarker/linux_benchmarks/beam_integration_benchmark.py",> line 159, in Run
job_type=job_type)
File "<https://builds.apache.org/job/beam_PerformanceTests_HadoopInputFormat/ws/PerfKitBenchmarker/perfkitbenchmarker/providers/gcp/gcp_dpb_dataflow.py",> line 90, in SubmitJob
assert retcode == 0, "Integration Test Failed."
AssertionError: Integration Test Failed.
2018-04-14 06:04:02,555 2a718993 MainThread beam_integration_benchmark(1/1) INFO Cleaning up benchmark beam_integration_benchmark
2018-04-14 06:04:02,556 2a718993 MainThread beam_integration_benchmark(1/1) INFO Running: kubectl --kubeconfig=<https://builds.apache.org/job/beam_PerformanceTests_HadoopInputFormat/ws/config-hadoopinputformatioit-1523682089037> delete -f <https://builds.apache.org/job/beam_PerformanceTests_HadoopInputFormat/ws/src/.test-infra/kubernetes/postgres/postgres-service-for-local-dev.yml>
2018-04-14 06:04:03,281 2a718993 MainThread beam_integration_benchmark(1/1) ERROR Exception running benchmark
Traceback (most recent call last):
File "<https://builds.apache.org/job/beam_PerformanceTests_HadoopInputFormat/ws/PerfKitBenchmarker/perfkitbenchmarker/pkb.py",> line 757, in RunBenchmarkTask
RunBenchmark(spec, collector)
File "<https://builds.apache.org/job/beam_PerformanceTests_HadoopInputFormat/ws/PerfKitBenchmarker/perfkitbenchmarker/pkb.py",> line 623, in RunBenchmark
DoRunPhase(spec, collector, detailed_timer)
File "<https://builds.apache.org/job/beam_PerformanceTests_HadoopInputFormat/ws/PerfKitBenchmarker/perfkitbenchmarker/pkb.py",> line 526, in DoRunPhase
samples = spec.BenchmarkRun(spec)
File "<https://builds.apache.org/job/beam_PerformanceTests_HadoopInputFormat/ws/PerfKitBenchmarker/perfkitbenchmarker/linux_benchmarks/beam_integration_benchmark.py",> line 159, in Run
job_type=job_type)
File "<https://builds.apache.org/job/beam_PerformanceTests_HadoopInputFormat/ws/PerfKitBenchmarker/perfkitbenchmarker/providers/gcp/gcp_dpb_dataflow.py",> line 90, in SubmitJob
assert retcode == 0, "Integration Test Failed."
AssertionError: Integration Test Failed.
2018-04-14 06:04:03,282 2a718993 MainThread beam_integration_benchmark(1/1) ERROR Benchmark 1/1 beam_integration_benchmark (UID: beam_integration_benchmark0) failed. Execution will continue.
2018-04-14 06:04:03,333 2a718993 MainThread INFO Benchmark run statuses:
---------------------------------------------------------------------------------
Name UID Status Failed Substatus
---------------------------------------------------------------------------------
beam_integration_benchmark beam_integration_benchmark0 FAILED
---------------------------------------------------------------------------------
Success rate: 0.00% (0/1)
2018-04-14 06:04:03,334 2a718993 MainThread INFO Complete logs can be found at: <https://builds.apache.org/job/beam_PerformanceTests_HadoopInputFormat/ws/runs/2a718993/pkb.log>
2018-04-14 06:04:03,334 2a718993 MainThread INFO Completion statuses can be found at: <https://builds.apache.org/job/beam_PerformanceTests_HadoopInputFormat/ws/runs/2a718993/completion_statuses.json>
Build step 'Execute shell' marked build as failure
Build failed in Jenkins: beam_PerformanceTests_HadoopInputFormat
#138
Posted by Apache Jenkins Server <je...@builds.apache.org>.
See <https://builds.apache.org/job/beam_PerformanceTests_HadoopInputFormat/138/display/redirect?page=changes>
Changes:
[sidhom] Support impulse transforms in Flink
[sidhom] Add Impulse ValidatesRunner test
[tgroh] Fix materializesWithDifferentEnvConsumer
[tgroh] Reduce Requirements to be considered a Primitve
[sidhom] [BEAM-3994] Use typed client pool sinks and sources
[sidhom] [BEAM-3966] Move functional utilities into shared module
[sidhom] Use general functional interfaces in ControlClientPool
[sidhom] Rename createLinked() to createBuffered() in QueueControlClientPool
[github] Add region argument to dataflow.go
[github] Region isn't on proto; create and get instead.
[tgroh] Rename `defaultRegistry` to `javaSdkNativeRegistry`
------------------------------------------
[...truncated 420.32 KB...]
[INFO] Excluding com.google.cloud.bigdataoss:gcsio:jar:1.4.5 from the shaded jar.
[INFO] Excluding com.google.apis:google-api-services-cloudresourcemanager:jar:v1-rev6-1.22.0 from the shaded jar.
[INFO] Excluding org.apache.beam:beam-sdks-java-io-google-cloud-platform:jar:2.5.0-SNAPSHOT from the shaded jar.
[INFO] Excluding org.apache.beam:beam-sdks-java-extensions-protobuf:jar:2.5.0-SNAPSHOT from the shaded jar.
[INFO] Excluding io.grpc:grpc-core:jar:1.2.0 from the shaded jar.
[INFO] Excluding com.google.errorprone:error_prone_annotations:jar:2.0.15 from the shaded jar.
[INFO] Excluding io.grpc:grpc-context:jar:1.2.0 from the shaded jar.
[INFO] Excluding com.google.instrumentation:instrumentation-api:jar:0.3.0 from the shaded jar.
[INFO] Excluding com.google.apis:google-api-services-bigquery:jar:v2-rev374-1.22.0 from the shaded jar.
[INFO] Excluding com.google.api:gax-grpc:jar:0.20.0 from the shaded jar.
[INFO] Excluding io.grpc:grpc-protobuf:jar:1.2.0 from the shaded jar.
[INFO] Excluding com.google.api:api-common:jar:1.0.0-rc2 from the shaded jar.
[INFO] Excluding com.google.api:gax:jar:1.3.1 from the shaded jar.
[INFO] Excluding org.threeten:threetenbp:jar:1.3.3 from the shaded jar.
[INFO] Excluding com.google.cloud:google-cloud-core-grpc:jar:1.2.0 from the shaded jar.
[INFO] Excluding com.google.apis:google-api-services-pubsub:jar:v1-rev10-1.22.0 from the shaded jar.
[INFO] Excluding com.google.api.grpc:grpc-google-cloud-pubsub-v1:jar:0.1.18 from the shaded jar.
[INFO] Excluding com.google.api.grpc:proto-google-cloud-pubsub-v1:jar:0.1.18 from the shaded jar.
[INFO] Excluding com.google.api.grpc:proto-google-iam-v1:jar:0.1.18 from the shaded jar.
[INFO] Excluding com.google.cloud.datastore:datastore-v1-proto-client:jar:1.4.0 from the shaded jar.
[INFO] Excluding com.google.http-client:google-http-client-protobuf:jar:1.22.0 from the shaded jar.
[INFO] Excluding com.google.http-client:google-http-client-jackson:jar:1.22.0 from the shaded jar.
[INFO] Excluding com.google.cloud.datastore:datastore-v1-protos:jar:1.3.0 from the shaded jar.
[INFO] Excluding com.google.api.grpc:grpc-google-common-protos:jar:0.1.9 from the shaded jar.
[INFO] Excluding io.grpc:grpc-auth:jar:1.2.0 from the shaded jar.
[INFO] Excluding io.grpc:grpc-netty:jar:1.2.0 from the shaded jar.
[INFO] Excluding io.netty:netty-codec-http2:jar:4.1.8.Final from the shaded jar.
[INFO] Excluding io.netty:netty-handler-proxy:jar:4.1.8.Final from the shaded jar.
[INFO] Excluding io.netty:netty-codec-socks:jar:4.1.8.Final from the shaded jar.
[INFO] Excluding io.grpc:grpc-stub:jar:1.2.0 from the shaded jar.
[INFO] Excluding com.google.cloud:google-cloud-core:jar:1.0.2 from the shaded jar.
[INFO] Excluding org.json:json:jar:20160810 from the shaded jar.
[INFO] Excluding com.google.cloud:google-cloud-spanner:jar:0.20.0b-beta from the shaded jar.
[INFO] Excluding com.google.api.grpc:proto-google-cloud-spanner-v1:jar:0.1.11b from the shaded jar.
[INFO] Excluding com.google.api.grpc:proto-google-cloud-spanner-admin-instance-v1:jar:0.1.11 from the shaded jar.
[INFO] Excluding com.google.api.grpc:grpc-google-cloud-spanner-v1:jar:0.1.11b from the shaded jar.
[INFO] Excluding com.google.api.grpc:grpc-google-cloud-spanner-admin-database-v1:jar:0.1.11 from the shaded jar.
[INFO] Excluding com.google.api.grpc:grpc-google-cloud-spanner-admin-instance-v1:jar:0.1.11 from the shaded jar.
[INFO] Excluding com.google.api.grpc:grpc-google-longrunning-v1:jar:0.1.11 from the shaded jar.
[INFO] Excluding com.google.api.grpc:proto-google-longrunning-v1:jar:0.1.11 from the shaded jar.
[INFO] Excluding com.google.cloud.bigtable:bigtable-protos:jar:1.0.0-pre3 from the shaded jar.
[INFO] Excluding com.google.cloud.bigtable:bigtable-client-core:jar:1.0.0 from the shaded jar.
[INFO] Excluding com.google.auth:google-auth-library-appengine:jar:0.7.0 from the shaded jar.
[INFO] Excluding io.opencensus:opencensus-contrib-grpc-util:jar:0.7.0 from the shaded jar.
[INFO] Excluding io.opencensus:opencensus-api:jar:0.7.0 from the shaded jar.
[INFO] Excluding com.google.api.grpc:proto-google-cloud-spanner-admin-database-v1:jar:0.1.9 from the shaded jar.
[INFO] Excluding com.google.api.grpc:proto-google-common-protos:jar:0.1.9 from the shaded jar.
[INFO] Excluding io.grpc:grpc-all:jar:1.2.0 from the shaded jar.
[INFO] Excluding io.grpc:grpc-okhttp:jar:1.2.0 from the shaded jar.
[INFO] Excluding com.squareup.okhttp:okhttp:jar:2.5.0 from the shaded jar.
[INFO] Excluding com.squareup.okio:okio:jar:1.6.0 from the shaded jar.
[INFO] Excluding io.grpc:grpc-protobuf-lite:jar:1.2.0 from the shaded jar.
[INFO] Excluding io.grpc:grpc-protobuf-nano:jar:1.2.0 from the shaded jar.
[INFO] Excluding com.google.protobuf.nano:protobuf-javanano:jar:3.0.0-alpha-5 from the shaded jar.
[INFO] Excluding io.netty:netty-tcnative-boringssl-static:jar:1.1.33.Fork26 from the shaded jar.
[INFO] Excluding org.apache.beam:beam-runners-core-construction-java:jar:2.5.0-SNAPSHOT from the shaded jar.
[INFO] Excluding org.apache.beam:beam-model-job-management:jar:2.5.0-SNAPSHOT from the shaded jar.
[INFO] Excluding com.google.protobuf:protobuf-java-util:jar:3.2.0 from the shaded jar.
[INFO] Excluding com.google.api-client:google-api-client:jar:1.22.0 from the shaded jar.
[INFO] Excluding com.google.oauth-client:google-oauth-client:jar:1.22.0 from the shaded jar.
[INFO] Excluding com.google.http-client:google-http-client:jar:1.22.0 from the shaded jar.
[INFO] Excluding com.google.http-client:google-http-client-jackson2:jar:1.22.0 from the shaded jar.
[INFO] Excluding com.google.apis:google-api-services-dataflow:jar:v1b3-rev221-1.22.0 from the shaded jar.
[INFO] Excluding com.google.apis:google-api-services-clouddebugger:jar:v2-rev8-1.22.0 from the shaded jar.
[INFO] Excluding com.google.apis:google-api-services-storage:jar:v1-rev71-1.22.0 from the shaded jar.
[INFO] Excluding com.google.auth:google-auth-library-credentials:jar:0.7.1 from the shaded jar.
[INFO] Excluding com.google.auth:google-auth-library-oauth2-http:jar:0.7.1 from the shaded jar.
[INFO] Excluding com.google.cloud.bigdataoss:util:jar:1.4.5 from the shaded jar.
[INFO] Excluding com.google.api-client:google-api-client-java6:jar:1.22.0 from the shaded jar.
[INFO] Excluding com.google.api-client:google-api-client-jackson2:jar:1.22.0 from the shaded jar.
[INFO] Excluding com.google.oauth-client:google-oauth-client-java6:jar:1.22.0 from the shaded jar.
[INFO] Replacing original artifact with shaded artifact.
[INFO] Replacing <https://builds.apache.org/job/beam_PerformanceTests_HadoopInputFormat/ws/runs/34706823/beam/sdks/java/io/hadoop-input-format/target/beam-sdks-java-io-hadoop-input-format-2.5.0-SNAPSHOT.jar> with <https://builds.apache.org/job/beam_PerformanceTests_HadoopInputFormat/ws/runs/34706823/beam/sdks/java/io/hadoop-input-format/target/beam-sdks-java-io-hadoop-input-format-2.5.0-SNAPSHOT-shaded.jar>
[INFO] Replacing original test artifact with shaded test artifact.
[INFO] Replacing <https://builds.apache.org/job/beam_PerformanceTests_HadoopInputFormat/ws/runs/34706823/beam/sdks/java/io/hadoop-input-format/target/beam-sdks-java-io-hadoop-input-format-2.5.0-SNAPSHOT-tests.jar> with <https://builds.apache.org/job/beam_PerformanceTests_HadoopInputFormat/ws/runs/34706823/beam/sdks/java/io/hadoop-input-format/target/beam-sdks-java-io-hadoop-input-format-2.5.0-SNAPSHOT-shaded-tests.jar>
[INFO] Dependency-reduced POM written at: <https://builds.apache.org/job/beam_PerformanceTests_HadoopInputFormat/ws/runs/34706823/beam/sdks/java/io/hadoop-input-format/dependency-reduced-pom.xml>
[INFO]
[INFO] --- maven-failsafe-plugin:2.21.0:integration-test (default) @ beam-sdks-java-io-hadoop-input-format ---
[INFO] Failsafe report directory: <https://builds.apache.org/job/beam_PerformanceTests_HadoopInputFormat/ws/runs/34706823/beam/sdks/java/io/hadoop-input-format/target/failsafe-reports>
[INFO] parallel='all', perCoreThreadCount=true, threadCount=4, useUnlimitedThreads=false, threadCountSuites=0, threadCountClasses=0, threadCountMethods=0, parallelOptimized=true
[INFO]
[INFO] -------------------------------------------------------
[INFO] T E S T S
[INFO] -------------------------------------------------------
[INFO] Running org.apache.beam.sdk.io.hadoop.inputformat.HadoopInputFormatIOIT
[ERROR] Tests run: 1, Failures: 0, Errors: 1, Skipped: 0, Time elapsed: 1.702 s <<< FAILURE! - in org.apache.beam.sdk.io.hadoop.inputformat.HadoopInputFormatIOIT
[ERROR] readUsingHadoopInputFormat(org.apache.beam.sdk.io.hadoop.inputformat.HadoopInputFormatIOIT) Time elapsed: 1.702 s <<< ERROR!
java.lang.NoSuchMethodError: com.google.common.base.Preconditions.checkArgument(ZLjava/lang/String;Ljava/lang/Object;Ljava/lang/Object;)V
at org.apache.beam.runners.core.construction.PTransformReplacements.getSingletonMainInput(PTransformReplacements.java:50)
at org.apache.beam.runners.core.construction.PTransformReplacements.getSingletonMainInput(PTransformReplacements.java:41)
at org.apache.beam.runners.dataflow.ReshuffleOverrideFactory.getReplacementTransform(ReshuffleOverrideFactory.java:53)
at org.apache.beam.sdk.Pipeline.applyReplacement(Pipeline.java:552)
at org.apache.beam.sdk.Pipeline.replace(Pipeline.java:288)
at org.apache.beam.sdk.Pipeline.replaceAll(Pipeline.java:209)
at org.apache.beam.runners.dataflow.DataflowRunner.replaceTransforms(DataflowRunner.java:865)
at org.apache.beam.runners.dataflow.DataflowRunner.run(DataflowRunner.java:656)
at org.apache.beam.runners.dataflow.TestDataflowRunner.run(TestDataflowRunner.java:98)
at org.apache.beam.runners.dataflow.TestDataflowRunner.run(TestDataflowRunner.java:90)
at org.apache.beam.runners.dataflow.TestDataflowRunner.run(TestDataflowRunner.java:55)
at org.apache.beam.sdk.Pipeline.run(Pipeline.java:311)
at org.apache.beam.sdk.testing.TestPipeline.run(TestPipeline.java:346)
at org.apache.beam.sdk.testing.TestPipeline.run(TestPipeline.java:328)
at org.apache.beam.sdk.io.hadoop.inputformat.HadoopInputFormatIOIT.readUsingHadoopInputFormat(HadoopInputFormatIOIT.java:134)
at sun.reflect.NativeMethodAccessorImpl.invoke0(Native Method)
at sun.reflect.NativeMethodAccessorImpl.invoke(NativeMethodAccessorImpl.java:62)
at sun.reflect.DelegatingMethodAccessorImpl.invoke(DelegatingMethodAccessorImpl.java:43)
at java.lang.reflect.Method.invoke(Method.java:498)
at org.junit.runners.model.FrameworkMethod$1.runReflectiveCall(FrameworkMethod.java:50)
at org.junit.internal.runners.model.ReflectiveCallable.run(ReflectiveCallable.java:12)
at org.junit.runners.model.FrameworkMethod.invokeExplosively(FrameworkMethod.java:47)
at org.junit.internal.runners.statements.InvokeMethod.evaluate(InvokeMethod.java:17)
at org.apache.beam.sdk.testing.TestPipeline$1.evaluate(TestPipeline.java:317)
at org.apache.beam.sdk.testing.TestPipeline$1.evaluate(TestPipeline.java:317)
at org.junit.rules.RunRules.evaluate(RunRules.java:20)
at org.junit.runners.ParentRunner.runLeaf(ParentRunner.java:325)
at org.junit.runners.BlockJUnit4ClassRunner.runChild(BlockJUnit4ClassRunner.java:78)
at org.junit.runners.BlockJUnit4ClassRunner.runChild(BlockJUnit4ClassRunner.java:57)
at org.junit.runners.ParentRunner$3.run(ParentRunner.java:290)
at org.apache.maven.surefire.junitcore.pc.Scheduler$1.run(Scheduler.java:410)
at java.util.concurrent.Executors$RunnableAdapter.call(Executors.java:511)
at java.util.concurrent.FutureTask.run(FutureTask.java:266)
at java.util.concurrent.ThreadPoolExecutor.runWorker(ThreadPoolExecutor.java:1149)
at java.util.concurrent.ThreadPoolExecutor$Worker.run(ThreadPoolExecutor.java:624)
at java.lang.Thread.run(Thread.java:748)
[INFO]
[INFO] Results:
[INFO]
[ERROR] Errors:
[ERROR] HadoopInputFormatIOIT.readUsingHadoopInputFormat:134 NoSuchMethod com.google...
[INFO]
[ERROR] Tests run: 1, Failures: 0, Errors: 1, Skipped: 0
[INFO]
[INFO]
[INFO] --- maven-dependency-plugin:3.0.2:analyze-only (default) @ beam-sdks-java-io-hadoop-input-format ---
[INFO] No dependency problems found
[INFO]
[INFO] --- maven-failsafe-plugin:2.21.0:verify (default) @ beam-sdks-java-io-hadoop-input-format ---
[INFO] Failsafe report directory: <https://builds.apache.org/job/beam_PerformanceTests_HadoopInputFormat/ws/runs/34706823/beam/sdks/java/io/hadoop-input-format/target/failsafe-reports>
[INFO] ------------------------------------------------------------------------
[INFO] BUILD FAILURE
[INFO] ------------------------------------------------------------------------
[INFO] Total time: 39.643 s
[INFO] Finished at: 2018-04-14T00:46:33Z
[INFO] Final Memory: 129M/1525M
[INFO] ------------------------------------------------------------------------
[ERROR] Failed to execute goal org.apache.maven.plugins:maven-failsafe-plugin:2.21.0:verify (default) on project beam-sdks-java-io-hadoop-input-format: There are test failures.
[ERROR]
[ERROR] Please refer to <https://builds.apache.org/job/beam_PerformanceTests_HadoopInputFormat/ws/runs/34706823/beam/sdks/java/io/hadoop-input-format/target/failsafe-reports> for the individual test results.
[ERROR] Please refer to dump files (if any exist) [date]-jvmRun[N].dump, [date].dumpstream and [date]-jvmRun[N].dumpstream.
[ERROR] -> [Help 1]
org.apache.maven.lifecycle.LifecycleExecutionException: Failed to execute goal org.apache.maven.plugins:maven-failsafe-plugin:2.21.0:verify (default) on project beam-sdks-java-io-hadoop-input-format: There are test failures.
Please refer to <https://builds.apache.org/job/beam_PerformanceTests_HadoopInputFormat/ws/runs/34706823/beam/sdks/java/io/hadoop-input-format/target/failsafe-reports> for the individual test results.
Please refer to dump files (if any exist) [date]-jvmRun[N].dump, [date].dumpstream and [date]-jvmRun[N].dumpstream.
at org.apache.maven.lifecycle.internal.MojoExecutor.execute (MojoExecutor.java:213)
at org.apache.maven.lifecycle.internal.MojoExecutor.execute (MojoExecutor.java:154)
at org.apache.maven.lifecycle.internal.MojoExecutor.execute (MojoExecutor.java:146)
at org.apache.maven.lifecycle.internal.LifecycleModuleBuilder.buildProject (LifecycleModuleBuilder.java:117)
at org.apache.maven.lifecycle.internal.LifecycleModuleBuilder.buildProject (LifecycleModuleBuilder.java:81)
at org.apache.maven.lifecycle.internal.builder.singlethreaded.SingleThreadedBuilder.build (SingleThreadedBuilder.java:51)
at org.apache.maven.lifecycle.internal.LifecycleStarter.execute (LifecycleStarter.java:128)
at org.apache.maven.DefaultMaven.doExecute (DefaultMaven.java:309)
at org.apache.maven.DefaultMaven.doExecute (DefaultMaven.java:194)
at org.apache.maven.DefaultMaven.execute (DefaultMaven.java:107)
at org.apache.maven.cli.MavenCli.execute (MavenCli.java:955)
at org.apache.maven.cli.MavenCli.doMain (MavenCli.java:290)
at org.apache.maven.cli.MavenCli.main (MavenCli.java:194)
at sun.reflect.NativeMethodAccessorImpl.invoke0 (Native Method)
at sun.reflect.NativeMethodAccessorImpl.invoke (NativeMethodAccessorImpl.java:62)
at sun.reflect.DelegatingMethodAccessorImpl.invoke (DelegatingMethodAccessorImpl.java:43)
at java.lang.reflect.Method.invoke (Method.java:498)
at org.codehaus.plexus.classworlds.launcher.Launcher.launchEnhanced (Launcher.java:289)
at org.codehaus.plexus.classworlds.launcher.Launcher.launch (Launcher.java:229)
at org.codehaus.plexus.classworlds.launcher.Launcher.mainWithExitCode (Launcher.java:415)
at org.codehaus.plexus.classworlds.launcher.Launcher.main (Launcher.java:356)
Caused by: org.apache.maven.plugin.MojoFailureException: There are test failures.
Please refer to <https://builds.apache.org/job/beam_PerformanceTests_HadoopInputFormat/ws/runs/34706823/beam/sdks/java/io/hadoop-input-format/target/failsafe-reports> for the individual test results.
Please refer to dump files (if any exist) [date]-jvmRun[N].dump, [date].dumpstream and [date]-jvmRun[N].dumpstream.
at org.apache.maven.plugin.surefire.SurefireHelper.throwException (SurefireHelper.java:240)
at org.apache.maven.plugin.surefire.SurefireHelper.reportExecution (SurefireHelper.java:112)
at org.apache.maven.plugin.failsafe.VerifyMojo.execute (VerifyMojo.java:192)
at org.apache.maven.plugin.DefaultBuildPluginManager.executeMojo (DefaultBuildPluginManager.java:134)
at org.apache.maven.lifecycle.internal.MojoExecutor.execute (MojoExecutor.java:208)
at org.apache.maven.lifecycle.internal.MojoExecutor.execute (MojoExecutor.java:154)
at org.apache.maven.lifecycle.internal.MojoExecutor.execute (MojoExecutor.java:146)
at org.apache.maven.lifecycle.internal.LifecycleModuleBuilder.buildProject (LifecycleModuleBuilder.java:117)
at org.apache.maven.lifecycle.internal.LifecycleModuleBuilder.buildProject (LifecycleModuleBuilder.java:81)
at org.apache.maven.lifecycle.internal.builder.singlethreaded.SingleThreadedBuilder.build (SingleThreadedBuilder.java:51)
at org.apache.maven.lifecycle.internal.LifecycleStarter.execute (LifecycleStarter.java:128)
at org.apache.maven.DefaultMaven.doExecute (DefaultMaven.java:309)
at org.apache.maven.DefaultMaven.doExecute (DefaultMaven.java:194)
at org.apache.maven.DefaultMaven.execute (DefaultMaven.java:107)
at org.apache.maven.cli.MavenCli.execute (MavenCli.java:955)
at org.apache.maven.cli.MavenCli.doMain (MavenCli.java:290)
at org.apache.maven.cli.MavenCli.main (MavenCli.java:194)
at sun.reflect.NativeMethodAccessorImpl.invoke0 (Native Method)
at sun.reflect.NativeMethodAccessorImpl.invoke (NativeMethodAccessorImpl.java:62)
at sun.reflect.DelegatingMethodAccessorImpl.invoke (DelegatingMethodAccessorImpl.java:43)
at java.lang.reflect.Method.invoke (Method.java:498)
at org.codehaus.plexus.classworlds.launcher.Launcher.launchEnhanced (Launcher.java:289)
at org.codehaus.plexus.classworlds.launcher.Launcher.launch (Launcher.java:229)
at org.codehaus.plexus.classworlds.launcher.Launcher.mainWithExitCode (Launcher.java:415)
at org.codehaus.plexus.classworlds.launcher.Launcher.main (Launcher.java:356)
[ERROR]
[ERROR] Re-run Maven using the -X switch to enable full debug logging.
[ERROR]
[ERROR] For more information about the errors and possible solutions, please read the following articles:
[ERROR] [Help 1] http://cwiki.apache.org/confluence/display/MAVEN/MojoFailureException
STDERR:
2018-04-14 00:46:34,189 34706823 MainThread beam_integration_benchmark(1/1) ERROR Error during benchmark beam_integration_benchmark
Traceback (most recent call last):
File "<https://builds.apache.org/job/beam_PerformanceTests_HadoopInputFormat/ws/PerfKitBenchmarker/perfkitbenchmarker/pkb.py",> line 623, in RunBenchmark
DoRunPhase(spec, collector, detailed_timer)
File "<https://builds.apache.org/job/beam_PerformanceTests_HadoopInputFormat/ws/PerfKitBenchmarker/perfkitbenchmarker/pkb.py",> line 526, in DoRunPhase
samples = spec.BenchmarkRun(spec)
File "<https://builds.apache.org/job/beam_PerformanceTests_HadoopInputFormat/ws/PerfKitBenchmarker/perfkitbenchmarker/linux_benchmarks/beam_integration_benchmark.py",> line 159, in Run
job_type=job_type)
File "<https://builds.apache.org/job/beam_PerformanceTests_HadoopInputFormat/ws/PerfKitBenchmarker/perfkitbenchmarker/providers/gcp/gcp_dpb_dataflow.py",> line 90, in SubmitJob
assert retcode == 0, "Integration Test Failed."
AssertionError: Integration Test Failed.
2018-04-14 00:46:34,190 34706823 MainThread beam_integration_benchmark(1/1) INFO Cleaning up benchmark beam_integration_benchmark
2018-04-14 00:46:34,190 34706823 MainThread beam_integration_benchmark(1/1) INFO Running: kubectl --kubeconfig=<https://builds.apache.org/job/beam_PerformanceTests_HadoopInputFormat/ws/config-hadoopinputformatioit-1523651184023> delete -f <https://builds.apache.org/job/beam_PerformanceTests_HadoopInputFormat/ws/src/.test-infra/kubernetes/postgres/postgres-service-for-local-dev.yml>
2018-04-14 00:46:36,838 34706823 MainThread beam_integration_benchmark(1/1) ERROR Exception running benchmark
Traceback (most recent call last):
File "<https://builds.apache.org/job/beam_PerformanceTests_HadoopInputFormat/ws/PerfKitBenchmarker/perfkitbenchmarker/pkb.py",> line 757, in RunBenchmarkTask
RunBenchmark(spec, collector)
File "<https://builds.apache.org/job/beam_PerformanceTests_HadoopInputFormat/ws/PerfKitBenchmarker/perfkitbenchmarker/pkb.py",> line 623, in RunBenchmark
DoRunPhase(spec, collector, detailed_timer)
File "<https://builds.apache.org/job/beam_PerformanceTests_HadoopInputFormat/ws/PerfKitBenchmarker/perfkitbenchmarker/pkb.py",> line 526, in DoRunPhase
samples = spec.BenchmarkRun(spec)
File "<https://builds.apache.org/job/beam_PerformanceTests_HadoopInputFormat/ws/PerfKitBenchmarker/perfkitbenchmarker/linux_benchmarks/beam_integration_benchmark.py",> line 159, in Run
job_type=job_type)
File "<https://builds.apache.org/job/beam_PerformanceTests_HadoopInputFormat/ws/PerfKitBenchmarker/perfkitbenchmarker/providers/gcp/gcp_dpb_dataflow.py",> line 90, in SubmitJob
assert retcode == 0, "Integration Test Failed."
AssertionError: Integration Test Failed.
2018-04-14 00:46:36,839 34706823 MainThread beam_integration_benchmark(1/1) ERROR Benchmark 1/1 beam_integration_benchmark (UID: beam_integration_benchmark0) failed. Execution will continue.
2018-04-14 00:46:36,886 34706823 MainThread INFO Benchmark run statuses:
---------------------------------------------------------------------------------
Name UID Status Failed Substatus
---------------------------------------------------------------------------------
beam_integration_benchmark beam_integration_benchmark0 FAILED
---------------------------------------------------------------------------------
Success rate: 0.00% (0/1)
2018-04-14 00:46:36,886 34706823 MainThread INFO Complete logs can be found at: <https://builds.apache.org/job/beam_PerformanceTests_HadoopInputFormat/ws/runs/34706823/pkb.log>
2018-04-14 00:46:36,887 34706823 MainThread INFO Completion statuses can be found at: <https://builds.apache.org/job/beam_PerformanceTests_HadoopInputFormat/ws/runs/34706823/completion_statuses.json>
Build step 'Execute shell' marked build as failure
Build failed in Jenkins: beam_PerformanceTests_HadoopInputFormat
#137
Posted by Apache Jenkins Server <je...@builds.apache.org>.
See <https://builds.apache.org/job/beam_PerformanceTests_HadoopInputFormat/137/display/redirect?page=changes>
Changes:
[ehudm] Add lint checks for modules under sdks/python/.
[kedin] Add Row Json Deserializer
[kedin] Add RowJsonValueExtractors
[aaltay] [BEAM-4028] Adding NameContext to Python SDK. (#5043)
------------------------------------------
[...truncated 43.52 KB...]
[INFO] Excluding com.google.cloud.bigdataoss:gcsio:jar:1.4.5 from the shaded jar.
[INFO] Excluding com.google.apis:google-api-services-cloudresourcemanager:jar:v1-rev6-1.22.0 from the shaded jar.
[INFO] Excluding org.apache.beam:beam-sdks-java-io-google-cloud-platform:jar:2.5.0-SNAPSHOT from the shaded jar.
[INFO] Excluding org.apache.beam:beam-sdks-java-extensions-protobuf:jar:2.5.0-SNAPSHOT from the shaded jar.
[INFO] Excluding io.grpc:grpc-core:jar:1.2.0 from the shaded jar.
[INFO] Excluding com.google.errorprone:error_prone_annotations:jar:2.0.15 from the shaded jar.
[INFO] Excluding io.grpc:grpc-context:jar:1.2.0 from the shaded jar.
[INFO] Excluding com.google.instrumentation:instrumentation-api:jar:0.3.0 from the shaded jar.
[INFO] Excluding com.google.apis:google-api-services-bigquery:jar:v2-rev374-1.22.0 from the shaded jar.
[INFO] Excluding com.google.api:gax-grpc:jar:0.20.0 from the shaded jar.
[INFO] Excluding io.grpc:grpc-protobuf:jar:1.2.0 from the shaded jar.
[INFO] Excluding com.google.api:api-common:jar:1.0.0-rc2 from the shaded jar.
[INFO] Excluding com.google.api:gax:jar:1.3.1 from the shaded jar.
[INFO] Excluding org.threeten:threetenbp:jar:1.3.3 from the shaded jar.
[INFO] Excluding com.google.cloud:google-cloud-core-grpc:jar:1.2.0 from the shaded jar.
[INFO] Excluding com.google.apis:google-api-services-pubsub:jar:v1-rev10-1.22.0 from the shaded jar.
[INFO] Excluding com.google.api.grpc:grpc-google-cloud-pubsub-v1:jar:0.1.18 from the shaded jar.
[INFO] Excluding com.google.api.grpc:proto-google-cloud-pubsub-v1:jar:0.1.18 from the shaded jar.
[INFO] Excluding com.google.api.grpc:proto-google-iam-v1:jar:0.1.18 from the shaded jar.
[INFO] Excluding com.google.cloud.datastore:datastore-v1-proto-client:jar:1.4.0 from the shaded jar.
[INFO] Excluding com.google.http-client:google-http-client-protobuf:jar:1.22.0 from the shaded jar.
[INFO] Excluding com.google.http-client:google-http-client-jackson:jar:1.22.0 from the shaded jar.
[INFO] Excluding com.google.cloud.datastore:datastore-v1-protos:jar:1.3.0 from the shaded jar.
[INFO] Excluding com.google.api.grpc:grpc-google-common-protos:jar:0.1.9 from the shaded jar.
[INFO] Excluding io.grpc:grpc-auth:jar:1.2.0 from the shaded jar.
[INFO] Excluding io.grpc:grpc-netty:jar:1.2.0 from the shaded jar.
[INFO] Excluding io.netty:netty-codec-http2:jar:4.1.8.Final from the shaded jar.
[INFO] Excluding io.netty:netty-handler-proxy:jar:4.1.8.Final from the shaded jar.
[INFO] Excluding io.netty:netty-codec-socks:jar:4.1.8.Final from the shaded jar.
[INFO] Excluding io.grpc:grpc-stub:jar:1.2.0 from the shaded jar.
[INFO] Excluding com.google.cloud:google-cloud-core:jar:1.0.2 from the shaded jar.
[INFO] Excluding org.json:json:jar:20160810 from the shaded jar.
[INFO] Excluding com.google.cloud:google-cloud-spanner:jar:0.20.0b-beta from the shaded jar.
[INFO] Excluding com.google.api.grpc:proto-google-cloud-spanner-v1:jar:0.1.11b from the shaded jar.
[INFO] Excluding com.google.api.grpc:proto-google-cloud-spanner-admin-instance-v1:jar:0.1.11 from the shaded jar.
[INFO] Excluding com.google.api.grpc:grpc-google-cloud-spanner-v1:jar:0.1.11b from the shaded jar.
[INFO] Excluding com.google.api.grpc:grpc-google-cloud-spanner-admin-database-v1:jar:0.1.11 from the shaded jar.
[INFO] Excluding com.google.api.grpc:grpc-google-cloud-spanner-admin-instance-v1:jar:0.1.11 from the shaded jar.
[INFO] Excluding com.google.api.grpc:grpc-google-longrunning-v1:jar:0.1.11 from the shaded jar.
[INFO] Excluding com.google.api.grpc:proto-google-longrunning-v1:jar:0.1.11 from the shaded jar.
[INFO] Excluding com.google.cloud.bigtable:bigtable-protos:jar:1.0.0-pre3 from the shaded jar.
[INFO] Excluding com.google.cloud.bigtable:bigtable-client-core:jar:1.0.0 from the shaded jar.
[INFO] Excluding com.google.auth:google-auth-library-appengine:jar:0.7.0 from the shaded jar.
[INFO] Excluding io.opencensus:opencensus-contrib-grpc-util:jar:0.7.0 from the shaded jar.
[INFO] Excluding io.opencensus:opencensus-api:jar:0.7.0 from the shaded jar.
[INFO] Excluding com.google.api.grpc:proto-google-cloud-spanner-admin-database-v1:jar:0.1.9 from the shaded jar.
[INFO] Excluding com.google.api.grpc:proto-google-common-protos:jar:0.1.9 from the shaded jar.
[INFO] Excluding io.grpc:grpc-all:jar:1.2.0 from the shaded jar.
[INFO] Excluding io.grpc:grpc-okhttp:jar:1.2.0 from the shaded jar.
[INFO] Excluding com.squareup.okhttp:okhttp:jar:2.5.0 from the shaded jar.
[INFO] Excluding com.squareup.okio:okio:jar:1.6.0 from the shaded jar.
[INFO] Excluding io.grpc:grpc-protobuf-lite:jar:1.2.0 from the shaded jar.
[INFO] Excluding io.grpc:grpc-protobuf-nano:jar:1.2.0 from the shaded jar.
[INFO] Excluding com.google.protobuf.nano:protobuf-javanano:jar:3.0.0-alpha-5 from the shaded jar.
[INFO] Excluding io.netty:netty-tcnative-boringssl-static:jar:1.1.33.Fork26 from the shaded jar.
[INFO] Excluding org.apache.beam:beam-runners-core-construction-java:jar:2.5.0-SNAPSHOT from the shaded jar.
[INFO] Excluding org.apache.beam:beam-model-job-management:jar:2.5.0-SNAPSHOT from the shaded jar.
[INFO] Excluding com.google.protobuf:protobuf-java-util:jar:3.2.0 from the shaded jar.
[INFO] Excluding com.google.api-client:google-api-client:jar:1.22.0 from the shaded jar.
[INFO] Excluding com.google.oauth-client:google-oauth-client:jar:1.22.0 from the shaded jar.
[INFO] Excluding com.google.http-client:google-http-client:jar:1.22.0 from the shaded jar.
[INFO] Excluding com.google.http-client:google-http-client-jackson2:jar:1.22.0 from the shaded jar.
[INFO] Excluding com.google.apis:google-api-services-dataflow:jar:v1b3-rev221-1.22.0 from the shaded jar.
[INFO] Excluding com.google.apis:google-api-services-clouddebugger:jar:v2-rev8-1.22.0 from the shaded jar.
[INFO] Excluding com.google.apis:google-api-services-storage:jar:v1-rev71-1.22.0 from the shaded jar.
[INFO] Excluding com.google.auth:google-auth-library-credentials:jar:0.7.1 from the shaded jar.
[INFO] Excluding com.google.auth:google-auth-library-oauth2-http:jar:0.7.1 from the shaded jar.
[INFO] Excluding com.google.cloud.bigdataoss:util:jar:1.4.5 from the shaded jar.
[INFO] Excluding com.google.api-client:google-api-client-java6:jar:1.22.0 from the shaded jar.
[INFO] Excluding com.google.api-client:google-api-client-jackson2:jar:1.22.0 from the shaded jar.
[INFO] Excluding com.google.oauth-client:google-oauth-client-java6:jar:1.22.0 from the shaded jar.
[INFO] Replacing original artifact with shaded artifact.
[INFO] Replacing <https://builds.apache.org/job/beam_PerformanceTests_HadoopInputFormat/ws/runs/a0a66377/beam/sdks/java/io/hadoop-input-format/target/beam-sdks-java-io-hadoop-input-format-2.5.0-SNAPSHOT.jar> with <https://builds.apache.org/job/beam_PerformanceTests_HadoopInputFormat/ws/runs/a0a66377/beam/sdks/java/io/hadoop-input-format/target/beam-sdks-java-io-hadoop-input-format-2.5.0-SNAPSHOT-shaded.jar>
[INFO] Replacing original test artifact with shaded test artifact.
[INFO] Replacing <https://builds.apache.org/job/beam_PerformanceTests_HadoopInputFormat/ws/runs/a0a66377/beam/sdks/java/io/hadoop-input-format/target/beam-sdks-java-io-hadoop-input-format-2.5.0-SNAPSHOT-tests.jar> with <https://builds.apache.org/job/beam_PerformanceTests_HadoopInputFormat/ws/runs/a0a66377/beam/sdks/java/io/hadoop-input-format/target/beam-sdks-java-io-hadoop-input-format-2.5.0-SNAPSHOT-shaded-tests.jar>
[INFO] Dependency-reduced POM written at: <https://builds.apache.org/job/beam_PerformanceTests_HadoopInputFormat/ws/runs/a0a66377/beam/sdks/java/io/hadoop-input-format/dependency-reduced-pom.xml>
[INFO]
[INFO] --- maven-failsafe-plugin:2.21.0:integration-test (default) @ beam-sdks-java-io-hadoop-input-format ---
[INFO] Failsafe report directory: <https://builds.apache.org/job/beam_PerformanceTests_HadoopInputFormat/ws/runs/a0a66377/beam/sdks/java/io/hadoop-input-format/target/failsafe-reports>
[INFO] parallel='all', perCoreThreadCount=true, threadCount=4, useUnlimitedThreads=false, threadCountSuites=0, threadCountClasses=0, threadCountMethods=0, parallelOptimized=true
[INFO]
[INFO] -------------------------------------------------------
[INFO] T E S T S
[INFO] -------------------------------------------------------
[INFO] Running org.apache.beam.sdk.io.hadoop.inputformat.HadoopInputFormatIOIT
[ERROR] Tests run: 1, Failures: 0, Errors: 1, Skipped: 0, Time elapsed: 1.868 s <<< FAILURE! - in org.apache.beam.sdk.io.hadoop.inputformat.HadoopInputFormatIOIT
[ERROR] readUsingHadoopInputFormat(org.apache.beam.sdk.io.hadoop.inputformat.HadoopInputFormatIOIT) Time elapsed: 1.868 s <<< ERROR!
java.lang.NoSuchMethodError: com.google.common.base.Preconditions.checkArgument(ZLjava/lang/String;Ljava/lang/Object;Ljava/lang/Object;)V
at org.apache.beam.runners.core.construction.PTransformReplacements.getSingletonMainInput(PTransformReplacements.java:50)
at org.apache.beam.runners.core.construction.PTransformReplacements.getSingletonMainInput(PTransformReplacements.java:41)
at org.apache.beam.runners.dataflow.ReshuffleOverrideFactory.getReplacementTransform(ReshuffleOverrideFactory.java:53)
at org.apache.beam.sdk.Pipeline.applyReplacement(Pipeline.java:552)
at org.apache.beam.sdk.Pipeline.replace(Pipeline.java:288)
at org.apache.beam.sdk.Pipeline.replaceAll(Pipeline.java:209)
at org.apache.beam.runners.dataflow.DataflowRunner.replaceTransforms(DataflowRunner.java:865)
at org.apache.beam.runners.dataflow.DataflowRunner.run(DataflowRunner.java:656)
at org.apache.beam.runners.dataflow.TestDataflowRunner.run(TestDataflowRunner.java:98)
at org.apache.beam.runners.dataflow.TestDataflowRunner.run(TestDataflowRunner.java:90)
at org.apache.beam.runners.dataflow.TestDataflowRunner.run(TestDataflowRunner.java:55)
at org.apache.beam.sdk.Pipeline.run(Pipeline.java:311)
at org.apache.beam.sdk.testing.TestPipeline.run(TestPipeline.java:346)
at org.apache.beam.sdk.testing.TestPipeline.run(TestPipeline.java:328)
at org.apache.beam.sdk.io.hadoop.inputformat.HadoopInputFormatIOIT.readUsingHadoopInputFormat(HadoopInputFormatIOIT.java:134)
at sun.reflect.NativeMethodAccessorImpl.invoke0(Native Method)
at sun.reflect.NativeMethodAccessorImpl.invoke(NativeMethodAccessorImpl.java:62)
at sun.reflect.DelegatingMethodAccessorImpl.invoke(DelegatingMethodAccessorImpl.java:43)
at java.lang.reflect.Method.invoke(Method.java:498)
at org.junit.runners.model.FrameworkMethod$1.runReflectiveCall(FrameworkMethod.java:50)
at org.junit.internal.runners.model.ReflectiveCallable.run(ReflectiveCallable.java:12)
at org.junit.runners.model.FrameworkMethod.invokeExplosively(FrameworkMethod.java:47)
at org.junit.internal.runners.statements.InvokeMethod.evaluate(InvokeMethod.java:17)
at org.apache.beam.sdk.testing.TestPipeline$1.evaluate(TestPipeline.java:317)
at org.apache.beam.sdk.testing.TestPipeline$1.evaluate(TestPipeline.java:317)
at org.junit.rules.RunRules.evaluate(RunRules.java:20)
at org.junit.runners.ParentRunner.runLeaf(ParentRunner.java:325)
at org.junit.runners.BlockJUnit4ClassRunner.runChild(BlockJUnit4ClassRunner.java:78)
at org.junit.runners.BlockJUnit4ClassRunner.runChild(BlockJUnit4ClassRunner.java:57)
at org.junit.runners.ParentRunner$3.run(ParentRunner.java:290)
at org.apache.maven.surefire.junitcore.pc.Scheduler$1.run(Scheduler.java:410)
at java.util.concurrent.Executors$RunnableAdapter.call(Executors.java:511)
at java.util.concurrent.FutureTask.run(FutureTask.java:266)
at java.util.concurrent.ThreadPoolExecutor.runWorker(ThreadPoolExecutor.java:1149)
at java.util.concurrent.ThreadPoolExecutor$Worker.run(ThreadPoolExecutor.java:624)
at java.lang.Thread.run(Thread.java:748)
[INFO]
[INFO] Results:
[INFO]
[ERROR] Errors:
[ERROR] HadoopInputFormatIOIT.readUsingHadoopInputFormat:134 NoSuchMethod com.google...
[INFO]
[ERROR] Tests run: 1, Failures: 0, Errors: 1, Skipped: 0
[INFO]
[INFO]
[INFO] --- maven-dependency-plugin:3.0.2:analyze-only (default) @ beam-sdks-java-io-hadoop-input-format ---
[INFO] No dependency problems found
[INFO]
[INFO] --- maven-failsafe-plugin:2.21.0:verify (default) @ beam-sdks-java-io-hadoop-input-format ---
[INFO] Failsafe report directory: <https://builds.apache.org/job/beam_PerformanceTests_HadoopInputFormat/ws/runs/a0a66377/beam/sdks/java/io/hadoop-input-format/target/failsafe-reports>
[INFO] ------------------------------------------------------------------------
[INFO] BUILD FAILURE
[INFO] ------------------------------------------------------------------------
[INFO] Total time: 42.720 s
[INFO] Finished at: 2018-04-13T18:04:46Z
[INFO] Final Memory: 128M/1305M
[INFO] ------------------------------------------------------------------------
[ERROR] Failed to execute goal org.apache.maven.plugins:maven-failsafe-plugin:2.21.0:verify (default) on project beam-sdks-java-io-hadoop-input-format: There are test failures.
[ERROR]
[ERROR] Please refer to <https://builds.apache.org/job/beam_PerformanceTests_HadoopInputFormat/ws/runs/a0a66377/beam/sdks/java/io/hadoop-input-format/target/failsafe-reports> for the individual test results.
[ERROR] Please refer to dump files (if any exist) [date]-jvmRun[N].dump, [date].dumpstream and [date]-jvmRun[N].dumpstream.
[ERROR] -> [Help 1]
org.apache.maven.lifecycle.LifecycleExecutionException: Failed to execute goal org.apache.maven.plugins:maven-failsafe-plugin:2.21.0:verify (default) on project beam-sdks-java-io-hadoop-input-format: There are test failures.
Please refer to <https://builds.apache.org/job/beam_PerformanceTests_HadoopInputFormat/ws/runs/a0a66377/beam/sdks/java/io/hadoop-input-format/target/failsafe-reports> for the individual test results.
Please refer to dump files (if any exist) [date]-jvmRun[N].dump, [date].dumpstream and [date]-jvmRun[N].dumpstream.
at org.apache.maven.lifecycle.internal.MojoExecutor.execute (MojoExecutor.java:213)
at org.apache.maven.lifecycle.internal.MojoExecutor.execute (MojoExecutor.java:154)
at org.apache.maven.lifecycle.internal.MojoExecutor.execute (MojoExecutor.java:146)
at org.apache.maven.lifecycle.internal.LifecycleModuleBuilder.buildProject (LifecycleModuleBuilder.java:117)
at org.apache.maven.lifecycle.internal.LifecycleModuleBuilder.buildProject (LifecycleModuleBuilder.java:81)
at org.apache.maven.lifecycle.internal.builder.singlethreaded.SingleThreadedBuilder.build (SingleThreadedBuilder.java:51)
at org.apache.maven.lifecycle.internal.LifecycleStarter.execute (LifecycleStarter.java:128)
at org.apache.maven.DefaultMaven.doExecute (DefaultMaven.java:309)
at org.apache.maven.DefaultMaven.doExecute (DefaultMaven.java:194)
at org.apache.maven.DefaultMaven.execute (DefaultMaven.java:107)
at org.apache.maven.cli.MavenCli.execute (MavenCli.java:955)
at org.apache.maven.cli.MavenCli.doMain (MavenCli.java:290)
at org.apache.maven.cli.MavenCli.main (MavenCli.java:194)
at sun.reflect.NativeMethodAccessorImpl.invoke0 (Native Method)
at sun.reflect.NativeMethodAccessorImpl.invoke (NativeMethodAccessorImpl.java:62)
at sun.reflect.DelegatingMethodAccessorImpl.invoke (DelegatingMethodAccessorImpl.java:43)
at java.lang.reflect.Method.invoke (Method.java:498)
at org.codehaus.plexus.classworlds.launcher.Launcher.launchEnhanced (Launcher.java:289)
at org.codehaus.plexus.classworlds.launcher.Launcher.launch (Launcher.java:229)
at org.codehaus.plexus.classworlds.launcher.Launcher.mainWithExitCode (Launcher.java:415)
at org.codehaus.plexus.classworlds.launcher.Launcher.main (Launcher.java:356)
Caused by: org.apache.maven.plugin.MojoFailureException: There are test failures.
Please refer to <https://builds.apache.org/job/beam_PerformanceTests_HadoopInputFormat/ws/runs/a0a66377/beam/sdks/java/io/hadoop-input-format/target/failsafe-reports> for the individual test results.
Please refer to dump files (if any exist) [date]-jvmRun[N].dump, [date].dumpstream and [date]-jvmRun[N].dumpstream.
at org.apache.maven.plugin.surefire.SurefireHelper.throwException (SurefireHelper.java:240)
at org.apache.maven.plugin.surefire.SurefireHelper.reportExecution (SurefireHelper.java:112)
at org.apache.maven.plugin.failsafe.VerifyMojo.execute (VerifyMojo.java:192)
at org.apache.maven.plugin.DefaultBuildPluginManager.executeMojo (DefaultBuildPluginManager.java:134)
at org.apache.maven.lifecycle.internal.MojoExecutor.execute (MojoExecutor.java:208)
at org.apache.maven.lifecycle.internal.MojoExecutor.execute (MojoExecutor.java:154)
at org.apache.maven.lifecycle.internal.MojoExecutor.execute (MojoExecutor.java:146)
at org.apache.maven.lifecycle.internal.LifecycleModuleBuilder.buildProject (LifecycleModuleBuilder.java:117)
at org.apache.maven.lifecycle.internal.LifecycleModuleBuilder.buildProject (LifecycleModuleBuilder.java:81)
at org.apache.maven.lifecycle.internal.builder.singlethreaded.SingleThreadedBuilder.build (SingleThreadedBuilder.java:51)
at org.apache.maven.lifecycle.internal.LifecycleStarter.execute (LifecycleStarter.java:128)
at org.apache.maven.DefaultMaven.doExecute (DefaultMaven.java:309)
at org.apache.maven.DefaultMaven.doExecute (DefaultMaven.java:194)
at org.apache.maven.DefaultMaven.execute (DefaultMaven.java:107)
at org.apache.maven.cli.MavenCli.execute (MavenCli.java:955)
at org.apache.maven.cli.MavenCli.doMain (MavenCli.java:290)
at org.apache.maven.cli.MavenCli.main (MavenCli.java:194)
at sun.reflect.NativeMethodAccessorImpl.invoke0 (Native Method)
at sun.reflect.NativeMethodAccessorImpl.invoke (NativeMethodAccessorImpl.java:62)
at sun.reflect.DelegatingMethodAccessorImpl.invoke (DelegatingMethodAccessorImpl.java:43)
at java.lang.reflect.Method.invoke (Method.java:498)
at org.codehaus.plexus.classworlds.launcher.Launcher.launchEnhanced (Launcher.java:289)
at org.codehaus.plexus.classworlds.launcher.Launcher.launch (Launcher.java:229)
at org.codehaus.plexus.classworlds.launcher.Launcher.mainWithExitCode (Launcher.java:415)
at org.codehaus.plexus.classworlds.launcher.Launcher.main (Launcher.java:356)
[ERROR]
[ERROR] Re-run Maven using the -X switch to enable full debug logging.
[ERROR]
[ERROR] For more information about the errors and possible solutions, please read the following articles:
[ERROR] [Help 1] http://cwiki.apache.org/confluence/display/MAVEN/MojoFailureException
STDERR:
2018-04-13 18:04:47,312 a0a66377 MainThread beam_integration_benchmark(1/1) ERROR Error during benchmark beam_integration_benchmark
Traceback (most recent call last):
File "<https://builds.apache.org/job/beam_PerformanceTests_HadoopInputFormat/ws/PerfKitBenchmarker/perfkitbenchmarker/pkb.py",> line 623, in RunBenchmark
DoRunPhase(spec, collector, detailed_timer)
File "<https://builds.apache.org/job/beam_PerformanceTests_HadoopInputFormat/ws/PerfKitBenchmarker/perfkitbenchmarker/pkb.py",> line 526, in DoRunPhase
samples = spec.BenchmarkRun(spec)
File "<https://builds.apache.org/job/beam_PerformanceTests_HadoopInputFormat/ws/PerfKitBenchmarker/perfkitbenchmarker/linux_benchmarks/beam_integration_benchmark.py",> line 159, in Run
job_type=job_type)
File "<https://builds.apache.org/job/beam_PerformanceTests_HadoopInputFormat/ws/PerfKitBenchmarker/perfkitbenchmarker/providers/gcp/gcp_dpb_dataflow.py",> line 90, in SubmitJob
assert retcode == 0, "Integration Test Failed."
AssertionError: Integration Test Failed.
2018-04-13 18:04:47,312 a0a66377 MainThread beam_integration_benchmark(1/1) INFO Cleaning up benchmark beam_integration_benchmark
2018-04-13 18:04:47,313 a0a66377 MainThread beam_integration_benchmark(1/1) INFO Running: kubectl --kubeconfig=<https://builds.apache.org/job/beam_PerformanceTests_HadoopInputFormat/ws/config-hadoopinputformatioit-1523631716162> delete -f <https://builds.apache.org/job/beam_PerformanceTests_HadoopInputFormat/ws/src/.test-infra/kubernetes/postgres/postgres-service-for-local-dev.yml>
2018-04-13 18:04:47,801 a0a66377 MainThread beam_integration_benchmark(1/1) ERROR Exception running benchmark
Traceback (most recent call last):
File "<https://builds.apache.org/job/beam_PerformanceTests_HadoopInputFormat/ws/PerfKitBenchmarker/perfkitbenchmarker/pkb.py",> line 757, in RunBenchmarkTask
RunBenchmark(spec, collector)
File "<https://builds.apache.org/job/beam_PerformanceTests_HadoopInputFormat/ws/PerfKitBenchmarker/perfkitbenchmarker/pkb.py",> line 623, in RunBenchmark
DoRunPhase(spec, collector, detailed_timer)
File "<https://builds.apache.org/job/beam_PerformanceTests_HadoopInputFormat/ws/PerfKitBenchmarker/perfkitbenchmarker/pkb.py",> line 526, in DoRunPhase
samples = spec.BenchmarkRun(spec)
File "<https://builds.apache.org/job/beam_PerformanceTests_HadoopInputFormat/ws/PerfKitBenchmarker/perfkitbenchmarker/linux_benchmarks/beam_integration_benchmark.py",> line 159, in Run
job_type=job_type)
File "<https://builds.apache.org/job/beam_PerformanceTests_HadoopInputFormat/ws/PerfKitBenchmarker/perfkitbenchmarker/providers/gcp/gcp_dpb_dataflow.py",> line 90, in SubmitJob
assert retcode == 0, "Integration Test Failed."
AssertionError: Integration Test Failed.
2018-04-13 18:04:47,801 a0a66377 MainThread beam_integration_benchmark(1/1) ERROR Benchmark 1/1 beam_integration_benchmark (UID: beam_integration_benchmark0) failed. Execution will continue.
2018-04-13 18:04:47,816 a0a66377 MainThread INFO Benchmark run statuses:
---------------------------------------------------------------------------------
Name UID Status Failed Substatus
---------------------------------------------------------------------------------
beam_integration_benchmark beam_integration_benchmark0 FAILED
---------------------------------------------------------------------------------
Success rate: 0.00% (0/1)
2018-04-13 18:04:47,816 a0a66377 MainThread INFO Complete logs can be found at: <https://builds.apache.org/job/beam_PerformanceTests_HadoopInputFormat/ws/runs/a0a66377/pkb.log>
2018-04-13 18:04:47,816 a0a66377 MainThread INFO Completion statuses can be found at: <https://builds.apache.org/job/beam_PerformanceTests_HadoopInputFormat/ws/runs/a0a66377/completion_statuses.json>
Build step 'Execute shell' marked build as failure
Build failed in Jenkins: beam_PerformanceTests_HadoopInputFormat
#136
Posted by Apache Jenkins Server <je...@builds.apache.org>.
See <https://builds.apache.org/job/beam_PerformanceTests_HadoopInputFormat/136/display/redirect>
------------------------------------------
[...truncated 141.74 KB...]
[INFO] Excluding com.google.cloud.bigdataoss:gcsio:jar:1.4.5 from the shaded jar.
[INFO] Excluding com.google.apis:google-api-services-cloudresourcemanager:jar:v1-rev6-1.22.0 from the shaded jar.
[INFO] Excluding org.apache.beam:beam-sdks-java-io-google-cloud-platform:jar:2.5.0-SNAPSHOT from the shaded jar.
[INFO] Excluding org.apache.beam:beam-sdks-java-extensions-protobuf:jar:2.5.0-SNAPSHOT from the shaded jar.
[INFO] Excluding io.grpc:grpc-core:jar:1.2.0 from the shaded jar.
[INFO] Excluding com.google.errorprone:error_prone_annotations:jar:2.0.15 from the shaded jar.
[INFO] Excluding io.grpc:grpc-context:jar:1.2.0 from the shaded jar.
[INFO] Excluding com.google.instrumentation:instrumentation-api:jar:0.3.0 from the shaded jar.
[INFO] Excluding com.google.apis:google-api-services-bigquery:jar:v2-rev374-1.22.0 from the shaded jar.
[INFO] Excluding com.google.api:gax-grpc:jar:0.20.0 from the shaded jar.
[INFO] Excluding io.grpc:grpc-protobuf:jar:1.2.0 from the shaded jar.
[INFO] Excluding com.google.api:api-common:jar:1.0.0-rc2 from the shaded jar.
[INFO] Excluding com.google.api:gax:jar:1.3.1 from the shaded jar.
[INFO] Excluding org.threeten:threetenbp:jar:1.3.3 from the shaded jar.
[INFO] Excluding com.google.cloud:google-cloud-core-grpc:jar:1.2.0 from the shaded jar.
[INFO] Excluding com.google.apis:google-api-services-pubsub:jar:v1-rev10-1.22.0 from the shaded jar.
[INFO] Excluding com.google.api.grpc:grpc-google-cloud-pubsub-v1:jar:0.1.18 from the shaded jar.
[INFO] Excluding com.google.api.grpc:proto-google-cloud-pubsub-v1:jar:0.1.18 from the shaded jar.
[INFO] Excluding com.google.api.grpc:proto-google-iam-v1:jar:0.1.18 from the shaded jar.
[INFO] Excluding com.google.cloud.datastore:datastore-v1-proto-client:jar:1.4.0 from the shaded jar.
[INFO] Excluding com.google.http-client:google-http-client-protobuf:jar:1.22.0 from the shaded jar.
[INFO] Excluding com.google.http-client:google-http-client-jackson:jar:1.22.0 from the shaded jar.
[INFO] Excluding com.google.cloud.datastore:datastore-v1-protos:jar:1.3.0 from the shaded jar.
[INFO] Excluding com.google.api.grpc:grpc-google-common-protos:jar:0.1.9 from the shaded jar.
[INFO] Excluding io.grpc:grpc-auth:jar:1.2.0 from the shaded jar.
[INFO] Excluding io.grpc:grpc-netty:jar:1.2.0 from the shaded jar.
[INFO] Excluding io.netty:netty-codec-http2:jar:4.1.8.Final from the shaded jar.
[INFO] Excluding io.netty:netty-handler-proxy:jar:4.1.8.Final from the shaded jar.
[INFO] Excluding io.netty:netty-codec-socks:jar:4.1.8.Final from the shaded jar.
[INFO] Excluding io.grpc:grpc-stub:jar:1.2.0 from the shaded jar.
[INFO] Excluding com.google.cloud:google-cloud-core:jar:1.0.2 from the shaded jar.
[INFO] Excluding org.json:json:jar:20160810 from the shaded jar.
[INFO] Excluding com.google.cloud:google-cloud-spanner:jar:0.20.0b-beta from the shaded jar.
[INFO] Excluding com.google.api.grpc:proto-google-cloud-spanner-v1:jar:0.1.11b from the shaded jar.
[INFO] Excluding com.google.api.grpc:proto-google-cloud-spanner-admin-instance-v1:jar:0.1.11 from the shaded jar.
[INFO] Excluding com.google.api.grpc:grpc-google-cloud-spanner-v1:jar:0.1.11b from the shaded jar.
[INFO] Excluding com.google.api.grpc:grpc-google-cloud-spanner-admin-database-v1:jar:0.1.11 from the shaded jar.
[INFO] Excluding com.google.api.grpc:grpc-google-cloud-spanner-admin-instance-v1:jar:0.1.11 from the shaded jar.
[INFO] Excluding com.google.api.grpc:grpc-google-longrunning-v1:jar:0.1.11 from the shaded jar.
[INFO] Excluding com.google.api.grpc:proto-google-longrunning-v1:jar:0.1.11 from the shaded jar.
[INFO] Excluding com.google.cloud.bigtable:bigtable-protos:jar:1.0.0-pre3 from the shaded jar.
[INFO] Excluding com.google.cloud.bigtable:bigtable-client-core:jar:1.0.0 from the shaded jar.
[INFO] Excluding com.google.auth:google-auth-library-appengine:jar:0.7.0 from the shaded jar.
[INFO] Excluding io.opencensus:opencensus-contrib-grpc-util:jar:0.7.0 from the shaded jar.
[INFO] Excluding io.opencensus:opencensus-api:jar:0.7.0 from the shaded jar.
[INFO] Excluding com.google.api.grpc:proto-google-cloud-spanner-admin-database-v1:jar:0.1.9 from the shaded jar.
[INFO] Excluding com.google.api.grpc:proto-google-common-protos:jar:0.1.9 from the shaded jar.
[INFO] Excluding io.grpc:grpc-all:jar:1.2.0 from the shaded jar.
[INFO] Excluding io.grpc:grpc-okhttp:jar:1.2.0 from the shaded jar.
[INFO] Excluding com.squareup.okhttp:okhttp:jar:2.5.0 from the shaded jar.
[INFO] Excluding com.squareup.okio:okio:jar:1.6.0 from the shaded jar.
[INFO] Excluding io.grpc:grpc-protobuf-lite:jar:1.2.0 from the shaded jar.
[INFO] Excluding io.grpc:grpc-protobuf-nano:jar:1.2.0 from the shaded jar.
[INFO] Excluding com.google.protobuf.nano:protobuf-javanano:jar:3.0.0-alpha-5 from the shaded jar.
[INFO] Excluding io.netty:netty-tcnative-boringssl-static:jar:1.1.33.Fork26 from the shaded jar.
[INFO] Excluding org.apache.beam:beam-runners-core-construction-java:jar:2.5.0-SNAPSHOT from the shaded jar.
[INFO] Excluding org.apache.beam:beam-model-job-management:jar:2.5.0-SNAPSHOT from the shaded jar.
[INFO] Excluding com.google.protobuf:protobuf-java-util:jar:3.2.0 from the shaded jar.
[INFO] Excluding com.google.api-client:google-api-client:jar:1.22.0 from the shaded jar.
[INFO] Excluding com.google.oauth-client:google-oauth-client:jar:1.22.0 from the shaded jar.
[INFO] Excluding com.google.http-client:google-http-client:jar:1.22.0 from the shaded jar.
[INFO] Excluding com.google.http-client:google-http-client-jackson2:jar:1.22.0 from the shaded jar.
[INFO] Excluding com.google.apis:google-api-services-dataflow:jar:v1b3-rev221-1.22.0 from the shaded jar.
[INFO] Excluding com.google.apis:google-api-services-clouddebugger:jar:v2-rev8-1.22.0 from the shaded jar.
[INFO] Excluding com.google.apis:google-api-services-storage:jar:v1-rev71-1.22.0 from the shaded jar.
[INFO] Excluding com.google.auth:google-auth-library-credentials:jar:0.7.1 from the shaded jar.
[INFO] Excluding com.google.auth:google-auth-library-oauth2-http:jar:0.7.1 from the shaded jar.
[INFO] Excluding com.google.cloud.bigdataoss:util:jar:1.4.5 from the shaded jar.
[INFO] Excluding com.google.api-client:google-api-client-java6:jar:1.22.0 from the shaded jar.
[INFO] Excluding com.google.api-client:google-api-client-jackson2:jar:1.22.0 from the shaded jar.
[INFO] Excluding com.google.oauth-client:google-oauth-client-java6:jar:1.22.0 from the shaded jar.
[INFO] Replacing original artifact with shaded artifact.
[INFO] Replacing <https://builds.apache.org/job/beam_PerformanceTests_HadoopInputFormat/ws/runs/38755a35/beam/sdks/java/io/hadoop-input-format/target/beam-sdks-java-io-hadoop-input-format-2.5.0-SNAPSHOT.jar> with <https://builds.apache.org/job/beam_PerformanceTests_HadoopInputFormat/ws/runs/38755a35/beam/sdks/java/io/hadoop-input-format/target/beam-sdks-java-io-hadoop-input-format-2.5.0-SNAPSHOT-shaded.jar>
[INFO] Replacing original test artifact with shaded test artifact.
[INFO] Replacing <https://builds.apache.org/job/beam_PerformanceTests_HadoopInputFormat/ws/runs/38755a35/beam/sdks/java/io/hadoop-input-format/target/beam-sdks-java-io-hadoop-input-format-2.5.0-SNAPSHOT-tests.jar> with <https://builds.apache.org/job/beam_PerformanceTests_HadoopInputFormat/ws/runs/38755a35/beam/sdks/java/io/hadoop-input-format/target/beam-sdks-java-io-hadoop-input-format-2.5.0-SNAPSHOT-shaded-tests.jar>
[INFO] Dependency-reduced POM written at: <https://builds.apache.org/job/beam_PerformanceTests_HadoopInputFormat/ws/runs/38755a35/beam/sdks/java/io/hadoop-input-format/dependency-reduced-pom.xml>
[INFO]
[INFO] --- maven-failsafe-plugin:2.21.0:integration-test (default) @ beam-sdks-java-io-hadoop-input-format ---
[INFO] Failsafe report directory: <https://builds.apache.org/job/beam_PerformanceTests_HadoopInputFormat/ws/runs/38755a35/beam/sdks/java/io/hadoop-input-format/target/failsafe-reports>
[INFO] parallel='all', perCoreThreadCount=true, threadCount=4, useUnlimitedThreads=false, threadCountSuites=0, threadCountClasses=0, threadCountMethods=0, parallelOptimized=true
[INFO]
[INFO] -------------------------------------------------------
[INFO] T E S T S
[INFO] -------------------------------------------------------
[INFO] Running org.apache.beam.sdk.io.hadoop.inputformat.HadoopInputFormatIOIT
[ERROR] Tests run: 1, Failures: 0, Errors: 1, Skipped: 0, Time elapsed: 2.056 s <<< FAILURE! - in org.apache.beam.sdk.io.hadoop.inputformat.HadoopInputFormatIOIT
[ERROR] readUsingHadoopInputFormat(org.apache.beam.sdk.io.hadoop.inputformat.HadoopInputFormatIOIT) Time elapsed: 2.056 s <<< ERROR!
java.lang.NoSuchMethodError: com.google.common.base.Preconditions.checkArgument(ZLjava/lang/String;Ljava/lang/Object;Ljava/lang/Object;)V
at org.apache.beam.runners.core.construction.PTransformReplacements.getSingletonMainInput(PTransformReplacements.java:50)
at org.apache.beam.runners.core.construction.PTransformReplacements.getSingletonMainInput(PTransformReplacements.java:41)
at org.apache.beam.runners.dataflow.ReshuffleOverrideFactory.getReplacementTransform(ReshuffleOverrideFactory.java:53)
at org.apache.beam.sdk.Pipeline.applyReplacement(Pipeline.java:552)
at org.apache.beam.sdk.Pipeline.replace(Pipeline.java:288)
at org.apache.beam.sdk.Pipeline.replaceAll(Pipeline.java:209)
at org.apache.beam.runners.dataflow.DataflowRunner.replaceTransforms(DataflowRunner.java:865)
at org.apache.beam.runners.dataflow.DataflowRunner.run(DataflowRunner.java:656)
at org.apache.beam.runners.dataflow.TestDataflowRunner.run(TestDataflowRunner.java:98)
at org.apache.beam.runners.dataflow.TestDataflowRunner.run(TestDataflowRunner.java:90)
at org.apache.beam.runners.dataflow.TestDataflowRunner.run(TestDataflowRunner.java:55)
at org.apache.beam.sdk.Pipeline.run(Pipeline.java:311)
at org.apache.beam.sdk.testing.TestPipeline.run(TestPipeline.java:346)
at org.apache.beam.sdk.testing.TestPipeline.run(TestPipeline.java:328)
at org.apache.beam.sdk.io.hadoop.inputformat.HadoopInputFormatIOIT.readUsingHadoopInputFormat(HadoopInputFormatIOIT.java:134)
at sun.reflect.NativeMethodAccessorImpl.invoke0(Native Method)
at sun.reflect.NativeMethodAccessorImpl.invoke(NativeMethodAccessorImpl.java:62)
at sun.reflect.DelegatingMethodAccessorImpl.invoke(DelegatingMethodAccessorImpl.java:43)
at java.lang.reflect.Method.invoke(Method.java:498)
at org.junit.runners.model.FrameworkMethod$1.runReflectiveCall(FrameworkMethod.java:50)
at org.junit.internal.runners.model.ReflectiveCallable.run(ReflectiveCallable.java:12)
at org.junit.runners.model.FrameworkMethod.invokeExplosively(FrameworkMethod.java:47)
at org.junit.internal.runners.statements.InvokeMethod.evaluate(InvokeMethod.java:17)
at org.apache.beam.sdk.testing.TestPipeline$1.evaluate(TestPipeline.java:317)
at org.apache.beam.sdk.testing.TestPipeline$1.evaluate(TestPipeline.java:317)
at org.junit.rules.RunRules.evaluate(RunRules.java:20)
at org.junit.runners.ParentRunner.runLeaf(ParentRunner.java:325)
at org.junit.runners.BlockJUnit4ClassRunner.runChild(BlockJUnit4ClassRunner.java:78)
at org.junit.runners.BlockJUnit4ClassRunner.runChild(BlockJUnit4ClassRunner.java:57)
at org.junit.runners.ParentRunner$3.run(ParentRunner.java:290)
at org.apache.maven.surefire.junitcore.pc.Scheduler$1.run(Scheduler.java:410)
at java.util.concurrent.Executors$RunnableAdapter.call(Executors.java:511)
at java.util.concurrent.FutureTask.run(FutureTask.java:266)
at java.util.concurrent.ThreadPoolExecutor.runWorker(ThreadPoolExecutor.java:1149)
at java.util.concurrent.ThreadPoolExecutor$Worker.run(ThreadPoolExecutor.java:624)
at java.lang.Thread.run(Thread.java:748)
[INFO]
[INFO] Results:
[INFO]
[ERROR] Errors:
[ERROR] HadoopInputFormatIOIT.readUsingHadoopInputFormat:134 NoSuchMethod com.google...
[INFO]
[ERROR] Tests run: 1, Failures: 0, Errors: 1, Skipped: 0
[INFO]
[INFO]
[INFO] --- maven-dependency-plugin:3.0.2:analyze-only (default) @ beam-sdks-java-io-hadoop-input-format ---
[INFO] No dependency problems found
[INFO]
[INFO] --- maven-failsafe-plugin:2.21.0:verify (default) @ beam-sdks-java-io-hadoop-input-format ---
[INFO] Failsafe report directory: <https://builds.apache.org/job/beam_PerformanceTests_HadoopInputFormat/ws/runs/38755a35/beam/sdks/java/io/hadoop-input-format/target/failsafe-reports>
[INFO] ------------------------------------------------------------------------
[INFO] BUILD FAILURE
[INFO] ------------------------------------------------------------------------
[INFO] Total time: 44.511 s
[INFO] Finished at: 2018-04-13T12:03:27Z
[INFO] Final Memory: 130M/1490M
[INFO] ------------------------------------------------------------------------
[ERROR] Failed to execute goal org.apache.maven.plugins:maven-failsafe-plugin:2.21.0:verify (default) on project beam-sdks-java-io-hadoop-input-format: There are test failures.
[ERROR]
[ERROR] Please refer to <https://builds.apache.org/job/beam_PerformanceTests_HadoopInputFormat/ws/runs/38755a35/beam/sdks/java/io/hadoop-input-format/target/failsafe-reports> for the individual test results.
[ERROR] Please refer to dump files (if any exist) [date]-jvmRun[N].dump, [date].dumpstream and [date]-jvmRun[N].dumpstream.
[ERROR] -> [Help 1]
org.apache.maven.lifecycle.LifecycleExecutionException: Failed to execute goal org.apache.maven.plugins:maven-failsafe-plugin:2.21.0:verify (default) on project beam-sdks-java-io-hadoop-input-format: There are test failures.
Please refer to <https://builds.apache.org/job/beam_PerformanceTests_HadoopInputFormat/ws/runs/38755a35/beam/sdks/java/io/hadoop-input-format/target/failsafe-reports> for the individual test results.
Please refer to dump files (if any exist) [date]-jvmRun[N].dump, [date].dumpstream and [date]-jvmRun[N].dumpstream.
at org.apache.maven.lifecycle.internal.MojoExecutor.execute (MojoExecutor.java:213)
at org.apache.maven.lifecycle.internal.MojoExecutor.execute (MojoExecutor.java:154)
at org.apache.maven.lifecycle.internal.MojoExecutor.execute (MojoExecutor.java:146)
at org.apache.maven.lifecycle.internal.LifecycleModuleBuilder.buildProject (LifecycleModuleBuilder.java:117)
at org.apache.maven.lifecycle.internal.LifecycleModuleBuilder.buildProject (LifecycleModuleBuilder.java:81)
at org.apache.maven.lifecycle.internal.builder.singlethreaded.SingleThreadedBuilder.build (SingleThreadedBuilder.java:51)
at org.apache.maven.lifecycle.internal.LifecycleStarter.execute (LifecycleStarter.java:128)
at org.apache.maven.DefaultMaven.doExecute (DefaultMaven.java:309)
at org.apache.maven.DefaultMaven.doExecute (DefaultMaven.java:194)
at org.apache.maven.DefaultMaven.execute (DefaultMaven.java:107)
at org.apache.maven.cli.MavenCli.execute (MavenCli.java:955)
at org.apache.maven.cli.MavenCli.doMain (MavenCli.java:290)
at org.apache.maven.cli.MavenCli.main (MavenCli.java:194)
at sun.reflect.NativeMethodAccessorImpl.invoke0 (Native Method)
at sun.reflect.NativeMethodAccessorImpl.invoke (NativeMethodAccessorImpl.java:62)
at sun.reflect.DelegatingMethodAccessorImpl.invoke (DelegatingMethodAccessorImpl.java:43)
at java.lang.reflect.Method.invoke (Method.java:498)
at org.codehaus.plexus.classworlds.launcher.Launcher.launchEnhanced (Launcher.java:289)
at org.codehaus.plexus.classworlds.launcher.Launcher.launch (Launcher.java:229)
at org.codehaus.plexus.classworlds.launcher.Launcher.mainWithExitCode (Launcher.java:415)
at org.codehaus.plexus.classworlds.launcher.Launcher.main (Launcher.java:356)
Caused by: org.apache.maven.plugin.MojoFailureException: There are test failures.
Please refer to <https://builds.apache.org/job/beam_PerformanceTests_HadoopInputFormat/ws/runs/38755a35/beam/sdks/java/io/hadoop-input-format/target/failsafe-reports> for the individual test results.
Please refer to dump files (if any exist) [date]-jvmRun[N].dump, [date].dumpstream and [date]-jvmRun[N].dumpstream.
at org.apache.maven.plugin.surefire.SurefireHelper.throwException (SurefireHelper.java:240)
at org.apache.maven.plugin.surefire.SurefireHelper.reportExecution (SurefireHelper.java:112)
at org.apache.maven.plugin.failsafe.VerifyMojo.execute (VerifyMojo.java:192)
at org.apache.maven.plugin.DefaultBuildPluginManager.executeMojo (DefaultBuildPluginManager.java:134)
at org.apache.maven.lifecycle.internal.MojoExecutor.execute (MojoExecutor.java:208)
at org.apache.maven.lifecycle.internal.MojoExecutor.execute (MojoExecutor.java:154)
at org.apache.maven.lifecycle.internal.MojoExecutor.execute (MojoExecutor.java:146)
at org.apache.maven.lifecycle.internal.LifecycleModuleBuilder.buildProject (LifecycleModuleBuilder.java:117)
at org.apache.maven.lifecycle.internal.LifecycleModuleBuilder.buildProject (LifecycleModuleBuilder.java:81)
at org.apache.maven.lifecycle.internal.builder.singlethreaded.SingleThreadedBuilder.build (SingleThreadedBuilder.java:51)
at org.apache.maven.lifecycle.internal.LifecycleStarter.execute (LifecycleStarter.java:128)
at org.apache.maven.DefaultMaven.doExecute (DefaultMaven.java:309)
at org.apache.maven.DefaultMaven.doExecute (DefaultMaven.java:194)
at org.apache.maven.DefaultMaven.execute (DefaultMaven.java:107)
at org.apache.maven.cli.MavenCli.execute (MavenCli.java:955)
at org.apache.maven.cli.MavenCli.doMain (MavenCli.java:290)
at org.apache.maven.cli.MavenCli.main (MavenCli.java:194)
at sun.reflect.NativeMethodAccessorImpl.invoke0 (Native Method)
at sun.reflect.NativeMethodAccessorImpl.invoke (NativeMethodAccessorImpl.java:62)
at sun.reflect.DelegatingMethodAccessorImpl.invoke (DelegatingMethodAccessorImpl.java:43)
at java.lang.reflect.Method.invoke (Method.java:498)
at org.codehaus.plexus.classworlds.launcher.Launcher.launchEnhanced (Launcher.java:289)
at org.codehaus.plexus.classworlds.launcher.Launcher.launch (Launcher.java:229)
at org.codehaus.plexus.classworlds.launcher.Launcher.mainWithExitCode (Launcher.java:415)
at org.codehaus.plexus.classworlds.launcher.Launcher.main (Launcher.java:356)
[ERROR]
[ERROR] Re-run Maven using the -X switch to enable full debug logging.
[ERROR]
[ERROR] For more information about the errors and possible solutions, please read the following articles:
[ERROR] [Help 1] http://cwiki.apache.org/confluence/display/MAVEN/MojoFailureException
STDERR:
2018-04-13 12:03:28,612 38755a35 MainThread beam_integration_benchmark(1/1) ERROR Error during benchmark beam_integration_benchmark
Traceback (most recent call last):
File "<https://builds.apache.org/job/beam_PerformanceTests_HadoopInputFormat/ws/PerfKitBenchmarker/perfkitbenchmarker/pkb.py",> line 623, in RunBenchmark
DoRunPhase(spec, collector, detailed_timer)
File "<https://builds.apache.org/job/beam_PerformanceTests_HadoopInputFormat/ws/PerfKitBenchmarker/perfkitbenchmarker/pkb.py",> line 526, in DoRunPhase
samples = spec.BenchmarkRun(spec)
File "<https://builds.apache.org/job/beam_PerformanceTests_HadoopInputFormat/ws/PerfKitBenchmarker/perfkitbenchmarker/linux_benchmarks/beam_integration_benchmark.py",> line 159, in Run
job_type=job_type)
File "<https://builds.apache.org/job/beam_PerformanceTests_HadoopInputFormat/ws/PerfKitBenchmarker/perfkitbenchmarker/providers/gcp/gcp_dpb_dataflow.py",> line 90, in SubmitJob
assert retcode == 0, "Integration Test Failed."
AssertionError: Integration Test Failed.
2018-04-13 12:03:28,613 38755a35 MainThread beam_integration_benchmark(1/1) INFO Cleaning up benchmark beam_integration_benchmark
2018-04-13 12:03:28,613 38755a35 MainThread beam_integration_benchmark(1/1) INFO Running: kubectl --kubeconfig=<https://builds.apache.org/job/beam_PerformanceTests_HadoopInputFormat/ws/config-hadoopinputformatioit-1523613711948> delete -f <https://builds.apache.org/job/beam_PerformanceTests_HadoopInputFormat/ws/src/.test-infra/kubernetes/postgres/postgres-service-for-local-dev.yml>
2018-04-13 12:03:29,040 38755a35 MainThread beam_integration_benchmark(1/1) ERROR Exception running benchmark
Traceback (most recent call last):
File "<https://builds.apache.org/job/beam_PerformanceTests_HadoopInputFormat/ws/PerfKitBenchmarker/perfkitbenchmarker/pkb.py",> line 757, in RunBenchmarkTask
RunBenchmark(spec, collector)
File "<https://builds.apache.org/job/beam_PerformanceTests_HadoopInputFormat/ws/PerfKitBenchmarker/perfkitbenchmarker/pkb.py",> line 623, in RunBenchmark
DoRunPhase(spec, collector, detailed_timer)
File "<https://builds.apache.org/job/beam_PerformanceTests_HadoopInputFormat/ws/PerfKitBenchmarker/perfkitbenchmarker/pkb.py",> line 526, in DoRunPhase
samples = spec.BenchmarkRun(spec)
File "<https://builds.apache.org/job/beam_PerformanceTests_HadoopInputFormat/ws/PerfKitBenchmarker/perfkitbenchmarker/linux_benchmarks/beam_integration_benchmark.py",> line 159, in Run
job_type=job_type)
File "<https://builds.apache.org/job/beam_PerformanceTests_HadoopInputFormat/ws/PerfKitBenchmarker/perfkitbenchmarker/providers/gcp/gcp_dpb_dataflow.py",> line 90, in SubmitJob
assert retcode == 0, "Integration Test Failed."
AssertionError: Integration Test Failed.
2018-04-13 12:03:29,040 38755a35 MainThread beam_integration_benchmark(1/1) ERROR Benchmark 1/1 beam_integration_benchmark (UID: beam_integration_benchmark0) failed. Execution will continue.
2018-04-13 12:03:29,051 38755a35 MainThread INFO Benchmark run statuses:
---------------------------------------------------------------------------------
Name UID Status Failed Substatus
---------------------------------------------------------------------------------
beam_integration_benchmark beam_integration_benchmark0 FAILED
---------------------------------------------------------------------------------
Success rate: 0.00% (0/1)
2018-04-13 12:03:29,052 38755a35 MainThread INFO Complete logs can be found at: <https://builds.apache.org/job/beam_PerformanceTests_HadoopInputFormat/ws/runs/38755a35/pkb.log>
2018-04-13 12:03:29,052 38755a35 MainThread INFO Completion statuses can be found at: <https://builds.apache.org/job/beam_PerformanceTests_HadoopInputFormat/ws/runs/38755a35/completion_statuses.json>
Build step 'Execute shell' marked build as failure
Build failed in Jenkins: beam_PerformanceTests_HadoopInputFormat
#135
Posted by Apache Jenkins Server <je...@builds.apache.org>.
See <https://builds.apache.org/job/beam_PerformanceTests_HadoopInputFormat/135/display/redirect?page=changes>
Changes:
[tgroh] Remove AppliedPTransform methods in WatermarkManager
[tgroh] Add an ExecutableGraph interface
[tgroh] Genericise WatermarkManager and Dependencies
------------------------------------------
[...truncated 1.32 KB...]
Resetting working tree
> git reset --hard # timeout=10
> git clean -fdx # timeout=10
[EnvInject] - Executing scripts and injecting environment variables after the SCM step.
[EnvInject] - Injecting as environment variables the properties content
SPARK_LOCAL_IP=127.0.0.1
[EnvInject] - Variables injected successfully.
[beam_PerformanceTests_HadoopInputFormat] $ /bin/bash -xe /tmp/jenkins6071894143178374272.sh
+ gcloud container clusters get-credentials io-datastores --zone=us-central1-a --verbosity=debug
DEBUG: Running gcloud.container.clusters.get-credentials with Namespace(__calliope_internal_deepest_parser=ArgumentParser(prog='gcloud.container.clusters.get-credentials', usage=None, description='Updates a kubeconfig file with appropriate credentials to point\nkubectl at a Container Engine Cluster. By default, credentials\nare written to HOME/.kube/config. You can provide an alternate\npath by setting the KUBECONFIG environment variable.\n\nSee [](https://cloud.google.com/container-engine/docs/kubectl) for\nkubectl documentation.', version=None, formatter_class=<class 'argparse.HelpFormatter'>, conflict_handler='error', add_help=False), account=None, api_version=None, authority_selector=None, authorization_token_file=None, calliope_command=<googlecloudsdk.calliope.backend.Command object at 0x7fa45bf6e050>, command_path=['gcloud', 'container', 'clusters', 'get-credentials'], configuration=None, credential_file_override=None, document=None, flatten=None, format=None, h=None, help=None, http_timeout=None, log_http=None, name='io-datastores', project=None, quiet=None, trace_email=None, trace_log=None, trace_token=None, user_output_enabled=None, verbosity='debug', version=None, zone='us-central1-a').
Fetching cluster endpoint and auth data.
DEBUG: Saved kubeconfig to /home/jenkins/.kube/config
kubeconfig entry generated for io-datastores.
INFO: Display format "default".
DEBUG: SDK update checks are disabled.
[beam_PerformanceTests_HadoopInputFormat] $ /bin/bash -xe /tmp/jenkins4588512095405794256.sh
+ cp /home/jenkins/.kube/config <https://builds.apache.org/job/beam_PerformanceTests_HadoopInputFormat/ws/config-hadoopinputformatioit-1523595679598>
[beam_PerformanceTests_HadoopInputFormat] $ /bin/bash -xe /tmp/jenkins466625591394510133.sh
+ kubectl --kubeconfig=<https://builds.apache.org/job/beam_PerformanceTests_HadoopInputFormat/ws/config-hadoopinputformatioit-1523595679598> create namespace hadoopinputformatioit-1523595679598
namespace "hadoopinputformatioit-1523595679598" created
[beam_PerformanceTests_HadoopInputFormat] $ /bin/bash -xe /tmp/jenkins2002697673564511632.sh
++ kubectl config current-context
+ kubectl --kubeconfig=<https://builds.apache.org/job/beam_PerformanceTests_HadoopInputFormat/ws/config-hadoopinputformatioit-1523595679598> config set-context gke_apache-beam-testing_us-central1-a_io-datastores --namespace=hadoopinputformatioit-1523595679598
Context "gke_apache-beam-testing_us-central1-a_io-datastores" modified.
[beam_PerformanceTests_HadoopInputFormat] $ /bin/bash -xe /tmp/jenkins7810089067485424595.sh
+ rm -rf PerfKitBenchmarker
[beam_PerformanceTests_HadoopInputFormat] $ /bin/bash -xe /tmp/jenkins6408160683639208907.sh
+ rm -rf .env
[beam_PerformanceTests_HadoopInputFormat] $ /bin/bash -xe /tmp/jenkins4202080768604623096.sh
+ virtualenv .env --system-site-packages
New python executable in .env/bin/python
Installing setuptools, pip...done.
[beam_PerformanceTests_HadoopInputFormat] $ /bin/bash -xe /tmp/jenkins3213037458053580239.sh
+ .env/bin/pip install --upgrade setuptools pip
Downloading/unpacking setuptools from https://pypi.python.org/packages/20/d7/04a0b689d3035143e2ff288f4b9ee4bf6ed80585cc121c90bfd85a1a8c2e/setuptools-39.0.1-py2.py3-none-any.whl#md5=ca299c7acd13a72e1171a3697f2b99bc
Downloading/unpacking pip from https://pypi.python.org/packages/ac/95/a05b56bb975efa78d3557efa36acaf9cf5d2fd0ee0062060493687432e03/pip-9.0.3-py2.py3-none-any.whl#md5=d512ceb964f38ba31addb8142bc657cb
Installing collected packages: setuptools, pip
Found existing installation: setuptools 2.2
Uninstalling setuptools:
Successfully uninstalled setuptools
Found existing installation: pip 1.5.4
Uninstalling pip:
Successfully uninstalled pip
Successfully installed setuptools pip
Cleaning up...
[beam_PerformanceTests_HadoopInputFormat] $ /bin/bash -xe /tmp/jenkins337411043607527373.sh
+ git clone https://github.com/GoogleCloudPlatform/PerfKitBenchmarker.git
Cloning into 'PerfKitBenchmarker'...
[beam_PerformanceTests_HadoopInputFormat] $ /bin/bash -xe /tmp/jenkins4817437571197680785.sh
+ .env/bin/pip install -r PerfKitBenchmarker/requirements.txt
Requirement already satisfied: absl-py in /home/jenkins/.local/lib/python2.7/site-packages (from -r PerfKitBenchmarker/requirements.txt (line 14))
Requirement already satisfied: jinja2>=2.7 in /usr/local/lib/python2.7/dist-packages (from -r PerfKitBenchmarker/requirements.txt (line 15))
Requirement already satisfied: setuptools in ./.env/lib/python2.7/site-packages (from -r PerfKitBenchmarker/requirements.txt (line 16))
Requirement already satisfied: colorlog[windows]==2.6.0 in /home/jenkins/.local/lib/python2.7/site-packages (from -r PerfKitBenchmarker/requirements.txt (line 17))
Requirement already satisfied: blinker>=1.3 in /home/jenkins/.local/lib/python2.7/site-packages (from -r PerfKitBenchmarker/requirements.txt (line 18))
Requirement already satisfied: futures>=3.0.3 in /home/jenkins/.local/lib/python2.7/site-packages (from -r PerfKitBenchmarker/requirements.txt (line 19))
Requirement already satisfied: PyYAML==3.12 in /home/jenkins/.local/lib/python2.7/site-packages (from -r PerfKitBenchmarker/requirements.txt (line 20))
Requirement already satisfied: pint>=0.7 in /home/jenkins/.local/lib/python2.7/site-packages (from -r PerfKitBenchmarker/requirements.txt (line 21))
Collecting numpy==1.13.3 (from -r PerfKitBenchmarker/requirements.txt (line 22))
<https://builds.apache.org/job/beam_PerformanceTests_HadoopInputFormat/ws/.env/local/lib/python2.7/site-packages/pip/_vendor/urllib3/util/ssl_.py>:339: SNIMissingWarning: An HTTPS request has been made, but the SNI (Subject Name Indication) extension to TLS is not available on this platform. This may cause the server to present an incorrect TLS certificate, which can cause validation failures. You can upgrade to a newer version of Python to solve this. For more information, see https://urllib3.readthedocs.io/en/latest/advanced-usage.html#ssl-warnings
SNIMissingWarning
<https://builds.apache.org/job/beam_PerformanceTests_HadoopInputFormat/ws/.env/local/lib/python2.7/site-packages/pip/_vendor/urllib3/util/ssl_.py>:137: InsecurePlatformWarning: A true SSLContext object is not available. This prevents urllib3 from configuring SSL appropriately and may cause certain SSL connections to fail. You can upgrade to a newer version of Python to solve this. For more information, see https://urllib3.readthedocs.io/en/latest/advanced-usage.html#ssl-warnings
InsecurePlatformWarning
Using cached numpy-1.13.3-cp27-cp27mu-manylinux1_x86_64.whl
Requirement already satisfied: functools32 in /home/jenkins/.local/lib/python2.7/site-packages (from -r PerfKitBenchmarker/requirements.txt (line 23))
Requirement already satisfied: contextlib2>=0.5.1 in /home/jenkins/.local/lib/python2.7/site-packages (from -r PerfKitBenchmarker/requirements.txt (line 24))
Requirement already satisfied: pywinrm in /home/jenkins/.local/lib/python2.7/site-packages (from -r PerfKitBenchmarker/requirements.txt (line 25))
Requirement already satisfied: six in /home/jenkins/.local/lib/python2.7/site-packages (from absl-py->-r PerfKitBenchmarker/requirements.txt (line 14))
Requirement already satisfied: MarkupSafe>=0.23 in /usr/local/lib/python2.7/dist-packages (from jinja2>=2.7->-r PerfKitBenchmarker/requirements.txt (line 15))
Requirement already satisfied: colorama; extra == "windows" in /usr/lib/python2.7/dist-packages (from colorlog[windows]==2.6.0->-r PerfKitBenchmarker/requirements.txt (line 17))
Requirement already satisfied: xmltodict in /home/jenkins/.local/lib/python2.7/site-packages (from pywinrm->-r PerfKitBenchmarker/requirements.txt (line 25))
Requirement already satisfied: requests-ntlm>=0.3.0 in /home/jenkins/.local/lib/python2.7/site-packages (from pywinrm->-r PerfKitBenchmarker/requirements.txt (line 25))
Requirement already satisfied: requests>=2.9.1 in /home/jenkins/.local/lib/python2.7/site-packages (from pywinrm->-r PerfKitBenchmarker/requirements.txt (line 25))
Requirement already satisfied: ntlm-auth>=1.0.2 in /home/jenkins/.local/lib/python2.7/site-packages (from requests-ntlm>=0.3.0->pywinrm->-r PerfKitBenchmarker/requirements.txt (line 25))
Requirement already satisfied: cryptography>=1.3 in /home/jenkins/.local/lib/python2.7/site-packages (from requests-ntlm>=0.3.0->pywinrm->-r PerfKitBenchmarker/requirements.txt (line 25))
Requirement already satisfied: idna<2.6,>=2.5 in /home/jenkins/.local/lib/python2.7/site-packages (from requests>=2.9.1->pywinrm->-r PerfKitBenchmarker/requirements.txt (line 25))
Requirement already satisfied: urllib3<1.22,>=1.21.1 in /home/jenkins/.local/lib/python2.7/site-packages (from requests>=2.9.1->pywinrm->-r PerfKitBenchmarker/requirements.txt (line 25))
Requirement already satisfied: chardet<3.1.0,>=3.0.2 in /home/jenkins/.local/lib/python2.7/site-packages (from requests>=2.9.1->pywinrm->-r PerfKitBenchmarker/requirements.txt (line 25))
Requirement already satisfied: certifi>=2017.4.17 in /home/jenkins/.local/lib/python2.7/site-packages (from requests>=2.9.1->pywinrm->-r PerfKitBenchmarker/requirements.txt (line 25))
Requirement already satisfied: cffi>=1.7; platform_python_implementation != "PyPy" in /home/jenkins/.local/lib/python2.7/site-packages (from cryptography>=1.3->requests-ntlm>=0.3.0->pywinrm->-r PerfKitBenchmarker/requirements.txt (line 25))
Requirement already satisfied: enum34; python_version < "3" in /home/jenkins/.local/lib/python2.7/site-packages (from cryptography>=1.3->requests-ntlm>=0.3.0->pywinrm->-r PerfKitBenchmarker/requirements.txt (line 25))
Requirement already satisfied: asn1crypto>=0.21.0 in /home/jenkins/.local/lib/python2.7/site-packages (from cryptography>=1.3->requests-ntlm>=0.3.0->pywinrm->-r PerfKitBenchmarker/requirements.txt (line 25))
Requirement already satisfied: ipaddress; python_version < "3" in /usr/local/lib/python2.7/dist-packages (from cryptography>=1.3->requests-ntlm>=0.3.0->pywinrm->-r PerfKitBenchmarker/requirements.txt (line 25))
Requirement already satisfied: pycparser in /home/jenkins/.local/lib/python2.7/site-packages (from cffi>=1.7; platform_python_implementation != "PyPy"->cryptography>=1.3->requests-ntlm>=0.3.0->pywinrm->-r PerfKitBenchmarker/requirements.txt (line 25))
Installing collected packages: numpy
Found existing installation: numpy 1.12.1
Not uninstalling numpy at /home/jenkins/.local/lib/python2.7/site-packages, outside environment <https://builds.apache.org/job/beam_PerformanceTests_HadoopInputFormat/ws/.env>
Successfully installed numpy-1.13.3
<https://builds.apache.org/job/beam_PerformanceTests_HadoopInputFormat/ws/.env/local/lib/python2.7/site-packages/pip/_vendor/urllib3/util/ssl_.py>:137: InsecurePlatformWarning: A true SSLContext object is not available. This prevents urllib3 from configuring SSL appropriately and may cause certain SSL connections to fail. You can upgrade to a newer version of Python to solve this. For more information, see https://urllib3.readthedocs.io/en/latest/advanced-usage.html#ssl-warnings
InsecurePlatformWarning
[beam_PerformanceTests_HadoopInputFormat] $ /bin/bash -xe /tmp/jenkins8328520981591339465.sh
+ .env/bin/pip install -e 'src/sdks/python/[gcp,test]'
Obtaining file://<https://builds.apache.org/job/beam_PerformanceTests_HadoopInputFormat/ws/src/sdks/python>
Requirement already satisfied: avro<2.0.0,>=1.8.1 in /home/jenkins/.local/lib/python2.7/site-packages (from apache-beam==2.5.0.dev0)
Requirement already satisfied: crcmod<2.0,>=1.7 in /usr/lib/python2.7/dist-packages (from apache-beam==2.5.0.dev0)
Requirement already satisfied: dill==0.2.6 in /home/jenkins/.local/lib/python2.7/site-packages (from apache-beam==2.5.0.dev0)
Collecting grpcio<2,>=1.8 (from apache-beam==2.5.0.dev0)
<https://builds.apache.org/job/beam_PerformanceTests_HadoopInputFormat/ws/.env/local/lib/python2.7/site-packages/pip/_vendor/urllib3/util/ssl_.py>:339: SNIMissingWarning: An HTTPS request has been made, but the SNI (Subject Name Indication) extension to TLS is not available on this platform. This may cause the server to present an incorrect TLS certificate, which can cause validation failures. You can upgrade to a newer version of Python to solve this. For more information, see https://urllib3.readthedocs.io/en/latest/advanced-usage.html#ssl-warnings
SNIMissingWarning
<https://builds.apache.org/job/beam_PerformanceTests_HadoopInputFormat/ws/.env/local/lib/python2.7/site-packages/pip/_vendor/urllib3/util/ssl_.py>:137: InsecurePlatformWarning: A true SSLContext object is not available. This prevents urllib3 from configuring SSL appropriately and may cause certain SSL connections to fail. You can upgrade to a newer version of Python to solve this. For more information, see https://urllib3.readthedocs.io/en/latest/advanced-usage.html#ssl-warnings
InsecurePlatformWarning
Using cached grpcio-1.10.1-cp27-cp27mu-manylinux1_x86_64.whl
Collecting hdfs<3.0.0,>=2.1.0 (from apache-beam==2.5.0.dev0)
Requirement already satisfied: httplib2<0.10,>=0.8 in /home/jenkins/.local/lib/python2.7/site-packages (from apache-beam==2.5.0.dev0)
Requirement already satisfied: mock<3.0.0,>=1.0.1 in /home/jenkins/.local/lib/python2.7/site-packages (from apache-beam==2.5.0.dev0)
Requirement already satisfied: oauth2client<5,>=2.0.1 in /home/jenkins/.local/lib/python2.7/site-packages (from apache-beam==2.5.0.dev0)
Requirement already satisfied: protobuf<4,>=3.5.0.post1 in /home/jenkins/.local/lib/python2.7/site-packages (from apache-beam==2.5.0.dev0)
Collecting pytz>=2018.3 (from apache-beam==2.5.0.dev0)
Using cached pytz-2018.4-py2.py3-none-any.whl
Requirement already satisfied: pyyaml<4.0.0,>=3.12 in /home/jenkins/.local/lib/python2.7/site-packages (from apache-beam==2.5.0.dev0)
Requirement already satisfied: pyvcf<0.7.0,>=0.6.8 in /home/jenkins/.local/lib/python2.7/site-packages (from apache-beam==2.5.0.dev0)
Requirement already satisfied: six<1.12,>=1.9 in /home/jenkins/.local/lib/python2.7/site-packages (from apache-beam==2.5.0.dev0)
Requirement already satisfied: typing<3.7.0,>=3.6.0 in /home/jenkins/.local/lib/python2.7/site-packages (from apache-beam==2.5.0.dev0)
Requirement already satisfied: futures<4.0.0,>=3.1.1 in /home/jenkins/.local/lib/python2.7/site-packages (from apache-beam==2.5.0.dev0)
Requirement already satisfied: google-apitools<=0.5.20,>=0.5.18 in /home/jenkins/.local/lib/python2.7/site-packages (from apache-beam==2.5.0.dev0)
Requirement already satisfied: proto-google-cloud-datastore-v1<=0.90.4,>=0.90.0 in /home/jenkins/.local/lib/python2.7/site-packages (from apache-beam==2.5.0.dev0)
Requirement already satisfied: googledatastore==7.0.1 in /home/jenkins/.local/lib/python2.7/site-packages (from apache-beam==2.5.0.dev0)
Requirement already satisfied: google-cloud-pubsub==0.26.0 in /home/jenkins/.local/lib/python2.7/site-packages (from apache-beam==2.5.0.dev0)
Requirement already satisfied: proto-google-cloud-pubsub-v1==0.15.4 in /home/jenkins/.local/lib/python2.7/site-packages (from apache-beam==2.5.0.dev0)
Requirement already satisfied: google-cloud-bigquery==0.25.0 in /home/jenkins/.local/lib/python2.7/site-packages (from apache-beam==2.5.0.dev0)
Collecting nose>=1.3.7 (from apache-beam==2.5.0.dev0)
Using cached nose-1.3.7-py2-none-any.whl
Requirement already satisfied: pyhamcrest<2.0,>=1.9 in /home/jenkins/.local/lib/python2.7/site-packages (from apache-beam==2.5.0.dev0)
Requirement already satisfied: enum34>=1.0.4 in /home/jenkins/.local/lib/python2.7/site-packages (from grpcio<2,>=1.8->apache-beam==2.5.0.dev0)
Requirement already satisfied: requests>=2.7.0 in /home/jenkins/.local/lib/python2.7/site-packages (from hdfs<3.0.0,>=2.1.0->apache-beam==2.5.0.dev0)
Requirement already satisfied: docopt in /usr/local/lib/python2.7/dist-packages (from hdfs<3.0.0,>=2.1.0->apache-beam==2.5.0.dev0)
Requirement already satisfied: funcsigs>=1; python_version < "3.3" in /home/jenkins/.local/lib/python2.7/site-packages (from mock<3.0.0,>=1.0.1->apache-beam==2.5.0.dev0)
Requirement already satisfied: pbr>=0.11 in /home/jenkins/.local/lib/python2.7/site-packages (from mock<3.0.0,>=1.0.1->apache-beam==2.5.0.dev0)
Requirement already satisfied: pyasn1>=0.1.7 in /home/jenkins/.local/lib/python2.7/site-packages (from oauth2client<5,>=2.0.1->apache-beam==2.5.0.dev0)
Requirement already satisfied: pyasn1-modules>=0.0.5 in /home/jenkins/.local/lib/python2.7/site-packages (from oauth2client<5,>=2.0.1->apache-beam==2.5.0.dev0)
Requirement already satisfied: rsa>=3.1.4 in /home/jenkins/.local/lib/python2.7/site-packages (from oauth2client<5,>=2.0.1->apache-beam==2.5.0.dev0)
Requirement already satisfied: setuptools in ./.env/lib/python2.7/site-packages (from protobuf<4,>=3.5.0.post1->apache-beam==2.5.0.dev0)
Requirement already satisfied: fasteners>=0.14 in /home/jenkins/.local/lib/python2.7/site-packages (from google-apitools<=0.5.20,>=0.5.18->apache-beam==2.5.0.dev0)
Requirement already satisfied: googleapis-common-protos<2.0dev,>=1.5.2 in /home/jenkins/.local/lib/python2.7/site-packages (from proto-google-cloud-datastore-v1<=0.90.4,>=0.90.0->apache-beam==2.5.0.dev0)
Requirement already satisfied: google-cloud-core<0.26dev,>=0.25.0 in /home/jenkins/.local/lib/python2.7/site-packages (from google-cloud-pubsub==0.26.0->apache-beam==2.5.0.dev0)
Requirement already satisfied: gapic-google-cloud-pubsub-v1<0.16dev,>=0.15.0 in /home/jenkins/.local/lib/python2.7/site-packages (from google-cloud-pubsub==0.26.0->apache-beam==2.5.0.dev0)
Requirement already satisfied: idna<2.6,>=2.5 in /home/jenkins/.local/lib/python2.7/site-packages (from requests>=2.7.0->hdfs<3.0.0,>=2.1.0->apache-beam==2.5.0.dev0)
Requirement already satisfied: urllib3<1.22,>=1.21.1 in /home/jenkins/.local/lib/python2.7/site-packages (from requests>=2.7.0->hdfs<3.0.0,>=2.1.0->apache-beam==2.5.0.dev0)
Requirement already satisfied: chardet<3.1.0,>=3.0.2 in /home/jenkins/.local/lib/python2.7/site-packages (from requests>=2.7.0->hdfs<3.0.0,>=2.1.0->apache-beam==2.5.0.dev0)
Requirement already satisfied: certifi>=2017.4.17 in /home/jenkins/.local/lib/python2.7/site-packages (from requests>=2.7.0->hdfs<3.0.0,>=2.1.0->apache-beam==2.5.0.dev0)
Requirement already satisfied: monotonic>=0.1 in /home/jenkins/.local/lib/python2.7/site-packages (from fasteners>=0.14->google-apitools<=0.5.20,>=0.5.18->apache-beam==2.5.0.dev0)
Requirement already satisfied: google-auth<2.0.0dev,>=0.4.0 in /home/jenkins/.local/lib/python2.7/site-packages (from google-cloud-core<0.26dev,>=0.25.0->google-cloud-pubsub==0.26.0->apache-beam==2.5.0.dev0)
Requirement already satisfied: google-auth-httplib2 in /home/jenkins/.local/lib/python2.7/site-packages (from google-cloud-core<0.26dev,>=0.25.0->google-cloud-pubsub==0.26.0->apache-beam==2.5.0.dev0)
Requirement already satisfied: google-gax<0.16dev,>=0.15.7 in /home/jenkins/.local/lib/python2.7/site-packages (from gapic-google-cloud-pubsub-v1<0.16dev,>=0.15.0->google-cloud-pubsub==0.26.0->apache-beam==2.5.0.dev0)
Requirement already satisfied: grpc-google-iam-v1<0.12dev,>=0.11.1 in /home/jenkins/.local/lib/python2.7/site-packages (from gapic-google-cloud-pubsub-v1<0.16dev,>=0.15.0->google-cloud-pubsub==0.26.0->apache-beam==2.5.0.dev0)
Requirement already satisfied: cachetools>=2.0.0 in /home/jenkins/.local/lib/python2.7/site-packages (from google-auth<2.0.0dev,>=0.4.0->google-cloud-core<0.26dev,>=0.25.0->google-cloud-pubsub==0.26.0->apache-beam==2.5.0.dev0)
Requirement already satisfied: future<0.17dev,>=0.16.0 in /home/jenkins/.local/lib/python2.7/site-packages (from google-gax<0.16dev,>=0.15.7->gapic-google-cloud-pubsub-v1<0.16dev,>=0.15.0->google-cloud-pubsub==0.26.0->apache-beam==2.5.0.dev0)
Requirement already satisfied: ply==3.8 in /home/jenkins/.local/lib/python2.7/site-packages (from google-gax<0.16dev,>=0.15.7->gapic-google-cloud-pubsub-v1<0.16dev,>=0.15.0->google-cloud-pubsub==0.26.0->apache-beam==2.5.0.dev0)
Installing collected packages: grpcio, hdfs, pytz, nose, apache-beam
Found existing installation: grpcio 1.4.0
Not uninstalling grpcio at /home/jenkins/.local/lib/python2.7/site-packages, outside environment <https://builds.apache.org/job/beam_PerformanceTests_HadoopInputFormat/ws/.env>
Found existing installation: apache-beam 2.5.0.dev0
Not uninstalling apache-beam at /home/jenkins/jenkins-slave/workspace/beam_PerformanceTests_AvroIOIT/src/sdks/python, outside environment <https://builds.apache.org/job/beam_PerformanceTests_HadoopInputFormat/ws/.env>
Running setup.py develop for apache-beam
Successfully installed apache-beam grpcio-1.10.1 hdfs-2.1.0 nose-1.3.7 pytz-2018.4
[beam_PerformanceTests_HadoopInputFormat] $ /bin/bash -xe /tmp/jenkins7785254904465774517.sh
+ .env/bin/python PerfKitBenchmarker/pkb.py --project=apache-beam-testing --dpb_log_level=INFO --maven_binary=/home/jenkins/tools/maven/latest/bin/mvn --bigquery_table=beam_performance.hadoopinputformatioit_pkb_results --temp_dir=<https://builds.apache.org/job/beam_PerformanceTests_HadoopInputFormat/ws/> --official=true --kubeconfig=<https://builds.apache.org/job/beam_PerformanceTests_HadoopInputFormat/ws/config-hadoopinputformatioit-1523595679598> --beam_it_timeout=1200 --benchmarks=beam_integration_benchmark --beam_it_profile=io-it --beam_prebuilt=true --beam_sdk=java --beam_it_module=sdks/java/io/hadoop-input-format --beam_it_class=org.apache.beam.sdk.io.hadoop.inputformat.HadoopInputFormatIOIT '--beam_it_options=[--tempRoot=gs://temp-storage-for-perf-tests,--project=apache-beam-testing,--postgresPort=5432,--numberOfRecords=600000]' --beam_kubernetes_scripts=<https://builds.apache.org/job/beam_PerformanceTests_HadoopInputFormat/ws/src/.test-infra/kubernetes/postgres/postgres-service-for-local-dev.yml> --beam_options_config_file=<https://builds.apache.org/job/beam_PerformanceTests_HadoopInputFormat/ws/src/.test-infra/kubernetes/postgres/pkb-config-local.yml>
2018-04-13 06:00:55,648 9a57d749 MainThread INFO Verbose logging to: <https://builds.apache.org/job/beam_PerformanceTests_HadoopInputFormat/ws/runs/9a57d749/pkb.log>
2018-04-13 06:00:55,648 9a57d749 MainThread INFO PerfKitBenchmarker version: v1.12.0-489-gf0acf31
2018-04-13 06:00:55,649 9a57d749 MainThread INFO Flag values:
--beam_it_class=org.apache.beam.sdk.io.hadoop.inputformat.HadoopInputFormatIOIT
--beam_it_timeout=1200
--beam_sdk=java
--temp_dir=<https://builds.apache.org/job/beam_PerformanceTests_HadoopInputFormat/ws/>
--maven_binary=/home/jenkins/tools/maven/latest/bin/mvn
--beam_it_options=[--tempRoot=gs://temp-storage-for-perf-tests,--project=apache-beam-testing,--postgresPort=5432,--numberOfRecords=600000]
--beam_prebuilt
--kubeconfig=<https://builds.apache.org/job/beam_PerformanceTests_HadoopInputFormat/ws/config-hadoopinputformatioit-1523595679598>
--project=apache-beam-testing
--beam_kubernetes_scripts=<https://builds.apache.org/job/beam_PerformanceTests_HadoopInputFormat/ws/src/.test-infra/kubernetes/postgres/postgres-service-for-local-dev.yml>
--bigquery_table=beam_performance.hadoopinputformatioit_pkb_results
--official
--beam_it_module=sdks/java/io/hadoop-input-format
--dpb_log_level=INFO
--beam_options_config_file=<https://builds.apache.org/job/beam_PerformanceTests_HadoopInputFormat/ws/src/.test-infra/kubernetes/postgres/pkb-config-local.yml>
--beam_it_profile=io-it
--benchmarks=beam_integration_benchmark
2018-04-13 06:00:56,034 9a57d749 MainThread WARNING The key "flags" was not in the default config, but was in user overrides. This may indicate a typo.
2018-04-13 06:00:56,035 9a57d749 MainThread INFO Initializing the edw service decoder
2018-04-13 06:00:56,173 9a57d749 MainThread beam_integration_benchmark(1/1) INFO Provisioning resources for benchmark beam_integration_benchmark
2018-04-13 06:00:56,176 9a57d749 MainThread beam_integration_benchmark(1/1) INFO Preparing benchmark beam_integration_benchmark
2018-04-13 06:00:56,176 9a57d749 MainThread beam_integration_benchmark(1/1) INFO Running: git clone https://github.com/apache/beam.git
2018-04-13 06:01:30,689 9a57d749 MainThread beam_integration_benchmark(1/1) INFO Running: kubectl --kubeconfig=<https://builds.apache.org/job/beam_PerformanceTests_HadoopInputFormat/ws/config-hadoopinputformatioit-1523595679598> create -f <https://builds.apache.org/job/beam_PerformanceTests_HadoopInputFormat/ws/src/.test-infra/kubernetes/postgres/postgres-service-for-local-dev.yml>
2018-04-13 06:01:31,557 9a57d749 MainThread beam_integration_benchmark(1/1) INFO Running benchmark beam_integration_benchmark
2018-04-13 06:01:31,568 9a57d749 MainThread beam_integration_benchmark(1/1) INFO Running: kubectl --kubeconfig=<https://builds.apache.org/job/beam_PerformanceTests_HadoopInputFormat/ws/config-hadoopinputformatioit-1523595679598> get svc postgres-for-dev -ojsonpath={.status.loadBalancer.ingress[0].ip}
2018-04-13 06:01:42,159 9a57d749 MainThread beam_integration_benchmark(1/1) INFO Running: kubectl --kubeconfig=<https://builds.apache.org/job/beam_PerformanceTests_HadoopInputFormat/ws/config-hadoopinputformatioit-1523595679598> get svc postgres-for-dev -ojsonpath={.status.loadBalancer.ingress[0].ip}
2018-04-13 06:01:52,341 9a57d749 MainThread beam_integration_benchmark(1/1) INFO Running: kubectl --kubeconfig=<https://builds.apache.org/job/beam_PerformanceTests_HadoopInputFormat/ws/config-hadoopinputformatioit-1523595679598> get svc postgres-for-dev -ojsonpath={.status.loadBalancer.ingress[0].ip}
2018-04-13 06:02:02,481 9a57d749 MainThread beam_integration_benchmark(1/1) INFO Running: kubectl --kubeconfig=<https://builds.apache.org/job/beam_PerformanceTests_HadoopInputFormat/ws/config-hadoopinputformatioit-1523595679598> get svc postgres-for-dev -ojsonpath={.status.loadBalancer.ingress[0].ip}
2018-04-13 06:02:12,625 9a57d749 MainThread beam_integration_benchmark(1/1) INFO Running: kubectl --kubeconfig=<https://builds.apache.org/job/beam_PerformanceTests_HadoopInputFormat/ws/config-hadoopinputformatioit-1523595679598> get svc postgres-for-dev -ojsonpath={.status.loadBalancer.ingress[0].ip}
2018-04-13 06:02:22,788 9a57d749 MainThread beam_integration_benchmark(1/1) INFO Running: kubectl --kubeconfig=<https://builds.apache.org/job/beam_PerformanceTests_HadoopInputFormat/ws/config-hadoopinputformatioit-1523595679598> get svc postgres-for-dev -ojsonpath={.status.loadBalancer.ingress[0].ip}
2018-04-13 06:02:32,945 9a57d749 MainThread beam_integration_benchmark(1/1) INFO Running: kubectl --kubeconfig=<https://builds.apache.org/job/beam_PerformanceTests_HadoopInputFormat/ws/config-hadoopinputformatioit-1523595679598> get svc postgres-for-dev -ojsonpath={.status.loadBalancer.ingress[0].ip}
2018-04-13 06:02:43,117 9a57d749 MainThread beam_integration_benchmark(1/1) INFO Running: kubectl --kubeconfig=<https://builds.apache.org/job/beam_PerformanceTests_HadoopInputFormat/ws/config-hadoopinputformatioit-1523595679598> get svc postgres-for-dev -ojsonpath={.status.loadBalancer.ingress[0].ip}
2018-04-13 06:02:53,248 9a57d749 MainThread beam_integration_benchmark(1/1) INFO Running: kubectl --kubeconfig=<https://builds.apache.org/job/beam_PerformanceTests_HadoopInputFormat/ws/config-hadoopinputformatioit-1523595679598> get svc postgres-for-dev -ojsonpath={.status.loadBalancer.ingress[0].ip}
2018-04-13 06:03:03,409 9a57d749 MainThread beam_integration_benchmark(1/1) INFO Running: kubectl --kubeconfig=<https://builds.apache.org/job/beam_PerformanceTests_HadoopInputFormat/ws/config-hadoopinputformatioit-1523595679598> get svc postgres-for-dev -ojsonpath={.status.loadBalancer.ingress[0].ip}
2018-04-13 06:03:13,533 9a57d749 MainThread beam_integration_benchmark(1/1) INFO Running: kubectl --kubeconfig=<https://builds.apache.org/job/beam_PerformanceTests_HadoopInputFormat/ws/config-hadoopinputformatioit-1523595679598> get svc postgres-for-dev -ojsonpath={.status.loadBalancer.ingress[0].ip}
2018-04-13 06:03:23,669 9a57d749 MainThread beam_integration_benchmark(1/1) INFO Running: kubectl --kubeconfig=<https://builds.apache.org/job/beam_PerformanceTests_HadoopInputFormat/ws/config-hadoopinputformatioit-1523595679598> get svc postgres-for-dev -ojsonpath={.status.loadBalancer.ingress[0].ip}
2018-04-13 06:03:33,817 9a57d749 MainThread beam_integration_benchmark(1/1) INFO Running: kubectl --kubeconfig=<https://builds.apache.org/job/beam_PerformanceTests_HadoopInputFormat/ws/config-hadoopinputformatioit-1523595679598> get svc postgres-for-dev -ojsonpath={.status.loadBalancer.ingress[0].ip}
2018-04-13 06:03:43,985 9a57d749 MainThread beam_integration_benchmark(1/1) INFO Running: kubectl --kubeconfig=<https://builds.apache.org/job/beam_PerformanceTests_HadoopInputFormat/ws/config-hadoopinputformatioit-1523595679598> get svc postgres-for-dev -ojsonpath={.status.loadBalancer.ingress[0].ip}
2018-04-13 06:03:54,131 9a57d749 MainThread beam_integration_benchmark(1/1) INFO Running: kubectl --kubeconfig=<https://builds.apache.org/job/beam_PerformanceTests_HadoopInputFormat/ws/config-hadoopinputformatioit-1523595679598> get svc postgres-for-dev -ojsonpath={.status.loadBalancer.ingress[0].ip}
2018-04-13 06:04:04,277 9a57d749 MainThread beam_integration_benchmark(1/1) INFO Running: kubectl --kubeconfig=<https://builds.apache.org/job/beam_PerformanceTests_HadoopInputFormat/ws/config-hadoopinputformatioit-1523595679598> get svc postgres-for-dev -ojsonpath={.status.loadBalancer.ingress[0].ip}
2018-04-13 06:04:14,413 9a57d749 MainThread beam_integration_benchmark(1/1) INFO Running: kubectl --kubeconfig=<https://builds.apache.org/job/beam_PerformanceTests_HadoopInputFormat/ws/config-hadoopinputformatioit-1523595679598> get svc postgres-for-dev -ojsonpath={.status.loadBalancer.ingress[0].ip}
2018-04-13 06:04:24,556 9a57d749 MainThread beam_integration_benchmark(1/1) INFO Running: kubectl --kubeconfig=<https://builds.apache.org/job/beam_PerformanceTests_HadoopInputFormat/ws/config-hadoopinputformatioit-1523595679598> get svc postgres-for-dev -ojsonpath={.status.loadBalancer.ingress[0].ip}
2018-04-13 06:04:34,693 9a57d749 MainThread beam_integration_benchmark(1/1) INFO Running: kubectl --kubeconfig=<https://builds.apache.org/job/beam_PerformanceTests_HadoopInputFormat/ws/config-hadoopinputformatioit-1523595679598> get svc postgres-for-dev -ojsonpath={.status.loadBalancer.ingress[0].ip}
2018-04-13 06:04:36,385 9a57d749 MainThread beam_integration_benchmark(1/1) ERROR Error during benchmark beam_integration_benchmark
Traceback (most recent call last):
File "<https://builds.apache.org/job/beam_PerformanceTests_HadoopInputFormat/ws/PerfKitBenchmarker/perfkitbenchmarker/pkb.py",> line 623, in RunBenchmark
DoRunPhase(spec, collector, detailed_timer)
File "<https://builds.apache.org/job/beam_PerformanceTests_HadoopInputFormat/ws/PerfKitBenchmarker/perfkitbenchmarker/pkb.py",> line 526, in DoRunPhase
samples = spec.BenchmarkRun(spec)
File "<https://builds.apache.org/job/beam_PerformanceTests_HadoopInputFormat/ws/PerfKitBenchmarker/perfkitbenchmarker/linux_benchmarks/beam_integration_benchmark.py",> line 148, in Run
dynamic_pipeline_options)
File "<https://builds.apache.org/job/beam_PerformanceTests_HadoopInputFormat/ws/PerfKitBenchmarker/perfkitbenchmarker/beam_pipeline_options.py",> line 100, in GenerateAllPipelineOptions
EvaluateDynamicPipelineOptions(dynamic_pipeline_options))
File "<https://builds.apache.org/job/beam_PerformanceTests_HadoopInputFormat/ws/PerfKitBenchmarker/perfkitbenchmarker/beam_pipeline_options.py",> line 67, in EvaluateDynamicPipelineOptions
argValue = RetrieveLoadBalancerIp(optionDescriptor)
File "<https://builds.apache.org/job/beam_PerformanceTests_HadoopInputFormat/ws/PerfKitBenchmarker/perfkitbenchmarker/beam_pipeline_options.py",> line 153, in RetrieveLoadBalancerIp
raise "Could not retrieve LoadBalancer IP address"
TypeError: exceptions must be old-style classes or derived from BaseException, not str
2018-04-13 06:04:36,386 9a57d749 MainThread beam_integration_benchmark(1/1) INFO Cleaning up benchmark beam_integration_benchmark
2018-04-13 06:04:36,386 9a57d749 MainThread beam_integration_benchmark(1/1) INFO Running: kubectl --kubeconfig=<https://builds.apache.org/job/beam_PerformanceTests_HadoopInputFormat/ws/config-hadoopinputformatioit-1523595679598> delete -f <https://builds.apache.org/job/beam_PerformanceTests_HadoopInputFormat/ws/src/.test-infra/kubernetes/postgres/postgres-service-for-local-dev.yml>
2018-04-13 06:04:39,195 9a57d749 MainThread beam_integration_benchmark(1/1) ERROR Exception running benchmark
Traceback (most recent call last):
File "<https://builds.apache.org/job/beam_PerformanceTests_HadoopInputFormat/ws/PerfKitBenchmarker/perfkitbenchmarker/pkb.py",> line 757, in RunBenchmarkTask
RunBenchmark(spec, collector)
File "<https://builds.apache.org/job/beam_PerformanceTests_HadoopInputFormat/ws/PerfKitBenchmarker/perfkitbenchmarker/pkb.py",> line 623, in RunBenchmark
DoRunPhase(spec, collector, detailed_timer)
File "<https://builds.apache.org/job/beam_PerformanceTests_HadoopInputFormat/ws/PerfKitBenchmarker/perfkitbenchmarker/pkb.py",> line 526, in DoRunPhase
samples = spec.BenchmarkRun(spec)
File "<https://builds.apache.org/job/beam_PerformanceTests_HadoopInputFormat/ws/PerfKitBenchmarker/perfkitbenchmarker/linux_benchmarks/beam_integration_benchmark.py",> line 148, in Run
dynamic_pipeline_options)
File "<https://builds.apache.org/job/beam_PerformanceTests_HadoopInputFormat/ws/PerfKitBenchmarker/perfkitbenchmarker/beam_pipeline_options.py",> line 100, in GenerateAllPipelineOptions
EvaluateDynamicPipelineOptions(dynamic_pipeline_options))
File "<https://builds.apache.org/job/beam_PerformanceTests_HadoopInputFormat/ws/PerfKitBenchmarker/perfkitbenchmarker/beam_pipeline_options.py",> line 67, in EvaluateDynamicPipelineOptions
argValue = RetrieveLoadBalancerIp(optionDescriptor)
File "<https://builds.apache.org/job/beam_PerformanceTests_HadoopInputFormat/ws/PerfKitBenchmarker/perfkitbenchmarker/beam_pipeline_options.py",> line 153, in RetrieveLoadBalancerIp
raise "Could not retrieve LoadBalancer IP address"
TypeError: exceptions must be old-style classes or derived from BaseException, not str
2018-04-13 06:04:39,196 9a57d749 MainThread beam_integration_benchmark(1/1) ERROR Benchmark 1/1 beam_integration_benchmark (UID: beam_integration_benchmark0) failed. Execution will continue.
2018-04-13 06:04:39,217 9a57d749 MainThread INFO Benchmark run statuses:
---------------------------------------------------------------------------------
Name UID Status Failed Substatus
---------------------------------------------------------------------------------
beam_integration_benchmark beam_integration_benchmark0 FAILED
---------------------------------------------------------------------------------
Success rate: 0.00% (0/1)
2018-04-13 06:04:39,217 9a57d749 MainThread INFO Complete logs can be found at: <https://builds.apache.org/job/beam_PerformanceTests_HadoopInputFormat/ws/runs/9a57d749/pkb.log>
2018-04-13 06:04:39,218 9a57d749 MainThread INFO Completion statuses can be found at: <https://builds.apache.org/job/beam_PerformanceTests_HadoopInputFormat/ws/runs/9a57d749/completion_statuses.json>
Build step 'Execute shell' marked build as failure