You are viewing a plain text version of this content. The canonical link for it is here.
Posted to builds@beam.apache.org by Apache Jenkins Server <je...@builds.apache.org> on 2020/11/28 07:17:19 UTC

Build failed in Jenkins: beam_PostCommit_Python36 #3225

See <https://ci-beam.apache.org/job/beam_PostCommit_Python36/3225/display/redirect>

Changes:


------------------------------------------
[...truncated 39.02 MB...]
google.auth.transport._http_client: DEBUG: Making request: GET http://metadata.google.internal/computeMetadata/v1/project/project-id
urllib3.util.retry: DEBUG: Converted retries value: 3 -> Retry(total=3, connect=None, read=None, redirect=None, status=None)
google.auth.transport.requests: DEBUG: Making request: GET http://metadata.google.internal/computeMetadata/v1/instance/service-accounts/default/?recursive=true
urllib3.connectionpool: DEBUG: Starting new HTTP connection (1): metadata.google.internal:80
urllib3.connectionpool: DEBUG: http://metadata.google.internal:80 "GET /computeMetadata/v1/instance/service-accounts/default/?recursive=true HTTP/1.1" 200 144
google.auth.transport.requests: DEBUG: Making request: GET http://metadata.google.internal/computeMetadata/v1/instance/service-accounts/844138762903-compute@developer.gserviceaccount.com/token?scopes=https%3A%2F%2Fwww.googleapis.com%2Fauth%2Fbigquery%2Chttps%3A%2F%2Fwww.googleapis.com%2Fauth%2Fcloud-platform
urllib3.connectionpool: DEBUG: http://metadata.google.internal:80 "GET /computeMetadata/v1/instance/service-accounts/844138762903-compute@developer.gserviceaccount.com/token?scopes=https%3A%2F%2Fwww.googleapis.com%2Fauth%2Fbigquery%2Chttps%3A%2F%2Fwww.googleapis.com%2Fauth%2Fcloud-platform HTTP/1.1" 200 241
urllib3.connectionpool: DEBUG: Starting new HTTPS connection (1): bigquery.googleapis.com:443
urllib3.connectionpool: DEBUG: https://bigquery.googleapis.com:443 "POST /bigquery/v2/projects/apache-beam-testing/jobs?prettyPrint=false HTTP/1.1" 200 None
apache_beam.utils.retry: WARNING: Retry with exponential backoff: waiting for 2.6070602957301015 seconds before retrying _query_with_retry because we caught exception: google.api_core.exceptions.NotFound: 404 Not found: Table apache-beam-testing:leader_board_it_dataset16065435598340.leader_board_teams was not found in location US

(job ID: 1a470b34-cb56-4ec6-8471-b3bd9899a360)

                                                     -----Query Job SQL Follows-----                                                      

    |    .    |    .    |    .    |    .    |    .    |    .    |    .    |    .    |    .    |    .    |    .    |    .    |    .    |
   1:SELECT total_score FROM `apache-beam-testing.leader_board_it_dataset16065435598340.leader_board_teams` WHERE total_score=5000 LIMIT 1
    |    .    |    .    |    .    |    .    |    .    |    .    |    .    |    .    |    .    |    .    |    .    |    .    |    .    |
 Traceback for above exception (most recent call last):
  File "<https://ci-beam.apache.org/job/beam_PostCommit_Python36/ws/src/sdks/python/apache_beam/utils/retry.py",> line 260, in wrapper
    return fun(*args, **kwargs)
  File "<https://ci-beam.apache.org/job/beam_PostCommit_Python36/ws/src/sdks/python/apache_beam/io/gcp/tests/bigquery_matcher.py",> line 128, in _query_with_retry
    rows = query_job.result(timeout=60)
  File "<https://ci-beam.apache.org/job/beam_PostCommit_Python36/ws/src/build/gradleenv/-1734967053/lib/python3.6/site-packages/google/cloud/bigquery/job.py",> line 3230, in result
    super(QueryJob, self).result(retry=retry, timeout=timeout)
  File "<https://ci-beam.apache.org/job/beam_PostCommit_Python36/ws/src/build/gradleenv/-1734967053/lib/python3.6/site-packages/google/cloud/bigquery/job.py",> line 835, in result
    return super(_AsyncJob, self).result(timeout=timeout)
  File "<https://ci-beam.apache.org/job/beam_PostCommit_Python36/ws/src/build/gradleenv/-1734967053/lib/python3.6/site-packages/google/api_core/future/polling.py",> line 134, in result
    raise self._exception

apache_beam.io.gcp.tests.bigquery_matcher: INFO: Attempting to perform query SELECT total_score FROM `apache-beam-testing.leader_board_it_dataset16065435598340.leader_board_teams` WHERE total_score=5000 LIMIT 1 to BQ
google.auth._default: DEBUG: Checking None for explicit credentials as part of auth process...
google.auth._default: DEBUG: Checking Cloud SDK credentials as part of auth process...
google.auth._default: DEBUG: Cloud SDK credentials not found on disk; not using them
google.auth._default: DEBUG: Checking for App Engine runtime as part of auth process...
google.auth._default: DEBUG: No App Engine library was found so cannot authentication via App Engine Identity Credentials.
google.auth.transport._http_client: DEBUG: Making request: GET http://169.254.169.254
google.auth.transport._http_client: DEBUG: Making request: GET http://metadata.google.internal/computeMetadata/v1/project/project-id
urllib3.util.retry: DEBUG: Converted retries value: 3 -> Retry(total=3, connect=None, read=None, redirect=None, status=None)
google.auth.transport.requests: DEBUG: Making request: GET http://metadata.google.internal/computeMetadata/v1/instance/service-accounts/default/?recursive=true
urllib3.connectionpool: DEBUG: Starting new HTTP connection (1): metadata.google.internal:80
urllib3.connectionpool: DEBUG: http://metadata.google.internal:80 "GET /computeMetadata/v1/instance/service-accounts/default/?recursive=true HTTP/1.1" 200 144
google.auth.transport.requests: DEBUG: Making request: GET http://metadata.google.internal/computeMetadata/v1/instance/service-accounts/844138762903-compute@developer.gserviceaccount.com/token?scopes=https%3A%2F%2Fwww.googleapis.com%2Fauth%2Fbigquery%2Chttps%3A%2F%2Fwww.googleapis.com%2Fauth%2Fcloud-platform
urllib3.connectionpool: DEBUG: http://metadata.google.internal:80 "GET /computeMetadata/v1/instance/service-accounts/844138762903-compute@developer.gserviceaccount.com/token?scopes=https%3A%2F%2Fwww.googleapis.com%2Fauth%2Fbigquery%2Chttps%3A%2F%2Fwww.googleapis.com%2Fauth%2Fcloud-platform HTTP/1.1" 200 241
urllib3.connectionpool: DEBUG: Starting new HTTPS connection (1): bigquery.googleapis.com:443
urllib3.connectionpool: DEBUG: https://bigquery.googleapis.com:443 "POST /bigquery/v2/projects/apache-beam-testing/jobs?prettyPrint=false HTTP/1.1" 200 None
apache_beam.utils.retry: WARNING: Retry with exponential backoff: waiting for 7.855239736221019 seconds before retrying _query_with_retry because we caught exception: google.api_core.exceptions.NotFound: 404 Not found: Table apache-beam-testing:leader_board_it_dataset16065435598340.leader_board_teams was not found in location US

(job ID: b85ef273-9f1c-4949-a1b6-7774c2a1383c)

                                                     -----Query Job SQL Follows-----                                                      

    |    .    |    .    |    .    |    .    |    .    |    .    |    .    |    .    |    .    |    .    |    .    |    .    |    .    |
   1:SELECT total_score FROM `apache-beam-testing.leader_board_it_dataset16065435598340.leader_board_teams` WHERE total_score=5000 LIMIT 1
    |    .    |    .    |    .    |    .    |    .    |    .    |    .    |    .    |    .    |    .    |    .    |    .    |    .    |
 Traceback for above exception (most recent call last):
  File "<https://ci-beam.apache.org/job/beam_PostCommit_Python36/ws/src/sdks/python/apache_beam/utils/retry.py",> line 260, in wrapper
    return fun(*args, **kwargs)
  File "<https://ci-beam.apache.org/job/beam_PostCommit_Python36/ws/src/sdks/python/apache_beam/io/gcp/tests/bigquery_matcher.py",> line 128, in _query_with_retry
    rows = query_job.result(timeout=60)
  File "<https://ci-beam.apache.org/job/beam_PostCommit_Python36/ws/src/build/gradleenv/-1734967053/lib/python3.6/site-packages/google/cloud/bigquery/job.py",> line 3230, in result
    super(QueryJob, self).result(retry=retry, timeout=timeout)
  File "<https://ci-beam.apache.org/job/beam_PostCommit_Python36/ws/src/build/gradleenv/-1734967053/lib/python3.6/site-packages/google/cloud/bigquery/job.py",> line 835, in result
    return super(_AsyncJob, self).result(timeout=timeout)
  File "<https://ci-beam.apache.org/job/beam_PostCommit_Python36/ws/src/build/gradleenv/-1734967053/lib/python3.6/site-packages/google/api_core/future/polling.py",> line 134, in result
    raise self._exception

apache_beam.io.gcp.tests.bigquery_matcher: INFO: Attempting to perform query SELECT total_score FROM `apache-beam-testing.leader_board_it_dataset16065435598340.leader_board_teams` WHERE total_score=5000 LIMIT 1 to BQ
google.auth._default: DEBUG: Checking None for explicit credentials as part of auth process...
google.auth._default: DEBUG: Checking Cloud SDK credentials as part of auth process...
google.auth._default: DEBUG: Cloud SDK credentials not found on disk; not using them
google.auth._default: DEBUG: Checking for App Engine runtime as part of auth process...
google.auth._default: DEBUG: No App Engine library was found so cannot authentication via App Engine Identity Credentials.
google.auth.transport._http_client: DEBUG: Making request: GET http://169.254.169.254
google.auth.transport._http_client: DEBUG: Making request: GET http://metadata.google.internal/computeMetadata/v1/project/project-id
urllib3.util.retry: DEBUG: Converted retries value: 3 -> Retry(total=3, connect=None, read=None, redirect=None, status=None)
google.auth.transport.requests: DEBUG: Making request: GET http://metadata.google.internal/computeMetadata/v1/instance/service-accounts/default/?recursive=true
urllib3.connectionpool: DEBUG: Starting new HTTP connection (1): metadata.google.internal:80
urllib3.connectionpool: DEBUG: http://metadata.google.internal:80 "GET /computeMetadata/v1/instance/service-accounts/default/?recursive=true HTTP/1.1" 200 144
google.auth.transport.requests: DEBUG: Making request: GET http://metadata.google.internal/computeMetadata/v1/instance/service-accounts/844138762903-compute@developer.gserviceaccount.com/token?scopes=https%3A%2F%2Fwww.googleapis.com%2Fauth%2Fbigquery%2Chttps%3A%2F%2Fwww.googleapis.com%2Fauth%2Fcloud-platform
urllib3.connectionpool: DEBUG: http://metadata.google.internal:80 "GET /computeMetadata/v1/instance/service-accounts/844138762903-compute@developer.gserviceaccount.com/token?scopes=https%3A%2F%2Fwww.googleapis.com%2Fauth%2Fbigquery%2Chttps%3A%2F%2Fwww.googleapis.com%2Fauth%2Fcloud-platform HTTP/1.1" 200 241
urllib3.connectionpool: DEBUG: Starting new HTTPS connection (1): bigquery.googleapis.com:443
urllib3.connectionpool: DEBUG: https://bigquery.googleapis.com:443 "POST /bigquery/v2/projects/apache-beam-testing/jobs?prettyPrint=false HTTP/1.1" 200 None
apache_beam.utils.retry: WARNING: Retry with exponential backoff: waiting for 12.907636104967795 seconds before retrying _query_with_retry because we caught exception: google.api_core.exceptions.NotFound: 404 Not found: Table apache-beam-testing:leader_board_it_dataset16065435598340.leader_board_teams was not found in location US

(job ID: 7c96de01-d6d0-4667-9a9b-61c0a5a658b4)

                                                     -----Query Job SQL Follows-----                                                      

    |    .    |    .    |    .    |    .    |    .    |    .    |    .    |    .    |    .    |    .    |    .    |    .    |    .    |
   1:SELECT total_score FROM `apache-beam-testing.leader_board_it_dataset16065435598340.leader_board_teams` WHERE total_score=5000 LIMIT 1
    |    .    |    .    |    .    |    .    |    .    |    .    |    .    |    .    |    .    |    .    |    .    |    .    |    .    |
 Traceback for above exception (most recent call last):
  File "<https://ci-beam.apache.org/job/beam_PostCommit_Python36/ws/src/sdks/python/apache_beam/utils/retry.py",> line 260, in wrapper
    return fun(*args, **kwargs)
  File "<https://ci-beam.apache.org/job/beam_PostCommit_Python36/ws/src/sdks/python/apache_beam/io/gcp/tests/bigquery_matcher.py",> line 128, in _query_with_retry
    rows = query_job.result(timeout=60)
  File "<https://ci-beam.apache.org/job/beam_PostCommit_Python36/ws/src/build/gradleenv/-1734967053/lib/python3.6/site-packages/google/cloud/bigquery/job.py",> line 3230, in result
    super(QueryJob, self).result(retry=retry, timeout=timeout)
  File "<https://ci-beam.apache.org/job/beam_PostCommit_Python36/ws/src/build/gradleenv/-1734967053/lib/python3.6/site-packages/google/cloud/bigquery/job.py",> line 835, in result
    return super(_AsyncJob, self).result(timeout=timeout)
  File "<https://ci-beam.apache.org/job/beam_PostCommit_Python36/ws/src/build/gradleenv/-1734967053/lib/python3.6/site-packages/google/api_core/future/polling.py",> line 134, in result
    raise self._exception

apache_beam.io.gcp.tests.bigquery_matcher: INFO: Attempting to perform query SELECT total_score FROM `apache-beam-testing.leader_board_it_dataset16065435598340.leader_board_teams` WHERE total_score=5000 LIMIT 1 to BQ
google.auth._default: DEBUG: Checking None for explicit credentials as part of auth process...
google.auth._default: DEBUG: Checking Cloud SDK credentials as part of auth process...
google.auth._default: DEBUG: Cloud SDK credentials not found on disk; not using them
google.auth._default: DEBUG: Checking for App Engine runtime as part of auth process...
google.auth._default: DEBUG: No App Engine library was found so cannot authentication via App Engine Identity Credentials.
google.auth.transport._http_client: DEBUG: Making request: GET http://169.254.169.254
google.auth.transport._http_client: DEBUG: Making request: GET http://metadata.google.internal/computeMetadata/v1/project/project-id
urllib3.util.retry: DEBUG: Converted retries value: 3 -> Retry(total=3, connect=None, read=None, redirect=None, status=None)
google.auth.transport.requests: DEBUG: Making request: GET http://metadata.google.internal/computeMetadata/v1/instance/service-accounts/default/?recursive=true
urllib3.connectionpool: DEBUG: Starting new HTTP connection (1): metadata.google.internal:80
urllib3.connectionpool: DEBUG: http://metadata.google.internal:80 "GET /computeMetadata/v1/instance/service-accounts/default/?recursive=true HTTP/1.1" 200 144
google.auth.transport.requests: DEBUG: Making request: GET http://metadata.google.internal/computeMetadata/v1/instance/service-accounts/844138762903-compute@developer.gserviceaccount.com/token?scopes=https%3A%2F%2Fwww.googleapis.com%2Fauth%2Fbigquery%2Chttps%3A%2F%2Fwww.googleapis.com%2Fauth%2Fcloud-platform
urllib3.connectionpool: DEBUG: http://metadata.google.internal:80 "GET /computeMetadata/v1/instance/service-accounts/844138762903-compute@developer.gserviceaccount.com/token?scopes=https%3A%2F%2Fwww.googleapis.com%2Fauth%2Fbigquery%2Chttps%3A%2F%2Fwww.googleapis.com%2Fauth%2Fcloud-platform HTTP/1.1" 200 241
urllib3.connectionpool: DEBUG: Starting new HTTPS connection (1): bigquery.googleapis.com:443
urllib3.connectionpool: DEBUG: https://bigquery.googleapis.com:443 "POST /bigquery/v2/projects/apache-beam-testing/jobs?prettyPrint=false HTTP/1.1" 200 None
apache_beam.utils.retry: WARNING: Retry with exponential backoff: waiting for 28.174172520748456 seconds before retrying _query_with_retry because we caught exception: google.api_core.exceptions.NotFound: 404 Not found: Table apache-beam-testing:leader_board_it_dataset16065435598340.leader_board_teams was not found in location US

(job ID: 1422506c-4d89-43ee-827b-e6ce80802d46)

                                                     -----Query Job SQL Follows-----                                                      

    |    .    |    .    |    .    |    .    |    .    |    .    |    .    |    .    |    .    |    .    |    .    |    .    |    .    |
   1:SELECT total_score FROM `apache-beam-testing.leader_board_it_dataset16065435598340.leader_board_teams` WHERE total_score=5000 LIMIT 1
    |    .    |    .    |    .    |    .    |    .    |    .    |    .    |    .    |    .    |    .    |    .    |    .    |    .    |
 Traceback for above exception (most recent call last):
  File "<https://ci-beam.apache.org/job/beam_PostCommit_Python36/ws/src/sdks/python/apache_beam/utils/retry.py",> line 260, in wrapper
    return fun(*args, **kwargs)
  File "<https://ci-beam.apache.org/job/beam_PostCommit_Python36/ws/src/sdks/python/apache_beam/io/gcp/tests/bigquery_matcher.py",> line 128, in _query_with_retry
    rows = query_job.result(timeout=60)
  File "<https://ci-beam.apache.org/job/beam_PostCommit_Python36/ws/src/build/gradleenv/-1734967053/lib/python3.6/site-packages/google/cloud/bigquery/job.py",> line 3230, in result
    super(QueryJob, self).result(retry=retry, timeout=timeout)
  File "<https://ci-beam.apache.org/job/beam_PostCommit_Python36/ws/src/build/gradleenv/-1734967053/lib/python3.6/site-packages/google/cloud/bigquery/job.py",> line 835, in result
    return super(_AsyncJob, self).result(timeout=timeout)
  File "<https://ci-beam.apache.org/job/beam_PostCommit_Python36/ws/src/build/gradleenv/-1734967053/lib/python3.6/site-packages/google/api_core/future/polling.py",> line 134, in result
    raise self._exception

apache_beam.io.gcp.tests.bigquery_matcher: INFO: Attempting to perform query SELECT total_score FROM `apache-beam-testing.leader_board_it_dataset16065435598340.leader_board_teams` WHERE total_score=5000 LIMIT 1 to BQ
google.auth._default: DEBUG: Checking None for explicit credentials as part of auth process...
google.auth._default: DEBUG: Checking Cloud SDK credentials as part of auth process...
google.auth._default: DEBUG: Cloud SDK credentials not found on disk; not using them
google.auth._default: DEBUG: Checking for App Engine runtime as part of auth process...
google.auth._default: DEBUG: No App Engine library was found so cannot authentication via App Engine Identity Credentials.
google.auth.transport._http_client: DEBUG: Making request: GET http://169.254.169.254
google.auth.transport._http_client: DEBUG: Making request: GET http://metadata.google.internal/computeMetadata/v1/project/project-id
urllib3.util.retry: DEBUG: Converted retries value: 3 -> Retry(total=3, connect=None, read=None, redirect=None, status=None)
google.auth.transport.requests: DEBUG: Making request: GET http://metadata.google.internal/computeMetadata/v1/instance/service-accounts/default/?recursive=true
urllib3.connectionpool: DEBUG: Starting new HTTP connection (1): metadata.google.internal:80
urllib3.connectionpool: DEBUG: http://metadata.google.internal:80 "GET /computeMetadata/v1/instance/service-accounts/default/?recursive=true HTTP/1.1" 200 144
google.auth.transport.requests: DEBUG: Making request: GET http://metadata.google.internal/computeMetadata/v1/instance/service-accounts/844138762903-compute@developer.gserviceaccount.com/token?scopes=https%3A%2F%2Fwww.googleapis.com%2Fauth%2Fbigquery%2Chttps%3A%2F%2Fwww.googleapis.com%2Fauth%2Fcloud-platform
urllib3.connectionpool: DEBUG: http://metadata.google.internal:80 "GET /computeMetadata/v1/instance/service-accounts/844138762903-compute@developer.gserviceaccount.com/token?scopes=https%3A%2F%2Fwww.googleapis.com%2Fauth%2Fbigquery%2Chttps%3A%2F%2Fwww.googleapis.com%2Fauth%2Fcloud-platform HTTP/1.1" 200 241
urllib3.connectionpool: DEBUG: Starting new HTTPS connection (1): bigquery.googleapis.com:443
urllib3.connectionpool: DEBUG: https://bigquery.googleapis.com:443 "POST /bigquery/v2/projects/apache-beam-testing/jobs?prettyPrint=false HTTP/1.1" 200 None
apache_beam.utils.retry: WARNING: Retry with exponential backoff: waiting for 56.16509867524874 seconds before retrying _query_with_retry because we caught exception: google.api_core.exceptions.NotFound: 404 Not found: Table apache-beam-testing:leader_board_it_dataset16065435598340.leader_board_teams was not found in location US

(job ID: 717db0bb-bd72-4ed3-a6a9-72e83d461487)

                                                     -----Query Job SQL Follows-----                                                      

    |    .    |    .    |    .    |    .    |    .    |    .    |    .    |    .    |    .    |    .    |    .    |    .    |    .    |
   1:SELECT total_score FROM `apache-beam-testing.leader_board_it_dataset16065435598340.leader_board_teams` WHERE total_score=5000 LIMIT 1
    |    .    |    .    |    .    |    .    |    .    |    .    |    .    |    .    |    .    |    .    |    .    |    .    |    .    |
 Traceback for above exception (most recent call last):
  File "<https://ci-beam.apache.org/job/beam_PostCommit_Python36/ws/src/sdks/python/apache_beam/utils/retry.py",> line 260, in wrapper
    return fun(*args, **kwargs)
  File "<https://ci-beam.apache.org/job/beam_PostCommit_Python36/ws/src/sdks/python/apache_beam/io/gcp/tests/bigquery_matcher.py",> line 128, in _query_with_retry
    rows = query_job.result(timeout=60)
  File "<https://ci-beam.apache.org/job/beam_PostCommit_Python36/ws/src/build/gradleenv/-1734967053/lib/python3.6/site-packages/google/cloud/bigquery/job.py",> line 3230, in result
    super(QueryJob, self).result(retry=retry, timeout=timeout)
  File "<https://ci-beam.apache.org/job/beam_PostCommit_Python36/ws/src/build/gradleenv/-1734967053/lib/python3.6/site-packages/google/cloud/bigquery/job.py",> line 835, in result
    return super(_AsyncJob, self).result(timeout=timeout)
  File "<https://ci-beam.apache.org/job/beam_PostCommit_Python36/ws/src/build/gradleenv/-1734967053/lib/python3.6/site-packages/google/api_core/future/polling.py",> line 134, in result
    raise self._exception

apache_beam.io.gcp.tests.bigquery_matcher: INFO: Attempting to perform query SELECT total_score FROM `apache-beam-testing.leader_board_it_dataset16065435598340.leader_board_teams` WHERE total_score=5000 LIMIT 1 to BQ
google.auth._default: DEBUG: Checking None for explicit credentials as part of auth process...
google.auth._default: DEBUG: Checking Cloud SDK credentials as part of auth process...
google.auth._default: DEBUG: Cloud SDK credentials not found on disk; not using them
google.auth._default: DEBUG: Checking for App Engine runtime as part of auth process...
google.auth._default: DEBUG: No App Engine library was found so cannot authentication via App Engine Identity Credentials.
google.auth.transport._http_client: DEBUG: Making request: GET http://169.254.169.254
google.auth.transport._http_client: DEBUG: Making request: GET http://metadata.google.internal/computeMetadata/v1/project/project-id
urllib3.util.retry: DEBUG: Converted retries value: 3 -> Retry(total=3, connect=None, read=None, redirect=None, status=None)
google.auth.transport.requests: DEBUG: Making request: GET http://metadata.google.internal/computeMetadata/v1/instance/service-accounts/default/?recursive=true
urllib3.connectionpool: DEBUG: Starting new HTTP connection (1): metadata.google.internal:80
urllib3.connectionpool: DEBUG: http://metadata.google.internal:80 "GET /computeMetadata/v1/instance/service-accounts/default/?recursive=true HTTP/1.1" 200 144
google.auth.transport.requests: DEBUG: Making request: GET http://metadata.google.internal/computeMetadata/v1/instance/service-accounts/844138762903-compute@developer.gserviceaccount.com/token?scopes=https%3A%2F%2Fwww.googleapis.com%2Fauth%2Fbigquery%2Chttps%3A%2F%2Fwww.googleapis.com%2Fauth%2Fcloud-platform
urllib3.connectionpool: DEBUG: http://metadata.google.internal:80 "GET /computeMetadata/v1/instance/service-accounts/844138762903-compute@developer.gserviceaccount.com/token?scopes=https%3A%2F%2Fwww.googleapis.com%2Fauth%2Fbigquery%2Chttps%3A%2F%2Fwww.googleapis.com%2Fauth%2Fcloud-platform HTTP/1.1" 200 241
urllib3.connectionpool: DEBUG: Starting new HTTPS connection (1): bigquery.googleapis.com:443
urllib3.connectionpool: DEBUG: https://bigquery.googleapis.com:443 "POST /bigquery/v2/projects/apache-beam-testing/jobs?prettyPrint=false HTTP/1.1" 200 None
google.auth._default: DEBUG: Checking None for explicit credentials as part of auth process...
google.auth._default: DEBUG: Checking Cloud SDK credentials as part of auth process...
google.auth._default: DEBUG: Cloud SDK credentials not found on disk; not using them
google.auth._default: DEBUG: Checking for App Engine runtime as part of auth process...
google.auth._default: DEBUG: No App Engine library was found so cannot authentication via App Engine Identity Credentials.
google.auth.transport._http_client: DEBUG: Making request: GET http://169.254.169.254
google.auth.transport._http_client: DEBUG: Making request: GET http://metadata.google.internal/computeMetadata/v1/project/project-id
urllib3.util.retry: DEBUG: Converted retries value: 3 -> Retry(total=3, connect=None, read=None, redirect=None, status=None)
google.auth.transport.requests: DEBUG: Making request: GET http://metadata.google.internal/computeMetadata/v1/instance/service-accounts/default/?recursive=true
urllib3.connectionpool: DEBUG: Starting new HTTP connection (1): metadata.google.internal:80
urllib3.connectionpool: DEBUG: http://metadata.google.internal:80 "GET /computeMetadata/v1/instance/service-accounts/default/?recursive=true HTTP/1.1" 200 144
google.auth.transport.requests: DEBUG: Making request: GET http://metadata.google.internal/computeMetadata/v1/instance/service-accounts/844138762903-compute@developer.gserviceaccount.com/token?scopes=https%3A%2F%2Fwww.googleapis.com%2Fauth%2Fbigquery%2Chttps%3A%2F%2Fwww.googleapis.com%2Fauth%2Fcloud-platform
urllib3.connectionpool: DEBUG: http://metadata.google.internal:80 "GET /computeMetadata/v1/instance/service-accounts/844138762903-compute@developer.gserviceaccount.com/token?scopes=https%3A%2F%2Fwww.googleapis.com%2Fauth%2Fbigquery%2Chttps%3A%2F%2Fwww.googleapis.com%2Fauth%2Fcloud-platform HTTP/1.1" 200 241
urllib3.connectionpool: DEBUG: Starting new HTTPS connection (1): bigquery.googleapis.com:443
urllib3.connectionpool: DEBUG: https://bigquery.googleapis.com:443 "DELETE /bigquery/v2/projects/apache-beam-testing/datasets/leader_board_it_dataset16065435598340?deleteContents=true&prettyPrint=false HTTP/1.1" 200 None
--------------------- >> end captured logging << ---------------------

----------------------------------------------------------------------
XML: nosetests-postCommitIT-df-py36.xml
----------------------------------------------------------------------
XML: <https://ci-beam.apache.org/job/beam_PostCommit_Python36/ws/src/sdks/python/nosetests.xml>
----------------------------------------------------------------------
Ran 67 tests in 4343.300s

FAILED (SKIP=7, errors=1)

> Task :sdks:python:test-suites:dataflow:py36:postCommitIT FAILED

FAILURE: Build failed with an exception.

* Where:
Script '<https://ci-beam.apache.org/job/beam_PostCommit_Python36/ws/src/sdks/python/test-suites/dataflow/common.gradle'> line: 118

* What went wrong:
Execution failed for task ':sdks:python:test-suites:dataflow:py36:postCommitIT'.
> Process 'command 'sh'' finished with non-zero exit value 1

* Try:
Run with --stacktrace option to get the stack trace. Run with --info or --debug option to get more log output. Run with --scan to get full insights.

* Get more help at https://help.gradle.org

Deprecated Gradle features were used in this build, making it incompatible with Gradle 7.0.
Use '--warning-mode all' to show the individual deprecation warnings.
See https://docs.gradle.org/6.7/userguide/command_line_interface.html#sec:command_line_warnings

BUILD FAILED in 1h 16m 54s
208 actionable tasks: 164 executed, 40 from cache, 4 up-to-date
Gradle was unable to watch the file system for changes. The inotify watches limit is too low.

Publishing build scan...
https://gradle.com/s/yka5inohqamra

Build step 'Invoke Gradle script' changed build result to FAILURE
Build step 'Invoke Gradle script' marked build as failure

---------------------------------------------------------------------
To unsubscribe, e-mail: builds-unsubscribe@beam.apache.org
For additional commands, e-mail: builds-help@beam.apache.org


Jenkins build is back to normal : beam_PostCommit_Python36 #3226

Posted by Apache Jenkins Server <je...@builds.apache.org>.
See <https://ci-beam.apache.org/job/beam_PostCommit_Python36/3226/display/redirect>


---------------------------------------------------------------------
To unsubscribe, e-mail: builds-unsubscribe@beam.apache.org
For additional commands, e-mail: builds-help@beam.apache.org