You are viewing a plain text version of this content. The canonical link for it is here.
Posted to dev@lucene.apache.org by Policeman Jenkins Server <je...@thetaphi.de> on 2013/09/12 11:26:07 UTC
[JENKINS] Lucene-Solr-trunk-Linux (64bit/jdk1.7.0_40) - Build #
7427 - Still Failing!
Build: http://jenkins.thetaphi.de/job/Lucene-Solr-trunk-Linux/7427/
Java: 64bit/jdk1.7.0_40 -XX:-UseCompressedOops -XX:+UseG1GC
1 tests failed.
REGRESSION: org.apache.lucene.classification.KNearestNeighborClassifierTest.testPerformance
Error Message:
CheckIndex failed
Stack Trace:
java.lang.RuntimeException: CheckIndex failed
at __randomizedtesting.SeedInfo.seed([68F81CB00E47182B:AF19EE9265F32084]:0)
at org.apache.lucene.util._TestUtil.checkIndex(_TestUtil.java:227)
at org.apache.lucene.store.MockDirectoryWrapper.close(MockDirectoryWrapper.java:659)
at org.apache.lucene.classification.ClassificationTestBase.tearDown(ClassificationTestBase.java:70)
at sun.reflect.NativeMethodAccessorImpl.invoke0(Native Method)
at sun.reflect.NativeMethodAccessorImpl.invoke(NativeMethodAccessorImpl.java:57)
at sun.reflect.DelegatingMethodAccessorImpl.invoke(DelegatingMethodAccessorImpl.java:43)
at java.lang.reflect.Method.invoke(Method.java:606)
at com.carrotsearch.randomizedtesting.RandomizedRunner.invoke(RandomizedRunner.java:1559)
at com.carrotsearch.randomizedtesting.RandomizedRunner.access$600(RandomizedRunner.java:79)
at com.carrotsearch.randomizedtesting.RandomizedRunner$8.evaluate(RandomizedRunner.java:795)
at org.apache.lucene.util.TestRuleSetupTeardownChained$1.evaluate(TestRuleSetupTeardownChained.java:50)
at org.apache.lucene.util.TestRuleFieldCacheSanity$1.evaluate(TestRuleFieldCacheSanity.java:51)
at org.apache.lucene.util.AbstractBeforeAfterRule$1.evaluate(AbstractBeforeAfterRule.java:46)
at com.carrotsearch.randomizedtesting.rules.SystemPropertiesInvariantRule$1.evaluate(SystemPropertiesInvariantRule.java:55)
at org.apache.lucene.util.TestRuleThreadAndTestName$1.evaluate(TestRuleThreadAndTestName.java:49)
at org.apache.lucene.util.TestRuleIgnoreAfterMaxFailures$1.evaluate(TestRuleIgnoreAfterMaxFailures.java:70)
at org.apache.lucene.util.TestRuleMarkFailure$1.evaluate(TestRuleMarkFailure.java:48)
at com.carrotsearch.randomizedtesting.rules.StatementAdapter.evaluate(StatementAdapter.java:36)
at com.carrotsearch.randomizedtesting.ThreadLeakControl$StatementRunner.run(ThreadLeakControl.java:358)
at com.carrotsearch.randomizedtesting.ThreadLeakControl.forkTimeoutingTask(ThreadLeakControl.java:782)
at com.carrotsearch.randomizedtesting.ThreadLeakControl$3.evaluate(ThreadLeakControl.java:442)
at com.carrotsearch.randomizedtesting.RandomizedRunner.runSingleTest(RandomizedRunner.java:746)
at com.carrotsearch.randomizedtesting.RandomizedRunner$3.evaluate(RandomizedRunner.java:648)
at com.carrotsearch.randomizedtesting.RandomizedRunner$4.evaluate(RandomizedRunner.java:682)
at com.carrotsearch.randomizedtesting.RandomizedRunner$5.evaluate(RandomizedRunner.java:693)
at org.apache.lucene.util.AbstractBeforeAfterRule$1.evaluate(AbstractBeforeAfterRule.java:46)
at org.apache.lucene.util.TestRuleStoreClassName$1.evaluate(TestRuleStoreClassName.java:42)
at com.carrotsearch.randomizedtesting.rules.SystemPropertiesInvariantRule$1.evaluate(SystemPropertiesInvariantRule.java:55)
at com.carrotsearch.randomizedtesting.rules.NoShadowingOrOverridesOnMethodsRule$1.evaluate(NoShadowingOrOverridesOnMethodsRule.java:39)
at com.carrotsearch.randomizedtesting.rules.NoShadowingOrOverridesOnMethodsRule$1.evaluate(NoShadowingOrOverridesOnMethodsRule.java:39)
at com.carrotsearch.randomizedtesting.rules.StatementAdapter.evaluate(StatementAdapter.java:36)
at org.apache.lucene.util.TestRuleAssertionsRequired$1.evaluate(TestRuleAssertionsRequired.java:43)
at org.apache.lucene.util.TestRuleMarkFailure$1.evaluate(TestRuleMarkFailure.java:48)
at org.apache.lucene.util.TestRuleIgnoreAfterMaxFailures$1.evaluate(TestRuleIgnoreAfterMaxFailures.java:70)
at org.apache.lucene.util.TestRuleIgnoreTestSuites$1.evaluate(TestRuleIgnoreTestSuites.java:55)
at com.carrotsearch.randomizedtesting.rules.StatementAdapter.evaluate(StatementAdapter.java:36)
at com.carrotsearch.randomizedtesting.ThreadLeakControl$StatementRunner.run(ThreadLeakControl.java:358)
at java.lang.Thread.run(Thread.java:724)
Build Log:
[...truncated 6618 lines...]
[junit4] Suite: org.apache.lucene.classification.KNearestNeighborClassifierTest
[junit4] 1> CheckIndex failed
[junit4] 1> Segments file=segments_3 numSegments=2 version=5.0 format=
[junit4] 1> 1 of 2: name=_0 docCount=898
[junit4] 1> codec=FastDecompressionCompressingStoredFields(storedFieldsFormat=CompressingStoredFieldsFormat(compressionMode=FAST_DECOMPRESSION, chunkSize=16384), termVectorsFormat=CompressingTermVectorsFormat(compressionMode=FAST_DECOMPRESSION, chunkSize=16384))
[junit4] 1> compound=true
[junit4] 1> numFiles=3
[junit4] 1> size (MB)=0.283
[junit4] 1> diagnostics = {timestamp=1378977956101, os=Linux, os.version=3.2.0-53-generic, source=flush, lucene.version=5.0-SNAPSHOT, os.arch=amd64, java.version=1.7.0_40, java.vendor=Oracle Corporation}
[junit4] 1> no deletions
[junit4] 1> test: open reader.........OK
[junit4] 1> test: fields..............OK [3 fields]
[junit4] 1> test: field norms.........OK [3 fields]
[junit4] 1> test: terms, freq, prox...OK [9449 terms; 16456 terms/docs pairs; 16648 tokens]
[junit4] 1> test: stored fields.......OK [2694 total field count; avg 3 fields per doc]
[junit4] 1> test: term vectors........ERROR [2]
[junit4] 1> java.lang.ArrayIndexOutOfBoundsException: 2
[junit4] 1> at org.apache.lucene.codecs.compressing.CompressingTermVectorsReader.get(CompressingTermVectorsReader.java:393)
[junit4] 1> at org.apache.lucene.index.SegmentReader.getTermVectors(SegmentReader.java:169)
[junit4] 1> at org.apache.lucene.index.CheckIndex.testTermVectors(CheckIndex.java:1524)
[junit4] 1> at org.apache.lucene.index.CheckIndex.checkIndex(CheckIndex.java:611)
[junit4] 1> at org.apache.lucene.util._TestUtil.checkIndex(_TestUtil.java:223)
[junit4] 1> at org.apache.lucene.store.MockDirectoryWrapper.close(MockDirectoryWrapper.java:659)
[junit4] 1> at org.apache.lucene.classification.ClassificationTestBase.tearDown(ClassificationTestBase.java:70)
[junit4] 1> at sun.reflect.NativeMethodAccessorImpl.invoke0(Native Method)
[junit4] 1> at sun.reflect.NativeMethodAccessorImpl.invoke(NativeMethodAccessorImpl.java:57)
[junit4] 1> at sun.reflect.DelegatingMethodAccessorImpl.invoke(DelegatingMethodAccessorImpl.java:43)
[junit4] 1> at java.lang.reflect.Method.invoke(Method.java:606)
[junit4] 1> at com.carrotsearch.randomizedtesting.RandomizedRunner.invoke(RandomizedRunner.java:1559)
[junit4] 1> at com.carrotsearch.randomizedtesting.RandomizedRunner.access$600(RandomizedRunner.java:79)
[junit4] 1> at com.carrotsearch.randomizedtesting.RandomizedRunner$8.evaluate(RandomizedRunner.java:795)
[junit4] 1> at org.apache.lucene.util.TestRuleSetupTeardownChained$1.evaluate(TestRuleSetupTeardownChained.java:50)
[junit4] 1> at org.apache.lucene.util.TestRuleFieldCacheSanity$1.evaluate(TestRuleFieldCacheSanity.java:51)
[junit4] 1> at org.apache.lucene.util.AbstractBeforeAfterRule$1.evaluate(AbstractBeforeAfterRule.java:46)
[junit4] 1> at com.carrotsearch.randomizedtesting.rules.SystemPropertiesInvariantRule$1.evaluate(SystemPropertiesInvariantRule.java:55)
[junit4] 1> at org.apache.lucene.util.TestRuleThreadAndTestName$1.evaluate(TestRuleThreadAndTestName.java:49)
[junit4] 1> at org.apache.lucene.util.TestRuleIgnoreAfterMaxFailures$1.evaluate(TestRuleIgnoreAfterMaxFailures.java:70)
[junit4] 1> at org.apache.lucene.util.TestRuleMarkFailure$1.evaluate(TestRuleMarkFailure.java:48)
[junit4] 1> at com.carrotsearch.randomizedtesting.rules.StatementAdapter.evaluate(StatementAdapter.java:36)
[junit4] 1> at com.carrotsearch.randomizedtesting.ThreadLeakControl$StatementRunner.run(ThreadLeakControl.java:358)
[junit4] 1> at com.carrotsearch.randomizedtesting.ThreadLeakControl.forkTimeoutingTask(ThreadLeakControl.java:782)
[junit4] 1> at com.carrotsearch.randomizedtesting.ThreadLeakControl$3.evaluate(ThreadLeakControl.java:442)
[junit4] 1> at com.carrotsearch.randomizedtesting.RandomizedRunner.runSingleTest(RandomizedRunner.java:746)
[junit4] 1> at com.carrotsearch.randomizedtesting.RandomizedRunner$3.evaluate(RandomizedRunner.java:648)
[junit4] 1> at com.carrotsearch.randomizedtesting.RandomizedRunner$4.evaluate(RandomizedRunner.java:682)
[junit4] 1> at com.carrotsearch.randomizedtesting.RandomizedRunner$5.evaluate(RandomizedRunner.java:693)
[junit4] 1> at org.apache.lucene.util.AbstractBeforeAfterRule$1.evaluate(AbstractBeforeAfterRule.java:46)
[junit4] 1> at org.apache.lucene.util.TestRuleStoreClassName$1.evaluate(TestRuleStoreClassName.java:42)
[junit4] 1> at com.carrotsearch.randomizedtesting.rules.SystemPropertiesInvariantRule$1.evaluate(SystemPropertiesInvariantRule.java:55)
[junit4] 1> at com.carrotsearch.randomizedtesting.rules.NoShadowingOrOverridesOnMethodsRule$1.evaluate(NoShadowingOrOverridesOnMethodsRule.java:39)
[junit4] 1> at com.carrotsearch.randomizedtesting.rules.NoShadowingOrOverridesOnMethodsRule$1.evaluate(NoShadowingOrOverridesOnMethodsRule.java:39)
[junit4] 1> at com.carrotsearch.randomizedtesting.rules.StatementAdapter.evaluate(StatementAdapter.java:36)
[junit4] 1> at org.apache.lucene.util.TestRuleAssertionsRequired$1.evaluate(TestRuleAssertionsRequired.java:43)
[junit4] 1> at org.apache.lucene.util.TestRuleMarkFailure$1.evaluate(TestRuleMarkFailure.java:48)
[junit4] 1> at org.apache.lucene.util.TestRuleIgnoreAfterMaxFailures$1.evaluate(TestRuleIgnoreAfterMaxFailures.java:70)
[junit4] 1> at org.apache.lucene.util.TestRuleIgnoreTestSuites$1.evaluate(TestRuleIgnoreTestSuites.java:55)
[junit4] 1> at com.carrotsearch.randomizedtesting.rules.StatementAdapter.evaluate(StatementAdapter.java:36)
[junit4] 1> at com.carrotsearch.randomizedtesting.ThreadLeakControl$StatementRunner.run(ThreadLeakControl.java:358)
[junit4] 1> at java.lang.Thread.run(Thread.java:724)
[junit4] 1> test: docvalues...........OK [0 docvalues fields; 0 BINARY; 0 NUMERIC; 0 SORTED; 0 SORTED_SET]
[junit4] 1> FAILED
[junit4] 1> WARNING: fixIndex() would remove reference to this segment; full exception:
[junit4] 1> java.lang.RuntimeException: Term Vector test failed
[junit4] 1> at org.apache.lucene.index.CheckIndex.checkIndex(CheckIndex.java:624)
[junit4] 1> at org.apache.lucene.util._TestUtil.checkIndex(_TestUtil.java:223)
[junit4] 1> at org.apache.lucene.store.MockDirectoryWrapper.close(MockDirectoryWrapper.java:659)
[junit4] 1> at org.apache.lucene.classification.ClassificationTestBase.tearDown(ClassificationTestBase.java:70)
[junit4] 1> at sun.reflect.NativeMethodAccessorImpl.invoke0(Native Method)
[junit4] 1> at sun.reflect.NativeMethodAccessorImpl.invoke(NativeMethodAccessorImpl.java:57)
[junit4] 1> at sun.reflect.DelegatingMethodAccessorImpl.invoke(DelegatingMethodAccessorImpl.java:43)
[junit4] 1> at java.lang.reflect.Method.invoke(Method.java:606)
[junit4] 1> at com.carrotsearch.randomizedtesting.RandomizedRunner.invoke(RandomizedRunner.java:1559)
[junit4] 1> at com.carrotsearch.randomizedtesting.RandomizedRunner.access$600(RandomizedRunner.java:79)
[junit4] 1> at com.carrotsearch.randomizedtesting.RandomizedRunner$8.evaluate(RandomizedRunner.java:795)
[junit4] 1> at org.apache.lucene.util.TestRuleSetupTeardownChained$1.evaluate(TestRuleSetupTeardownChained.java:50)
[junit4] 1> at org.apache.lucene.util.TestRuleFieldCacheSanity$1.evaluate(TestRuleFieldCacheSanity.java:51)
[junit4] 1> at org.apache.lucene.util.AbstractBeforeAfterRule$1.evaluate(AbstractBeforeAfterRule.java:46)
[junit4] 1> at com.carrotsearch.randomizedtesting.rules.SystemPropertiesInvariantRule$1.evaluate(SystemPropertiesInvariantRule.java:55)
[junit4] 1> at org.apache.lucene.util.TestRuleThreadAndTestName$1.evaluate(TestRuleThreadAndTestName.java:49)
[junit4] 1> at org.apache.lucene.util.TestRuleIgnoreAfterMaxFailures$1.evaluate(TestRuleIgnoreAfterMaxFailures.java:70)
[junit4] 1> at org.apache.lucene.util.TestRuleMarkFailure$1.evaluate(TestRuleMarkFailure.java:48)
[junit4] 1> at com.carrotsearch.randomizedtesting.rules.StatementAdapter.evaluate(StatementAdapter.java:36)
[junit4] 1> at com.carrotsearch.randomizedtesting.ThreadLeakControl$StatementRunner.run(ThreadLeakControl.java:358)
[junit4] 1> at com.carrotsearch.randomizedtesting.ThreadLeakControl.forkTimeoutingTask(ThreadLeakControl.java:782)
[junit4] 1> at com.carrotsearch.randomizedtesting.ThreadLeakControl$3.evaluate(ThreadLeakControl.java:442)
[junit4] 1> at com.carrotsearch.randomizedtesting.RandomizedRunner.runSingleTest(RandomizedRunner.java:746)
[junit4] 1> at com.carrotsearch.randomizedtesting.RandomizedRunner$3.evaluate(RandomizedRunner.java:648)
[junit4] 1> at com.carrotsearch.randomizedtesting.RandomizedRunner$4.evaluate(RandomizedRunner.java:682)
[junit4] 1> at com.carrotsearch.randomizedtesting.RandomizedRunner$5.evaluate(RandomizedRunner.java:693)
[junit4] 1> at org.apache.lucene.util.AbstractBeforeAfterRule$1.evaluate(AbstractBeforeAfterRule.java:46)
[junit4] 1> at org.apache.lucene.util.TestRuleStoreClassName$1.evaluate(TestRuleStoreClassName.java:42)
[junit4] 1> at com.carrotsearch.randomizedtesting.rules.SystemPropertiesInvariantRule$1.evaluate(SystemPropertiesInvariantRule.java:55)
[junit4] 1> at com.carrotsearch.randomizedtesting.rules.NoShadowingOrOverridesOnMethodsRule$1.evaluate(NoShadowingOrOverridesOnMethodsRule.java:39)
[junit4] 1> at com.carrotsearch.randomizedtesting.rules.NoShadowingOrOverridesOnMethodsRule$1.evaluate(NoShadowingOrOverridesOnMethodsRule.java:39)
[junit4] 1> at com.carrotsearch.randomizedtesting.rules.StatementAdapter.evaluate(StatementAdapter.java:36)
[junit4] 1> at org.apache.lucene.util.TestRuleAssertionsRequired$1.evaluate(TestRuleAssertionsRequired.java:43)
[junit4] 1> at org.apache.lucene.util.TestRuleMarkFailure$1.evaluate(TestRuleMarkFailure.java:48)
[junit4] 1> at org.apache.lucene.util.TestRuleIgnoreAfterMaxFailures$1.evaluate(TestRuleIgnoreAfterMaxFailures.java:70)
[junit4] 1> at org.apache.lucene.util.TestRuleIgnoreTestSuites$1.evaluate(TestRuleIgnoreTestSuites.java:55)
[junit4] 1> at com.carrotsearch.randomizedtesting.rules.StatementAdapter.evaluate(StatementAdapter.java:36)
[junit4] 1> at com.carrotsearch.randomizedtesting.ThreadLeakControl$StatementRunner.run(ThreadLeakControl.java:358)
[junit4] 1> at java.lang.Thread.run(Thread.java:724)
[junit4] 1>
[junit4] 1> 2 of 2: name=_1 docCount=102
[junit4] 1> codec=FastDecompressionCompressingStoredFields(storedFieldsFormat=CompressingStoredFieldsFormat(compressionMode=FAST_DECOMPRESSION, chunkSize=16384), termVectorsFormat=CompressingTermVectorsFormat(compressionMode=FAST_DECOMPRESSION, chunkSize=16384))
[junit4] 1> compound=true
[junit4] 1> numFiles=3
[junit4] 1> size (MB)=0.034
[junit4] 1> diagnostics = {timestamp=1378977956167, os=Linux, os.version=3.2.0-53-generic, source=flush, lucene.version=5.0-SNAPSHOT, os.arch=amd64, java.version=1.7.0_40, java.vendor=Oracle Corporation}
[junit4] 1> no deletions
[junit4] 1> test: open reader.........OK
[junit4] 1> test: fields..............OK [3 fields]
[junit4] 1> test: field norms.........OK [3 fields]
[junit4] 1> test: terms, freq, prox...OK [1297 terms; 1894 terms/docs pairs; 1912 tokens]
[junit4] 1> test: stored fields.......OK [306 total field count; avg 3 fields per doc]
[junit4] 1> test: term vectors........OK [306 total vector count; avg 3 term/freq vector fields per doc]
[junit4] 1> test: docvalues...........OK [0 docvalues fields; 0 BINARY; 0 NUMERIC; 0 SORTED; 0 SORTED_SET]
[junit4] 1>
[junit4] 1> WARNING: 1 broken segments (containing 898 documents) detected
[junit4] 1>
[junit4] 2> NOTE: reproduce with: ant test -Dtestcase=KNearestNeighborClassifierTest -Dtests.method=testPerformance -Dtests.seed=68F81CB00E47182B -Dtests.multiplier=3 -Dtests.slow=true -Dtests.locale=es_BO -Dtests.timezone=NST -Dtests.file.encoding=UTF-8
[junit4] ERROR 2.72s J0 | KNearestNeighborClassifierTest.testPerformance <<<
[junit4] > Throwable #1: java.lang.RuntimeException: CheckIndex failed
[junit4] > at __randomizedtesting.SeedInfo.seed([68F81CB00E47182B:AF19EE9265F32084]:0)
[junit4] > at org.apache.lucene.util._TestUtil.checkIndex(_TestUtil.java:227)
[junit4] > at org.apache.lucene.store.MockDirectoryWrapper.close(MockDirectoryWrapper.java:659)
[junit4] > at org.apache.lucene.classification.ClassificationTestBase.tearDown(ClassificationTestBase.java:70)
[junit4] > at java.lang.Thread.run(Thread.java:724)
[junit4] 2> NOTE: test params are: codec=FastDecompressionCompressingStoredFields(storedFieldsFormat=CompressingStoredFieldsFormat(compressionMode=FAST_DECOMPRESSION, chunkSize=168), termVectorsFormat=CompressingTermVectorsFormat(compressionMode=FAST_DECOMPRESSION, chunkSize=168)), sim=RandomSimilarityProvider(queryNorm=true,coord=yes): {text=DFR GB1, cat=DFR I(n)B1, bool=DFR G2}, locale=es_BO, timezone=NST
[junit4] 2> NOTE: Linux 3.2.0-53-generic amd64/Oracle Corporation 1.7.0_40 (64-bit)/cpus=8,threads=1,free=59466608,total=131072000
[junit4] 2> NOTE: All tests run in this JVM: [DataSplitterTest, KNearestNeighborClassifierTest]
[junit4] Completed on J0 in 2.91s, 2 tests, 1 error <<< FAILURES!
[...truncated 13 lines...]
BUILD FAILED
/mnt/ssd/jenkins/workspace/Lucene-Solr-trunk-Linux/build.xml:396: The following error occurred while executing this line:
/mnt/ssd/jenkins/workspace/Lucene-Solr-trunk-Linux/build.xml:376: The following error occurred while executing this line:
/mnt/ssd/jenkins/workspace/Lucene-Solr-trunk-Linux/build.xml:39: The following error occurred while executing this line:
/mnt/ssd/jenkins/workspace/Lucene-Solr-trunk-Linux/lucene/build.xml:556: The following error occurred while executing this line:
/mnt/ssd/jenkins/workspace/Lucene-Solr-trunk-Linux/lucene/common-build.xml:1885: The following error occurred while executing this line:
/mnt/ssd/jenkins/workspace/Lucene-Solr-trunk-Linux/lucene/module-build.xml:61: The following error occurred while executing this line:
/mnt/ssd/jenkins/workspace/Lucene-Solr-trunk-Linux/lucene/common-build.xml:1230: The following error occurred while executing this line:
/mnt/ssd/jenkins/workspace/Lucene-Solr-trunk-Linux/lucene/common-build.xml:873: There were test failures: 4 suites, 10 tests, 1 error
Total time: 12 minutes 29 seconds
Build step 'Invoke Ant' marked build as failure
Description set: Java: 64bit/jdk1.7.0_40 -XX:-UseCompressedOops -XX:+UseG1GC
Archiving artifacts
Recording test results
Email was triggered for: Failure
Sending email for trigger: Failure
Re: [JENKINS] Lucene-Solr-trunk-Linux (64bit/jdk1.7.0_40) - Build #
7427 - Still Failing!
Posted by Michael McCandless <lu...@mikemccandless.com>.
It looks like this is the new JVM bug:
https://issues.apache.org/jira/browse/LUCENE-5212
We don't know much about it yet ... except the JVM bug was not present
in 1.7.0_25 and is present in 1.7.0_40.
Mike McCandless
http://blog.mikemccandless.com
On Fri, Sep 13, 2013 at 12:08 PM, Robert Muir <rc...@gmail.com> wrote:
> Maybe it will reproduce with the master seed.
>
>
> On Fri, Sep 13, 2013 at 7:14 AM, Michael McCandless
> <lu...@mikemccandless.com> wrote:
>> This doesn't repro on current trunk ...
>>
>> Mike McCandless
>>
>> http://blog.mikemccandless.com
>>
>>
>> On Thu, Sep 12, 2013 at 5:26 AM, Policeman Jenkins Server
>> <je...@thetaphi.de> wrote:
>>> Build: http://jenkins.thetaphi.de/job/Lucene-Solr-trunk-Linux/7427/
>>> Java: 64bit/jdk1.7.0_40 -XX:-UseCompressedOops -XX:+UseG1GC
>>>
>>> 1 tests failed.
>>> REGRESSION: org.apache.lucene.classification.KNearestNeighborClassifierTest.testPerformance
>>>
>>> Error Message:
>>> CheckIndex failed
>>>
>>> Stack Trace:
>>> java.lang.RuntimeException: CheckIndex failed
>>> at __randomizedtesting.SeedInfo.seed([68F81CB00E47182B:AF19EE9265F32084]:0)
>>> at org.apache.lucene.util._TestUtil.checkIndex(_TestUtil.java:227)
>>> at org.apache.lucene.store.MockDirectoryWrapper.close(MockDirectoryWrapper.java:659)
>>> at org.apache.lucene.classification.ClassificationTestBase.tearDown(ClassificationTestBase.java:70)
>>> at sun.reflect.NativeMethodAccessorImpl.invoke0(Native Method)
>>> at sun.reflect.NativeMethodAccessorImpl.invoke(NativeMethodAccessorImpl.java:57)
>>> at sun.reflect.DelegatingMethodAccessorImpl.invoke(DelegatingMethodAccessorImpl.java:43)
>>> at java.lang.reflect.Method.invoke(Method.java:606)
>>> at com.carrotsearch.randomizedtesting.RandomizedRunner.invoke(RandomizedRunner.java:1559)
>>> at com.carrotsearch.randomizedtesting.RandomizedRunner.access$600(RandomizedRunner.java:79)
>>> at com.carrotsearch.randomizedtesting.RandomizedRunner$8.evaluate(RandomizedRunner.java:795)
>>> at org.apache.lucene.util.TestRuleSetupTeardownChained$1.evaluate(TestRuleSetupTeardownChained.java:50)
>>> at org.apache.lucene.util.TestRuleFieldCacheSanity$1.evaluate(TestRuleFieldCacheSanity.java:51)
>>> at org.apache.lucene.util.AbstractBeforeAfterRule$1.evaluate(AbstractBeforeAfterRule.java:46)
>>> at com.carrotsearch.randomizedtesting.rules.SystemPropertiesInvariantRule$1.evaluate(SystemPropertiesInvariantRule.java:55)
>>> at org.apache.lucene.util.TestRuleThreadAndTestName$1.evaluate(TestRuleThreadAndTestName.java:49)
>>> at org.apache.lucene.util.TestRuleIgnoreAfterMaxFailures$1.evaluate(TestRuleIgnoreAfterMaxFailures.java:70)
>>> at org.apache.lucene.util.TestRuleMarkFailure$1.evaluate(TestRuleMarkFailure.java:48)
>>> at com.carrotsearch.randomizedtesting.rules.StatementAdapter.evaluate(StatementAdapter.java:36)
>>> at com.carrotsearch.randomizedtesting.ThreadLeakControl$StatementRunner.run(ThreadLeakControl.java:358)
>>> at com.carrotsearch.randomizedtesting.ThreadLeakControl.forkTimeoutingTask(ThreadLeakControl.java:782)
>>> at com.carrotsearch.randomizedtesting.ThreadLeakControl$3.evaluate(ThreadLeakControl.java:442)
>>> at com.carrotsearch.randomizedtesting.RandomizedRunner.runSingleTest(RandomizedRunner.java:746)
>>> at com.carrotsearch.randomizedtesting.RandomizedRunner$3.evaluate(RandomizedRunner.java:648)
>>> at com.carrotsearch.randomizedtesting.RandomizedRunner$4.evaluate(RandomizedRunner.java:682)
>>> at com.carrotsearch.randomizedtesting.RandomizedRunner$5.evaluate(RandomizedRunner.java:693)
>>> at org.apache.lucene.util.AbstractBeforeAfterRule$1.evaluate(AbstractBeforeAfterRule.java:46)
>>> at org.apache.lucene.util.TestRuleStoreClassName$1.evaluate(TestRuleStoreClassName.java:42)
>>> at com.carrotsearch.randomizedtesting.rules.SystemPropertiesInvariantRule$1.evaluate(SystemPropertiesInvariantRule.java:55)
>>> at com.carrotsearch.randomizedtesting.rules.NoShadowingOrOverridesOnMethodsRule$1.evaluate(NoShadowingOrOverridesOnMethodsRule.java:39)
>>> at com.carrotsearch.randomizedtesting.rules.NoShadowingOrOverridesOnMethodsRule$1.evaluate(NoShadowingOrOverridesOnMethodsRule.java:39)
>>> at com.carrotsearch.randomizedtesting.rules.StatementAdapter.evaluate(StatementAdapter.java:36)
>>> at org.apache.lucene.util.TestRuleAssertionsRequired$1.evaluate(TestRuleAssertionsRequired.java:43)
>>> at org.apache.lucene.util.TestRuleMarkFailure$1.evaluate(TestRuleMarkFailure.java:48)
>>> at org.apache.lucene.util.TestRuleIgnoreAfterMaxFailures$1.evaluate(TestRuleIgnoreAfterMaxFailures.java:70)
>>> at org.apache.lucene.util.TestRuleIgnoreTestSuites$1.evaluate(TestRuleIgnoreTestSuites.java:55)
>>> at com.carrotsearch.randomizedtesting.rules.StatementAdapter.evaluate(StatementAdapter.java:36)
>>> at com.carrotsearch.randomizedtesting.ThreadLeakControl$StatementRunner.run(ThreadLeakControl.java:358)
>>> at java.lang.Thread.run(Thread.java:724)
>>>
>>>
>>>
>>>
>>> Build Log:
>>> [...truncated 6618 lines...]
>>> [junit4] Suite: org.apache.lucene.classification.KNearestNeighborClassifierTest
>>> [junit4] 1> CheckIndex failed
>>> [junit4] 1> Segments file=segments_3 numSegments=2 version=5.0 format=
>>> [junit4] 1> 1 of 2: name=_0 docCount=898
>>> [junit4] 1> codec=FastDecompressionCompressingStoredFields(storedFieldsFormat=CompressingStoredFieldsFormat(compressionMode=FAST_DECOMPRESSION, chunkSize=16384), termVectorsFormat=CompressingTermVectorsFormat(compressionMode=FAST_DECOMPRESSION, chunkSize=16384))
>>> [junit4] 1> compound=true
>>> [junit4] 1> numFiles=3
>>> [junit4] 1> size (MB)=0.283
>>> [junit4] 1> diagnostics = {timestamp=1378977956101, os=Linux, os.version=3.2.0-53-generic, source=flush, lucene.version=5.0-SNAPSHOT, os.arch=amd64, java.version=1.7.0_40, java.vendor=Oracle Corporation}
>>> [junit4] 1> no deletions
>>> [junit4] 1> test: open reader.........OK
>>> [junit4] 1> test: fields..............OK [3 fields]
>>> [junit4] 1> test: field norms.........OK [3 fields]
>>> [junit4] 1> test: terms, freq, prox...OK [9449 terms; 16456 terms/docs pairs; 16648 tokens]
>>> [junit4] 1> test: stored fields.......OK [2694 total field count; avg 3 fields per doc]
>>> [junit4] 1> test: term vectors........ERROR [2]
>>> [junit4] 1> java.lang.ArrayIndexOutOfBoundsException: 2
>>> [junit4] 1> at org.apache.lucene.codecs.compressing.CompressingTermVectorsReader.get(CompressingTermVectorsReader.java:393)
>>> [junit4] 1> at org.apache.lucene.index.SegmentReader.getTermVectors(SegmentReader.java:169)
>>> [junit4] 1> at org.apache.lucene.index.CheckIndex.testTermVectors(CheckIndex.java:1524)
>>> [junit4] 1> at org.apache.lucene.index.CheckIndex.checkIndex(CheckIndex.java:611)
>>> [junit4] 1> at org.apache.lucene.util._TestUtil.checkIndex(_TestUtil.java:223)
>>> [junit4] 1> at org.apache.lucene.store.MockDirectoryWrapper.close(MockDirectoryWrapper.java:659)
>>> [junit4] 1> at org.apache.lucene.classification.ClassificationTestBase.tearDown(ClassificationTestBase.java:70)
>>> [junit4] 1> at sun.reflect.NativeMethodAccessorImpl.invoke0(Native Method)
>>> [junit4] 1> at sun.reflect.NativeMethodAccessorImpl.invoke(NativeMethodAccessorImpl.java:57)
>>> [junit4] 1> at sun.reflect.DelegatingMethodAccessorImpl.invoke(DelegatingMethodAccessorImpl.java:43)
>>> [junit4] 1> at java.lang.reflect.Method.invoke(Method.java:606)
>>> [junit4] 1> at com.carrotsearch.randomizedtesting.RandomizedRunner.invoke(RandomizedRunner.java:1559)
>>> [junit4] 1> at com.carrotsearch.randomizedtesting.RandomizedRunner.access$600(RandomizedRunner.java:79)
>>> [junit4] 1> at com.carrotsearch.randomizedtesting.RandomizedRunner$8.evaluate(RandomizedRunner.java:795)
>>> [junit4] 1> at org.apache.lucene.util.TestRuleSetupTeardownChained$1.evaluate(TestRuleSetupTeardownChained.java:50)
>>> [junit4] 1> at org.apache.lucene.util.TestRuleFieldCacheSanity$1.evaluate(TestRuleFieldCacheSanity.java:51)
>>> [junit4] 1> at org.apache.lucene.util.AbstractBeforeAfterRule$1.evaluate(AbstractBeforeAfterRule.java:46)
>>> [junit4] 1> at com.carrotsearch.randomizedtesting.rules.SystemPropertiesInvariantRule$1.evaluate(SystemPropertiesInvariantRule.java:55)
>>> [junit4] 1> at org.apache.lucene.util.TestRuleThreadAndTestName$1.evaluate(TestRuleThreadAndTestName.java:49)
>>> [junit4] 1> at org.apache.lucene.util.TestRuleIgnoreAfterMaxFailures$1.evaluate(TestRuleIgnoreAfterMaxFailures.java:70)
>>> [junit4] 1> at org.apache.lucene.util.TestRuleMarkFailure$1.evaluate(TestRuleMarkFailure.java:48)
>>> [junit4] 1> at com.carrotsearch.randomizedtesting.rules.StatementAdapter.evaluate(StatementAdapter.java:36)
>>> [junit4] 1> at com.carrotsearch.randomizedtesting.ThreadLeakControl$StatementRunner.run(ThreadLeakControl.java:358)
>>> [junit4] 1> at com.carrotsearch.randomizedtesting.ThreadLeakControl.forkTimeoutingTask(ThreadLeakControl.java:782)
>>> [junit4] 1> at com.carrotsearch.randomizedtesting.ThreadLeakControl$3.evaluate(ThreadLeakControl.java:442)
>>> [junit4] 1> at com.carrotsearch.randomizedtesting.RandomizedRunner.runSingleTest(RandomizedRunner.java:746)
>>> [junit4] 1> at com.carrotsearch.randomizedtesting.RandomizedRunner$3.evaluate(RandomizedRunner.java:648)
>>> [junit4] 1> at com.carrotsearch.randomizedtesting.RandomizedRunner$4.evaluate(RandomizedRunner.java:682)
>>> [junit4] 1> at com.carrotsearch.randomizedtesting.RandomizedRunner$5.evaluate(RandomizedRunner.java:693)
>>> [junit4] 1> at org.apache.lucene.util.AbstractBeforeAfterRule$1.evaluate(AbstractBeforeAfterRule.java:46)
>>> [junit4] 1> at org.apache.lucene.util.TestRuleStoreClassName$1.evaluate(TestRuleStoreClassName.java:42)
>>> [junit4] 1> at com.carrotsearch.randomizedtesting.rules.SystemPropertiesInvariantRule$1.evaluate(SystemPropertiesInvariantRule.java:55)
>>> [junit4] 1> at com.carrotsearch.randomizedtesting.rules.NoShadowingOrOverridesOnMethodsRule$1.evaluate(NoShadowingOrOverridesOnMethodsRule.java:39)
>>> [junit4] 1> at com.carrotsearch.randomizedtesting.rules.NoShadowingOrOverridesOnMethodsRule$1.evaluate(NoShadowingOrOverridesOnMethodsRule.java:39)
>>> [junit4] 1> at com.carrotsearch.randomizedtesting.rules.StatementAdapter.evaluate(StatementAdapter.java:36)
>>> [junit4] 1> at org.apache.lucene.util.TestRuleAssertionsRequired$1.evaluate(TestRuleAssertionsRequired.java:43)
>>> [junit4] 1> at org.apache.lucene.util.TestRuleMarkFailure$1.evaluate(TestRuleMarkFailure.java:48)
>>> [junit4] 1> at org.apache.lucene.util.TestRuleIgnoreAfterMaxFailures$1.evaluate(TestRuleIgnoreAfterMaxFailures.java:70)
>>> [junit4] 1> at org.apache.lucene.util.TestRuleIgnoreTestSuites$1.evaluate(TestRuleIgnoreTestSuites.java:55)
>>> [junit4] 1> at com.carrotsearch.randomizedtesting.rules.StatementAdapter.evaluate(StatementAdapter.java:36)
>>> [junit4] 1> at com.carrotsearch.randomizedtesting.ThreadLeakControl$StatementRunner.run(ThreadLeakControl.java:358)
>>> [junit4] 1> at java.lang.Thread.run(Thread.java:724)
>>> [junit4] 1> test: docvalues...........OK [0 docvalues fields; 0 BINARY; 0 NUMERIC; 0 SORTED; 0 SORTED_SET]
>>> [junit4] 1> FAILED
>>> [junit4] 1> WARNING: fixIndex() would remove reference to this segment; full exception:
>>> [junit4] 1> java.lang.RuntimeException: Term Vector test failed
>>> [junit4] 1> at org.apache.lucene.index.CheckIndex.checkIndex(CheckIndex.java:624)
>>> [junit4] 1> at org.apache.lucene.util._TestUtil.checkIndex(_TestUtil.java:223)
>>> [junit4] 1> at org.apache.lucene.store.MockDirectoryWrapper.close(MockDirectoryWrapper.java:659)
>>> [junit4] 1> at org.apache.lucene.classification.ClassificationTestBase.tearDown(ClassificationTestBase.java:70)
>>> [junit4] 1> at sun.reflect.NativeMethodAccessorImpl.invoke0(Native Method)
>>> [junit4] 1> at sun.reflect.NativeMethodAccessorImpl.invoke(NativeMethodAccessorImpl.java:57)
>>> [junit4] 1> at sun.reflect.DelegatingMethodAccessorImpl.invoke(DelegatingMethodAccessorImpl.java:43)
>>> [junit4] 1> at java.lang.reflect.Method.invoke(Method.java:606)
>>> [junit4] 1> at com.carrotsearch.randomizedtesting.RandomizedRunner.invoke(RandomizedRunner.java:1559)
>>> [junit4] 1> at com.carrotsearch.randomizedtesting.RandomizedRunner.access$600(RandomizedRunner.java:79)
>>> [junit4] 1> at com.carrotsearch.randomizedtesting.RandomizedRunner$8.evaluate(RandomizedRunner.java:795)
>>> [junit4] 1> at org.apache.lucene.util.TestRuleSetupTeardownChained$1.evaluate(TestRuleSetupTeardownChained.java:50)
>>> [junit4] 1> at org.apache.lucene.util.TestRuleFieldCacheSanity$1.evaluate(TestRuleFieldCacheSanity.java:51)
>>> [junit4] 1> at org.apache.lucene.util.AbstractBeforeAfterRule$1.evaluate(AbstractBeforeAfterRule.java:46)
>>> [junit4] 1> at com.carrotsearch.randomizedtesting.rules.SystemPropertiesInvariantRule$1.evaluate(SystemPropertiesInvariantRule.java:55)
>>> [junit4] 1> at org.apache.lucene.util.TestRuleThreadAndTestName$1.evaluate(TestRuleThreadAndTestName.java:49)
>>> [junit4] 1> at org.apache.lucene.util.TestRuleIgnoreAfterMaxFailures$1.evaluate(TestRuleIgnoreAfterMaxFailures.java:70)
>>> [junit4] 1> at org.apache.lucene.util.TestRuleMarkFailure$1.evaluate(TestRuleMarkFailure.java:48)
>>> [junit4] 1> at com.carrotsearch.randomizedtesting.rules.StatementAdapter.evaluate(StatementAdapter.java:36)
>>> [junit4] 1> at com.carrotsearch.randomizedtesting.ThreadLeakControl$StatementRunner.run(ThreadLeakControl.java:358)
>>> [junit4] 1> at com.carrotsearch.randomizedtesting.ThreadLeakControl.forkTimeoutingTask(ThreadLeakControl.java:782)
>>> [junit4] 1> at com.carrotsearch.randomizedtesting.ThreadLeakControl$3.evaluate(ThreadLeakControl.java:442)
>>> [junit4] 1> at com.carrotsearch.randomizedtesting.RandomizedRunner.runSingleTest(RandomizedRunner.java:746)
>>> [junit4] 1> at com.carrotsearch.randomizedtesting.RandomizedRunner$3.evaluate(RandomizedRunner.java:648)
>>> [junit4] 1> at com.carrotsearch.randomizedtesting.RandomizedRunner$4.evaluate(RandomizedRunner.java:682)
>>> [junit4] 1> at com.carrotsearch.randomizedtesting.RandomizedRunner$5.evaluate(RandomizedRunner.java:693)
>>> [junit4] 1> at org.apache.lucene.util.AbstractBeforeAfterRule$1.evaluate(AbstractBeforeAfterRule.java:46)
>>> [junit4] 1> at org.apache.lucene.util.TestRuleStoreClassName$1.evaluate(TestRuleStoreClassName.java:42)
>>> [junit4] 1> at com.carrotsearch.randomizedtesting.rules.SystemPropertiesInvariantRule$1.evaluate(SystemPropertiesInvariantRule.java:55)
>>> [junit4] 1> at com.carrotsearch.randomizedtesting.rules.NoShadowingOrOverridesOnMethodsRule$1.evaluate(NoShadowingOrOverridesOnMethodsRule.java:39)
>>> [junit4] 1> at com.carrotsearch.randomizedtesting.rules.NoShadowingOrOverridesOnMethodsRule$1.evaluate(NoShadowingOrOverridesOnMethodsRule.java:39)
>>> [junit4] 1> at com.carrotsearch.randomizedtesting.rules.StatementAdapter.evaluate(StatementAdapter.java:36)
>>> [junit4] 1> at org.apache.lucene.util.TestRuleAssertionsRequired$1.evaluate(TestRuleAssertionsRequired.java:43)
>>> [junit4] 1> at org.apache.lucene.util.TestRuleMarkFailure$1.evaluate(TestRuleMarkFailure.java:48)
>>> [junit4] 1> at org.apache.lucene.util.TestRuleIgnoreAfterMaxFailures$1.evaluate(TestRuleIgnoreAfterMaxFailures.java:70)
>>> [junit4] 1> at org.apache.lucene.util.TestRuleIgnoreTestSuites$1.evaluate(TestRuleIgnoreTestSuites.java:55)
>>> [junit4] 1> at com.carrotsearch.randomizedtesting.rules.StatementAdapter.evaluate(StatementAdapter.java:36)
>>> [junit4] 1> at com.carrotsearch.randomizedtesting.ThreadLeakControl$StatementRunner.run(ThreadLeakControl.java:358)
>>> [junit4] 1> at java.lang.Thread.run(Thread.java:724)
>>> [junit4] 1>
>>> [junit4] 1> 2 of 2: name=_1 docCount=102
>>> [junit4] 1> codec=FastDecompressionCompressingStoredFields(storedFieldsFormat=CompressingStoredFieldsFormat(compressionMode=FAST_DECOMPRESSION, chunkSize=16384), termVectorsFormat=CompressingTermVectorsFormat(compressionMode=FAST_DECOMPRESSION, chunkSize=16384))
>>> [junit4] 1> compound=true
>>> [junit4] 1> numFiles=3
>>> [junit4] 1> size (MB)=0.034
>>> [junit4] 1> diagnostics = {timestamp=1378977956167, os=Linux, os.version=3.2.0-53-generic, source=flush, lucene.version=5.0-SNAPSHOT, os.arch=amd64, java.version=1.7.0_40, java.vendor=Oracle Corporation}
>>> [junit4] 1> no deletions
>>> [junit4] 1> test: open reader.........OK
>>> [junit4] 1> test: fields..............OK [3 fields]
>>> [junit4] 1> test: field norms.........OK [3 fields]
>>> [junit4] 1> test: terms, freq, prox...OK [1297 terms; 1894 terms/docs pairs; 1912 tokens]
>>> [junit4] 1> test: stored fields.......OK [306 total field count; avg 3 fields per doc]
>>> [junit4] 1> test: term vectors........OK [306 total vector count; avg 3 term/freq vector fields per doc]
>>> [junit4] 1> test: docvalues...........OK [0 docvalues fields; 0 BINARY; 0 NUMERIC; 0 SORTED; 0 SORTED_SET]
>>> [junit4] 1>
>>> [junit4] 1> WARNING: 1 broken segments (containing 898 documents) detected
>>> [junit4] 1>
>>> [junit4] 2> NOTE: reproduce with: ant test -Dtestcase=KNearestNeighborClassifierTest -Dtests.method=testPerformance -Dtests.seed=68F81CB00E47182B -Dtests.multiplier=3 -Dtests.slow=true -Dtests.locale=es_BO -Dtests.timezone=NST -Dtests.file.encoding=UTF-8
>>> [junit4] ERROR 2.72s J0 | KNearestNeighborClassifierTest.testPerformance <<<
>>> [junit4] > Throwable #1: java.lang.RuntimeException: CheckIndex failed
>>> [junit4] > at __randomizedtesting.SeedInfo.seed([68F81CB00E47182B:AF19EE9265F32084]:0)
>>> [junit4] > at org.apache.lucene.util._TestUtil.checkIndex(_TestUtil.java:227)
>>> [junit4] > at org.apache.lucene.store.MockDirectoryWrapper.close(MockDirectoryWrapper.java:659)
>>> [junit4] > at org.apache.lucene.classification.ClassificationTestBase.tearDown(ClassificationTestBase.java:70)
>>> [junit4] > at java.lang.Thread.run(Thread.java:724)
>>> [junit4] 2> NOTE: test params are: codec=FastDecompressionCompressingStoredFields(storedFieldsFormat=CompressingStoredFieldsFormat(compressionMode=FAST_DECOMPRESSION, chunkSize=168), termVectorsFormat=CompressingTermVectorsFormat(compressionMode=FAST_DECOMPRESSION, chunkSize=168)), sim=RandomSimilarityProvider(queryNorm=true,coord=yes): {text=DFR GB1, cat=DFR I(n)B1, bool=DFR G2}, locale=es_BO, timezone=NST
>>> [junit4] 2> NOTE: Linux 3.2.0-53-generic amd64/Oracle Corporation 1.7.0_40 (64-bit)/cpus=8,threads=1,free=59466608,total=131072000
>>> [junit4] 2> NOTE: All tests run in this JVM: [DataSplitterTest, KNearestNeighborClassifierTest]
>>> [junit4] Completed on J0 in 2.91s, 2 tests, 1 error <<< FAILURES!
>>>
>>> [...truncated 13 lines...]
>>> BUILD FAILED
>>> /mnt/ssd/jenkins/workspace/Lucene-Solr-trunk-Linux/build.xml:396: The following error occurred while executing this line:
>>> /mnt/ssd/jenkins/workspace/Lucene-Solr-trunk-Linux/build.xml:376: The following error occurred while executing this line:
>>> /mnt/ssd/jenkins/workspace/Lucene-Solr-trunk-Linux/build.xml:39: The following error occurred while executing this line:
>>> /mnt/ssd/jenkins/workspace/Lucene-Solr-trunk-Linux/lucene/build.xml:556: The following error occurred while executing this line:
>>> /mnt/ssd/jenkins/workspace/Lucene-Solr-trunk-Linux/lucene/common-build.xml:1885: The following error occurred while executing this line:
>>> /mnt/ssd/jenkins/workspace/Lucene-Solr-trunk-Linux/lucene/module-build.xml:61: The following error occurred while executing this line:
>>> /mnt/ssd/jenkins/workspace/Lucene-Solr-trunk-Linux/lucene/common-build.xml:1230: The following error occurred while executing this line:
>>> /mnt/ssd/jenkins/workspace/Lucene-Solr-trunk-Linux/lucene/common-build.xml:873: There were test failures: 4 suites, 10 tests, 1 error
>>>
>>> Total time: 12 minutes 29 seconds
>>> Build step 'Invoke Ant' marked build as failure
>>> Description set: Java: 64bit/jdk1.7.0_40 -XX:-UseCompressedOops -XX:+UseG1GC
>>> Archiving artifacts
>>> Recording test results
>>> Email was triggered for: Failure
>>> Sending email for trigger: Failure
>>>
>>>
>>>
>>>
>>> ---------------------------------------------------------------------
>>> To unsubscribe, e-mail: dev-unsubscribe@lucene.apache.org
>>> For additional commands, e-mail: dev-help@lucene.apache.org
>>
>> ---------------------------------------------------------------------
>> To unsubscribe, e-mail: dev-unsubscribe@lucene.apache.org
>> For additional commands, e-mail: dev-help@lucene.apache.org
>>
>
> ---------------------------------------------------------------------
> To unsubscribe, e-mail: dev-unsubscribe@lucene.apache.org
> For additional commands, e-mail: dev-help@lucene.apache.org
>
---------------------------------------------------------------------
To unsubscribe, e-mail: dev-unsubscribe@lucene.apache.org
For additional commands, e-mail: dev-help@lucene.apache.org
Re: [JENKINS] Lucene-Solr-trunk-Linux (64bit/jdk1.7.0_40) - Build #
7427 - Still Failing!
Posted by Robert Muir <rc...@gmail.com>.
Maybe it will reproduce with the master seed.
On Fri, Sep 13, 2013 at 7:14 AM, Michael McCandless
<lu...@mikemccandless.com> wrote:
> This doesn't repro on current trunk ...
>
> Mike McCandless
>
> http://blog.mikemccandless.com
>
>
> On Thu, Sep 12, 2013 at 5:26 AM, Policeman Jenkins Server
> <je...@thetaphi.de> wrote:
>> Build: http://jenkins.thetaphi.de/job/Lucene-Solr-trunk-Linux/7427/
>> Java: 64bit/jdk1.7.0_40 -XX:-UseCompressedOops -XX:+UseG1GC
>>
>> 1 tests failed.
>> REGRESSION: org.apache.lucene.classification.KNearestNeighborClassifierTest.testPerformance
>>
>> Error Message:
>> CheckIndex failed
>>
>> Stack Trace:
>> java.lang.RuntimeException: CheckIndex failed
>> at __randomizedtesting.SeedInfo.seed([68F81CB00E47182B:AF19EE9265F32084]:0)
>> at org.apache.lucene.util._TestUtil.checkIndex(_TestUtil.java:227)
>> at org.apache.lucene.store.MockDirectoryWrapper.close(MockDirectoryWrapper.java:659)
>> at org.apache.lucene.classification.ClassificationTestBase.tearDown(ClassificationTestBase.java:70)
>> at sun.reflect.NativeMethodAccessorImpl.invoke0(Native Method)
>> at sun.reflect.NativeMethodAccessorImpl.invoke(NativeMethodAccessorImpl.java:57)
>> at sun.reflect.DelegatingMethodAccessorImpl.invoke(DelegatingMethodAccessorImpl.java:43)
>> at java.lang.reflect.Method.invoke(Method.java:606)
>> at com.carrotsearch.randomizedtesting.RandomizedRunner.invoke(RandomizedRunner.java:1559)
>> at com.carrotsearch.randomizedtesting.RandomizedRunner.access$600(RandomizedRunner.java:79)
>> at com.carrotsearch.randomizedtesting.RandomizedRunner$8.evaluate(RandomizedRunner.java:795)
>> at org.apache.lucene.util.TestRuleSetupTeardownChained$1.evaluate(TestRuleSetupTeardownChained.java:50)
>> at org.apache.lucene.util.TestRuleFieldCacheSanity$1.evaluate(TestRuleFieldCacheSanity.java:51)
>> at org.apache.lucene.util.AbstractBeforeAfterRule$1.evaluate(AbstractBeforeAfterRule.java:46)
>> at com.carrotsearch.randomizedtesting.rules.SystemPropertiesInvariantRule$1.evaluate(SystemPropertiesInvariantRule.java:55)
>> at org.apache.lucene.util.TestRuleThreadAndTestName$1.evaluate(TestRuleThreadAndTestName.java:49)
>> at org.apache.lucene.util.TestRuleIgnoreAfterMaxFailures$1.evaluate(TestRuleIgnoreAfterMaxFailures.java:70)
>> at org.apache.lucene.util.TestRuleMarkFailure$1.evaluate(TestRuleMarkFailure.java:48)
>> at com.carrotsearch.randomizedtesting.rules.StatementAdapter.evaluate(StatementAdapter.java:36)
>> at com.carrotsearch.randomizedtesting.ThreadLeakControl$StatementRunner.run(ThreadLeakControl.java:358)
>> at com.carrotsearch.randomizedtesting.ThreadLeakControl.forkTimeoutingTask(ThreadLeakControl.java:782)
>> at com.carrotsearch.randomizedtesting.ThreadLeakControl$3.evaluate(ThreadLeakControl.java:442)
>> at com.carrotsearch.randomizedtesting.RandomizedRunner.runSingleTest(RandomizedRunner.java:746)
>> at com.carrotsearch.randomizedtesting.RandomizedRunner$3.evaluate(RandomizedRunner.java:648)
>> at com.carrotsearch.randomizedtesting.RandomizedRunner$4.evaluate(RandomizedRunner.java:682)
>> at com.carrotsearch.randomizedtesting.RandomizedRunner$5.evaluate(RandomizedRunner.java:693)
>> at org.apache.lucene.util.AbstractBeforeAfterRule$1.evaluate(AbstractBeforeAfterRule.java:46)
>> at org.apache.lucene.util.TestRuleStoreClassName$1.evaluate(TestRuleStoreClassName.java:42)
>> at com.carrotsearch.randomizedtesting.rules.SystemPropertiesInvariantRule$1.evaluate(SystemPropertiesInvariantRule.java:55)
>> at com.carrotsearch.randomizedtesting.rules.NoShadowingOrOverridesOnMethodsRule$1.evaluate(NoShadowingOrOverridesOnMethodsRule.java:39)
>> at com.carrotsearch.randomizedtesting.rules.NoShadowingOrOverridesOnMethodsRule$1.evaluate(NoShadowingOrOverridesOnMethodsRule.java:39)
>> at com.carrotsearch.randomizedtesting.rules.StatementAdapter.evaluate(StatementAdapter.java:36)
>> at org.apache.lucene.util.TestRuleAssertionsRequired$1.evaluate(TestRuleAssertionsRequired.java:43)
>> at org.apache.lucene.util.TestRuleMarkFailure$1.evaluate(TestRuleMarkFailure.java:48)
>> at org.apache.lucene.util.TestRuleIgnoreAfterMaxFailures$1.evaluate(TestRuleIgnoreAfterMaxFailures.java:70)
>> at org.apache.lucene.util.TestRuleIgnoreTestSuites$1.evaluate(TestRuleIgnoreTestSuites.java:55)
>> at com.carrotsearch.randomizedtesting.rules.StatementAdapter.evaluate(StatementAdapter.java:36)
>> at com.carrotsearch.randomizedtesting.ThreadLeakControl$StatementRunner.run(ThreadLeakControl.java:358)
>> at java.lang.Thread.run(Thread.java:724)
>>
>>
>>
>>
>> Build Log:
>> [...truncated 6618 lines...]
>> [junit4] Suite: org.apache.lucene.classification.KNearestNeighborClassifierTest
>> [junit4] 1> CheckIndex failed
>> [junit4] 1> Segments file=segments_3 numSegments=2 version=5.0 format=
>> [junit4] 1> 1 of 2: name=_0 docCount=898
>> [junit4] 1> codec=FastDecompressionCompressingStoredFields(storedFieldsFormat=CompressingStoredFieldsFormat(compressionMode=FAST_DECOMPRESSION, chunkSize=16384), termVectorsFormat=CompressingTermVectorsFormat(compressionMode=FAST_DECOMPRESSION, chunkSize=16384))
>> [junit4] 1> compound=true
>> [junit4] 1> numFiles=3
>> [junit4] 1> size (MB)=0.283
>> [junit4] 1> diagnostics = {timestamp=1378977956101, os=Linux, os.version=3.2.0-53-generic, source=flush, lucene.version=5.0-SNAPSHOT, os.arch=amd64, java.version=1.7.0_40, java.vendor=Oracle Corporation}
>> [junit4] 1> no deletions
>> [junit4] 1> test: open reader.........OK
>> [junit4] 1> test: fields..............OK [3 fields]
>> [junit4] 1> test: field norms.........OK [3 fields]
>> [junit4] 1> test: terms, freq, prox...OK [9449 terms; 16456 terms/docs pairs; 16648 tokens]
>> [junit4] 1> test: stored fields.......OK [2694 total field count; avg 3 fields per doc]
>> [junit4] 1> test: term vectors........ERROR [2]
>> [junit4] 1> java.lang.ArrayIndexOutOfBoundsException: 2
>> [junit4] 1> at org.apache.lucene.codecs.compressing.CompressingTermVectorsReader.get(CompressingTermVectorsReader.java:393)
>> [junit4] 1> at org.apache.lucene.index.SegmentReader.getTermVectors(SegmentReader.java:169)
>> [junit4] 1> at org.apache.lucene.index.CheckIndex.testTermVectors(CheckIndex.java:1524)
>> [junit4] 1> at org.apache.lucene.index.CheckIndex.checkIndex(CheckIndex.java:611)
>> [junit4] 1> at org.apache.lucene.util._TestUtil.checkIndex(_TestUtil.java:223)
>> [junit4] 1> at org.apache.lucene.store.MockDirectoryWrapper.close(MockDirectoryWrapper.java:659)
>> [junit4] 1> at org.apache.lucene.classification.ClassificationTestBase.tearDown(ClassificationTestBase.java:70)
>> [junit4] 1> at sun.reflect.NativeMethodAccessorImpl.invoke0(Native Method)
>> [junit4] 1> at sun.reflect.NativeMethodAccessorImpl.invoke(NativeMethodAccessorImpl.java:57)
>> [junit4] 1> at sun.reflect.DelegatingMethodAccessorImpl.invoke(DelegatingMethodAccessorImpl.java:43)
>> [junit4] 1> at java.lang.reflect.Method.invoke(Method.java:606)
>> [junit4] 1> at com.carrotsearch.randomizedtesting.RandomizedRunner.invoke(RandomizedRunner.java:1559)
>> [junit4] 1> at com.carrotsearch.randomizedtesting.RandomizedRunner.access$600(RandomizedRunner.java:79)
>> [junit4] 1> at com.carrotsearch.randomizedtesting.RandomizedRunner$8.evaluate(RandomizedRunner.java:795)
>> [junit4] 1> at org.apache.lucene.util.TestRuleSetupTeardownChained$1.evaluate(TestRuleSetupTeardownChained.java:50)
>> [junit4] 1> at org.apache.lucene.util.TestRuleFieldCacheSanity$1.evaluate(TestRuleFieldCacheSanity.java:51)
>> [junit4] 1> at org.apache.lucene.util.AbstractBeforeAfterRule$1.evaluate(AbstractBeforeAfterRule.java:46)
>> [junit4] 1> at com.carrotsearch.randomizedtesting.rules.SystemPropertiesInvariantRule$1.evaluate(SystemPropertiesInvariantRule.java:55)
>> [junit4] 1> at org.apache.lucene.util.TestRuleThreadAndTestName$1.evaluate(TestRuleThreadAndTestName.java:49)
>> [junit4] 1> at org.apache.lucene.util.TestRuleIgnoreAfterMaxFailures$1.evaluate(TestRuleIgnoreAfterMaxFailures.java:70)
>> [junit4] 1> at org.apache.lucene.util.TestRuleMarkFailure$1.evaluate(TestRuleMarkFailure.java:48)
>> [junit4] 1> at com.carrotsearch.randomizedtesting.rules.StatementAdapter.evaluate(StatementAdapter.java:36)
>> [junit4] 1> at com.carrotsearch.randomizedtesting.ThreadLeakControl$StatementRunner.run(ThreadLeakControl.java:358)
>> [junit4] 1> at com.carrotsearch.randomizedtesting.ThreadLeakControl.forkTimeoutingTask(ThreadLeakControl.java:782)
>> [junit4] 1> at com.carrotsearch.randomizedtesting.ThreadLeakControl$3.evaluate(ThreadLeakControl.java:442)
>> [junit4] 1> at com.carrotsearch.randomizedtesting.RandomizedRunner.runSingleTest(RandomizedRunner.java:746)
>> [junit4] 1> at com.carrotsearch.randomizedtesting.RandomizedRunner$3.evaluate(RandomizedRunner.java:648)
>> [junit4] 1> at com.carrotsearch.randomizedtesting.RandomizedRunner$4.evaluate(RandomizedRunner.java:682)
>> [junit4] 1> at com.carrotsearch.randomizedtesting.RandomizedRunner$5.evaluate(RandomizedRunner.java:693)
>> [junit4] 1> at org.apache.lucene.util.AbstractBeforeAfterRule$1.evaluate(AbstractBeforeAfterRule.java:46)
>> [junit4] 1> at org.apache.lucene.util.TestRuleStoreClassName$1.evaluate(TestRuleStoreClassName.java:42)
>> [junit4] 1> at com.carrotsearch.randomizedtesting.rules.SystemPropertiesInvariantRule$1.evaluate(SystemPropertiesInvariantRule.java:55)
>> [junit4] 1> at com.carrotsearch.randomizedtesting.rules.NoShadowingOrOverridesOnMethodsRule$1.evaluate(NoShadowingOrOverridesOnMethodsRule.java:39)
>> [junit4] 1> at com.carrotsearch.randomizedtesting.rules.NoShadowingOrOverridesOnMethodsRule$1.evaluate(NoShadowingOrOverridesOnMethodsRule.java:39)
>> [junit4] 1> at com.carrotsearch.randomizedtesting.rules.StatementAdapter.evaluate(StatementAdapter.java:36)
>> [junit4] 1> at org.apache.lucene.util.TestRuleAssertionsRequired$1.evaluate(TestRuleAssertionsRequired.java:43)
>> [junit4] 1> at org.apache.lucene.util.TestRuleMarkFailure$1.evaluate(TestRuleMarkFailure.java:48)
>> [junit4] 1> at org.apache.lucene.util.TestRuleIgnoreAfterMaxFailures$1.evaluate(TestRuleIgnoreAfterMaxFailures.java:70)
>> [junit4] 1> at org.apache.lucene.util.TestRuleIgnoreTestSuites$1.evaluate(TestRuleIgnoreTestSuites.java:55)
>> [junit4] 1> at com.carrotsearch.randomizedtesting.rules.StatementAdapter.evaluate(StatementAdapter.java:36)
>> [junit4] 1> at com.carrotsearch.randomizedtesting.ThreadLeakControl$StatementRunner.run(ThreadLeakControl.java:358)
>> [junit4] 1> at java.lang.Thread.run(Thread.java:724)
>> [junit4] 1> test: docvalues...........OK [0 docvalues fields; 0 BINARY; 0 NUMERIC; 0 SORTED; 0 SORTED_SET]
>> [junit4] 1> FAILED
>> [junit4] 1> WARNING: fixIndex() would remove reference to this segment; full exception:
>> [junit4] 1> java.lang.RuntimeException: Term Vector test failed
>> [junit4] 1> at org.apache.lucene.index.CheckIndex.checkIndex(CheckIndex.java:624)
>> [junit4] 1> at org.apache.lucene.util._TestUtil.checkIndex(_TestUtil.java:223)
>> [junit4] 1> at org.apache.lucene.store.MockDirectoryWrapper.close(MockDirectoryWrapper.java:659)
>> [junit4] 1> at org.apache.lucene.classification.ClassificationTestBase.tearDown(ClassificationTestBase.java:70)
>> [junit4] 1> at sun.reflect.NativeMethodAccessorImpl.invoke0(Native Method)
>> [junit4] 1> at sun.reflect.NativeMethodAccessorImpl.invoke(NativeMethodAccessorImpl.java:57)
>> [junit4] 1> at sun.reflect.DelegatingMethodAccessorImpl.invoke(DelegatingMethodAccessorImpl.java:43)
>> [junit4] 1> at java.lang.reflect.Method.invoke(Method.java:606)
>> [junit4] 1> at com.carrotsearch.randomizedtesting.RandomizedRunner.invoke(RandomizedRunner.java:1559)
>> [junit4] 1> at com.carrotsearch.randomizedtesting.RandomizedRunner.access$600(RandomizedRunner.java:79)
>> [junit4] 1> at com.carrotsearch.randomizedtesting.RandomizedRunner$8.evaluate(RandomizedRunner.java:795)
>> [junit4] 1> at org.apache.lucene.util.TestRuleSetupTeardownChained$1.evaluate(TestRuleSetupTeardownChained.java:50)
>> [junit4] 1> at org.apache.lucene.util.TestRuleFieldCacheSanity$1.evaluate(TestRuleFieldCacheSanity.java:51)
>> [junit4] 1> at org.apache.lucene.util.AbstractBeforeAfterRule$1.evaluate(AbstractBeforeAfterRule.java:46)
>> [junit4] 1> at com.carrotsearch.randomizedtesting.rules.SystemPropertiesInvariantRule$1.evaluate(SystemPropertiesInvariantRule.java:55)
>> [junit4] 1> at org.apache.lucene.util.TestRuleThreadAndTestName$1.evaluate(TestRuleThreadAndTestName.java:49)
>> [junit4] 1> at org.apache.lucene.util.TestRuleIgnoreAfterMaxFailures$1.evaluate(TestRuleIgnoreAfterMaxFailures.java:70)
>> [junit4] 1> at org.apache.lucene.util.TestRuleMarkFailure$1.evaluate(TestRuleMarkFailure.java:48)
>> [junit4] 1> at com.carrotsearch.randomizedtesting.rules.StatementAdapter.evaluate(StatementAdapter.java:36)
>> [junit4] 1> at com.carrotsearch.randomizedtesting.ThreadLeakControl$StatementRunner.run(ThreadLeakControl.java:358)
>> [junit4] 1> at com.carrotsearch.randomizedtesting.ThreadLeakControl.forkTimeoutingTask(ThreadLeakControl.java:782)
>> [junit4] 1> at com.carrotsearch.randomizedtesting.ThreadLeakControl$3.evaluate(ThreadLeakControl.java:442)
>> [junit4] 1> at com.carrotsearch.randomizedtesting.RandomizedRunner.runSingleTest(RandomizedRunner.java:746)
>> [junit4] 1> at com.carrotsearch.randomizedtesting.RandomizedRunner$3.evaluate(RandomizedRunner.java:648)
>> [junit4] 1> at com.carrotsearch.randomizedtesting.RandomizedRunner$4.evaluate(RandomizedRunner.java:682)
>> [junit4] 1> at com.carrotsearch.randomizedtesting.RandomizedRunner$5.evaluate(RandomizedRunner.java:693)
>> [junit4] 1> at org.apache.lucene.util.AbstractBeforeAfterRule$1.evaluate(AbstractBeforeAfterRule.java:46)
>> [junit4] 1> at org.apache.lucene.util.TestRuleStoreClassName$1.evaluate(TestRuleStoreClassName.java:42)
>> [junit4] 1> at com.carrotsearch.randomizedtesting.rules.SystemPropertiesInvariantRule$1.evaluate(SystemPropertiesInvariantRule.java:55)
>> [junit4] 1> at com.carrotsearch.randomizedtesting.rules.NoShadowingOrOverridesOnMethodsRule$1.evaluate(NoShadowingOrOverridesOnMethodsRule.java:39)
>> [junit4] 1> at com.carrotsearch.randomizedtesting.rules.NoShadowingOrOverridesOnMethodsRule$1.evaluate(NoShadowingOrOverridesOnMethodsRule.java:39)
>> [junit4] 1> at com.carrotsearch.randomizedtesting.rules.StatementAdapter.evaluate(StatementAdapter.java:36)
>> [junit4] 1> at org.apache.lucene.util.TestRuleAssertionsRequired$1.evaluate(TestRuleAssertionsRequired.java:43)
>> [junit4] 1> at org.apache.lucene.util.TestRuleMarkFailure$1.evaluate(TestRuleMarkFailure.java:48)
>> [junit4] 1> at org.apache.lucene.util.TestRuleIgnoreAfterMaxFailures$1.evaluate(TestRuleIgnoreAfterMaxFailures.java:70)
>> [junit4] 1> at org.apache.lucene.util.TestRuleIgnoreTestSuites$1.evaluate(TestRuleIgnoreTestSuites.java:55)
>> [junit4] 1> at com.carrotsearch.randomizedtesting.rules.StatementAdapter.evaluate(StatementAdapter.java:36)
>> [junit4] 1> at com.carrotsearch.randomizedtesting.ThreadLeakControl$StatementRunner.run(ThreadLeakControl.java:358)
>> [junit4] 1> at java.lang.Thread.run(Thread.java:724)
>> [junit4] 1>
>> [junit4] 1> 2 of 2: name=_1 docCount=102
>> [junit4] 1> codec=FastDecompressionCompressingStoredFields(storedFieldsFormat=CompressingStoredFieldsFormat(compressionMode=FAST_DECOMPRESSION, chunkSize=16384), termVectorsFormat=CompressingTermVectorsFormat(compressionMode=FAST_DECOMPRESSION, chunkSize=16384))
>> [junit4] 1> compound=true
>> [junit4] 1> numFiles=3
>> [junit4] 1> size (MB)=0.034
>> [junit4] 1> diagnostics = {timestamp=1378977956167, os=Linux, os.version=3.2.0-53-generic, source=flush, lucene.version=5.0-SNAPSHOT, os.arch=amd64, java.version=1.7.0_40, java.vendor=Oracle Corporation}
>> [junit4] 1> no deletions
>> [junit4] 1> test: open reader.........OK
>> [junit4] 1> test: fields..............OK [3 fields]
>> [junit4] 1> test: field norms.........OK [3 fields]
>> [junit4] 1> test: terms, freq, prox...OK [1297 terms; 1894 terms/docs pairs; 1912 tokens]
>> [junit4] 1> test: stored fields.......OK [306 total field count; avg 3 fields per doc]
>> [junit4] 1> test: term vectors........OK [306 total vector count; avg 3 term/freq vector fields per doc]
>> [junit4] 1> test: docvalues...........OK [0 docvalues fields; 0 BINARY; 0 NUMERIC; 0 SORTED; 0 SORTED_SET]
>> [junit4] 1>
>> [junit4] 1> WARNING: 1 broken segments (containing 898 documents) detected
>> [junit4] 1>
>> [junit4] 2> NOTE: reproduce with: ant test -Dtestcase=KNearestNeighborClassifierTest -Dtests.method=testPerformance -Dtests.seed=68F81CB00E47182B -Dtests.multiplier=3 -Dtests.slow=true -Dtests.locale=es_BO -Dtests.timezone=NST -Dtests.file.encoding=UTF-8
>> [junit4] ERROR 2.72s J0 | KNearestNeighborClassifierTest.testPerformance <<<
>> [junit4] > Throwable #1: java.lang.RuntimeException: CheckIndex failed
>> [junit4] > at __randomizedtesting.SeedInfo.seed([68F81CB00E47182B:AF19EE9265F32084]:0)
>> [junit4] > at org.apache.lucene.util._TestUtil.checkIndex(_TestUtil.java:227)
>> [junit4] > at org.apache.lucene.store.MockDirectoryWrapper.close(MockDirectoryWrapper.java:659)
>> [junit4] > at org.apache.lucene.classification.ClassificationTestBase.tearDown(ClassificationTestBase.java:70)
>> [junit4] > at java.lang.Thread.run(Thread.java:724)
>> [junit4] 2> NOTE: test params are: codec=FastDecompressionCompressingStoredFields(storedFieldsFormat=CompressingStoredFieldsFormat(compressionMode=FAST_DECOMPRESSION, chunkSize=168), termVectorsFormat=CompressingTermVectorsFormat(compressionMode=FAST_DECOMPRESSION, chunkSize=168)), sim=RandomSimilarityProvider(queryNorm=true,coord=yes): {text=DFR GB1, cat=DFR I(n)B1, bool=DFR G2}, locale=es_BO, timezone=NST
>> [junit4] 2> NOTE: Linux 3.2.0-53-generic amd64/Oracle Corporation 1.7.0_40 (64-bit)/cpus=8,threads=1,free=59466608,total=131072000
>> [junit4] 2> NOTE: All tests run in this JVM: [DataSplitterTest, KNearestNeighborClassifierTest]
>> [junit4] Completed on J0 in 2.91s, 2 tests, 1 error <<< FAILURES!
>>
>> [...truncated 13 lines...]
>> BUILD FAILED
>> /mnt/ssd/jenkins/workspace/Lucene-Solr-trunk-Linux/build.xml:396: The following error occurred while executing this line:
>> /mnt/ssd/jenkins/workspace/Lucene-Solr-trunk-Linux/build.xml:376: The following error occurred while executing this line:
>> /mnt/ssd/jenkins/workspace/Lucene-Solr-trunk-Linux/build.xml:39: The following error occurred while executing this line:
>> /mnt/ssd/jenkins/workspace/Lucene-Solr-trunk-Linux/lucene/build.xml:556: The following error occurred while executing this line:
>> /mnt/ssd/jenkins/workspace/Lucene-Solr-trunk-Linux/lucene/common-build.xml:1885: The following error occurred while executing this line:
>> /mnt/ssd/jenkins/workspace/Lucene-Solr-trunk-Linux/lucene/module-build.xml:61: The following error occurred while executing this line:
>> /mnt/ssd/jenkins/workspace/Lucene-Solr-trunk-Linux/lucene/common-build.xml:1230: The following error occurred while executing this line:
>> /mnt/ssd/jenkins/workspace/Lucene-Solr-trunk-Linux/lucene/common-build.xml:873: There were test failures: 4 suites, 10 tests, 1 error
>>
>> Total time: 12 minutes 29 seconds
>> Build step 'Invoke Ant' marked build as failure
>> Description set: Java: 64bit/jdk1.7.0_40 -XX:-UseCompressedOops -XX:+UseG1GC
>> Archiving artifacts
>> Recording test results
>> Email was triggered for: Failure
>> Sending email for trigger: Failure
>>
>>
>>
>>
>> ---------------------------------------------------------------------
>> To unsubscribe, e-mail: dev-unsubscribe@lucene.apache.org
>> For additional commands, e-mail: dev-help@lucene.apache.org
>
> ---------------------------------------------------------------------
> To unsubscribe, e-mail: dev-unsubscribe@lucene.apache.org
> For additional commands, e-mail: dev-help@lucene.apache.org
>
---------------------------------------------------------------------
To unsubscribe, e-mail: dev-unsubscribe@lucene.apache.org
For additional commands, e-mail: dev-help@lucene.apache.org
Re: [JENKINS] Lucene-Solr-trunk-Linux (64bit/jdk1.7.0_40) - Build #
7427 - Still Failing!
Posted by Michael McCandless <lu...@mikemccandless.com>.
This doesn't repro on current trunk ...
Mike McCandless
http://blog.mikemccandless.com
On Thu, Sep 12, 2013 at 5:26 AM, Policeman Jenkins Server
<je...@thetaphi.de> wrote:
> Build: http://jenkins.thetaphi.de/job/Lucene-Solr-trunk-Linux/7427/
> Java: 64bit/jdk1.7.0_40 -XX:-UseCompressedOops -XX:+UseG1GC
>
> 1 tests failed.
> REGRESSION: org.apache.lucene.classification.KNearestNeighborClassifierTest.testPerformance
>
> Error Message:
> CheckIndex failed
>
> Stack Trace:
> java.lang.RuntimeException: CheckIndex failed
> at __randomizedtesting.SeedInfo.seed([68F81CB00E47182B:AF19EE9265F32084]:0)
> at org.apache.lucene.util._TestUtil.checkIndex(_TestUtil.java:227)
> at org.apache.lucene.store.MockDirectoryWrapper.close(MockDirectoryWrapper.java:659)
> at org.apache.lucene.classification.ClassificationTestBase.tearDown(ClassificationTestBase.java:70)
> at sun.reflect.NativeMethodAccessorImpl.invoke0(Native Method)
> at sun.reflect.NativeMethodAccessorImpl.invoke(NativeMethodAccessorImpl.java:57)
> at sun.reflect.DelegatingMethodAccessorImpl.invoke(DelegatingMethodAccessorImpl.java:43)
> at java.lang.reflect.Method.invoke(Method.java:606)
> at com.carrotsearch.randomizedtesting.RandomizedRunner.invoke(RandomizedRunner.java:1559)
> at com.carrotsearch.randomizedtesting.RandomizedRunner.access$600(RandomizedRunner.java:79)
> at com.carrotsearch.randomizedtesting.RandomizedRunner$8.evaluate(RandomizedRunner.java:795)
> at org.apache.lucene.util.TestRuleSetupTeardownChained$1.evaluate(TestRuleSetupTeardownChained.java:50)
> at org.apache.lucene.util.TestRuleFieldCacheSanity$1.evaluate(TestRuleFieldCacheSanity.java:51)
> at org.apache.lucene.util.AbstractBeforeAfterRule$1.evaluate(AbstractBeforeAfterRule.java:46)
> at com.carrotsearch.randomizedtesting.rules.SystemPropertiesInvariantRule$1.evaluate(SystemPropertiesInvariantRule.java:55)
> at org.apache.lucene.util.TestRuleThreadAndTestName$1.evaluate(TestRuleThreadAndTestName.java:49)
> at org.apache.lucene.util.TestRuleIgnoreAfterMaxFailures$1.evaluate(TestRuleIgnoreAfterMaxFailures.java:70)
> at org.apache.lucene.util.TestRuleMarkFailure$1.evaluate(TestRuleMarkFailure.java:48)
> at com.carrotsearch.randomizedtesting.rules.StatementAdapter.evaluate(StatementAdapter.java:36)
> at com.carrotsearch.randomizedtesting.ThreadLeakControl$StatementRunner.run(ThreadLeakControl.java:358)
> at com.carrotsearch.randomizedtesting.ThreadLeakControl.forkTimeoutingTask(ThreadLeakControl.java:782)
> at com.carrotsearch.randomizedtesting.ThreadLeakControl$3.evaluate(ThreadLeakControl.java:442)
> at com.carrotsearch.randomizedtesting.RandomizedRunner.runSingleTest(RandomizedRunner.java:746)
> at com.carrotsearch.randomizedtesting.RandomizedRunner$3.evaluate(RandomizedRunner.java:648)
> at com.carrotsearch.randomizedtesting.RandomizedRunner$4.evaluate(RandomizedRunner.java:682)
> at com.carrotsearch.randomizedtesting.RandomizedRunner$5.evaluate(RandomizedRunner.java:693)
> at org.apache.lucene.util.AbstractBeforeAfterRule$1.evaluate(AbstractBeforeAfterRule.java:46)
> at org.apache.lucene.util.TestRuleStoreClassName$1.evaluate(TestRuleStoreClassName.java:42)
> at com.carrotsearch.randomizedtesting.rules.SystemPropertiesInvariantRule$1.evaluate(SystemPropertiesInvariantRule.java:55)
> at com.carrotsearch.randomizedtesting.rules.NoShadowingOrOverridesOnMethodsRule$1.evaluate(NoShadowingOrOverridesOnMethodsRule.java:39)
> at com.carrotsearch.randomizedtesting.rules.NoShadowingOrOverridesOnMethodsRule$1.evaluate(NoShadowingOrOverridesOnMethodsRule.java:39)
> at com.carrotsearch.randomizedtesting.rules.StatementAdapter.evaluate(StatementAdapter.java:36)
> at org.apache.lucene.util.TestRuleAssertionsRequired$1.evaluate(TestRuleAssertionsRequired.java:43)
> at org.apache.lucene.util.TestRuleMarkFailure$1.evaluate(TestRuleMarkFailure.java:48)
> at org.apache.lucene.util.TestRuleIgnoreAfterMaxFailures$1.evaluate(TestRuleIgnoreAfterMaxFailures.java:70)
> at org.apache.lucene.util.TestRuleIgnoreTestSuites$1.evaluate(TestRuleIgnoreTestSuites.java:55)
> at com.carrotsearch.randomizedtesting.rules.StatementAdapter.evaluate(StatementAdapter.java:36)
> at com.carrotsearch.randomizedtesting.ThreadLeakControl$StatementRunner.run(ThreadLeakControl.java:358)
> at java.lang.Thread.run(Thread.java:724)
>
>
>
>
> Build Log:
> [...truncated 6618 lines...]
> [junit4] Suite: org.apache.lucene.classification.KNearestNeighborClassifierTest
> [junit4] 1> CheckIndex failed
> [junit4] 1> Segments file=segments_3 numSegments=2 version=5.0 format=
> [junit4] 1> 1 of 2: name=_0 docCount=898
> [junit4] 1> codec=FastDecompressionCompressingStoredFields(storedFieldsFormat=CompressingStoredFieldsFormat(compressionMode=FAST_DECOMPRESSION, chunkSize=16384), termVectorsFormat=CompressingTermVectorsFormat(compressionMode=FAST_DECOMPRESSION, chunkSize=16384))
> [junit4] 1> compound=true
> [junit4] 1> numFiles=3
> [junit4] 1> size (MB)=0.283
> [junit4] 1> diagnostics = {timestamp=1378977956101, os=Linux, os.version=3.2.0-53-generic, source=flush, lucene.version=5.0-SNAPSHOT, os.arch=amd64, java.version=1.7.0_40, java.vendor=Oracle Corporation}
> [junit4] 1> no deletions
> [junit4] 1> test: open reader.........OK
> [junit4] 1> test: fields..............OK [3 fields]
> [junit4] 1> test: field norms.........OK [3 fields]
> [junit4] 1> test: terms, freq, prox...OK [9449 terms; 16456 terms/docs pairs; 16648 tokens]
> [junit4] 1> test: stored fields.......OK [2694 total field count; avg 3 fields per doc]
> [junit4] 1> test: term vectors........ERROR [2]
> [junit4] 1> java.lang.ArrayIndexOutOfBoundsException: 2
> [junit4] 1> at org.apache.lucene.codecs.compressing.CompressingTermVectorsReader.get(CompressingTermVectorsReader.java:393)
> [junit4] 1> at org.apache.lucene.index.SegmentReader.getTermVectors(SegmentReader.java:169)
> [junit4] 1> at org.apache.lucene.index.CheckIndex.testTermVectors(CheckIndex.java:1524)
> [junit4] 1> at org.apache.lucene.index.CheckIndex.checkIndex(CheckIndex.java:611)
> [junit4] 1> at org.apache.lucene.util._TestUtil.checkIndex(_TestUtil.java:223)
> [junit4] 1> at org.apache.lucene.store.MockDirectoryWrapper.close(MockDirectoryWrapper.java:659)
> [junit4] 1> at org.apache.lucene.classification.ClassificationTestBase.tearDown(ClassificationTestBase.java:70)
> [junit4] 1> at sun.reflect.NativeMethodAccessorImpl.invoke0(Native Method)
> [junit4] 1> at sun.reflect.NativeMethodAccessorImpl.invoke(NativeMethodAccessorImpl.java:57)
> [junit4] 1> at sun.reflect.DelegatingMethodAccessorImpl.invoke(DelegatingMethodAccessorImpl.java:43)
> [junit4] 1> at java.lang.reflect.Method.invoke(Method.java:606)
> [junit4] 1> at com.carrotsearch.randomizedtesting.RandomizedRunner.invoke(RandomizedRunner.java:1559)
> [junit4] 1> at com.carrotsearch.randomizedtesting.RandomizedRunner.access$600(RandomizedRunner.java:79)
> [junit4] 1> at com.carrotsearch.randomizedtesting.RandomizedRunner$8.evaluate(RandomizedRunner.java:795)
> [junit4] 1> at org.apache.lucene.util.TestRuleSetupTeardownChained$1.evaluate(TestRuleSetupTeardownChained.java:50)
> [junit4] 1> at org.apache.lucene.util.TestRuleFieldCacheSanity$1.evaluate(TestRuleFieldCacheSanity.java:51)
> [junit4] 1> at org.apache.lucene.util.AbstractBeforeAfterRule$1.evaluate(AbstractBeforeAfterRule.java:46)
> [junit4] 1> at com.carrotsearch.randomizedtesting.rules.SystemPropertiesInvariantRule$1.evaluate(SystemPropertiesInvariantRule.java:55)
> [junit4] 1> at org.apache.lucene.util.TestRuleThreadAndTestName$1.evaluate(TestRuleThreadAndTestName.java:49)
> [junit4] 1> at org.apache.lucene.util.TestRuleIgnoreAfterMaxFailures$1.evaluate(TestRuleIgnoreAfterMaxFailures.java:70)
> [junit4] 1> at org.apache.lucene.util.TestRuleMarkFailure$1.evaluate(TestRuleMarkFailure.java:48)
> [junit4] 1> at com.carrotsearch.randomizedtesting.rules.StatementAdapter.evaluate(StatementAdapter.java:36)
> [junit4] 1> at com.carrotsearch.randomizedtesting.ThreadLeakControl$StatementRunner.run(ThreadLeakControl.java:358)
> [junit4] 1> at com.carrotsearch.randomizedtesting.ThreadLeakControl.forkTimeoutingTask(ThreadLeakControl.java:782)
> [junit4] 1> at com.carrotsearch.randomizedtesting.ThreadLeakControl$3.evaluate(ThreadLeakControl.java:442)
> [junit4] 1> at com.carrotsearch.randomizedtesting.RandomizedRunner.runSingleTest(RandomizedRunner.java:746)
> [junit4] 1> at com.carrotsearch.randomizedtesting.RandomizedRunner$3.evaluate(RandomizedRunner.java:648)
> [junit4] 1> at com.carrotsearch.randomizedtesting.RandomizedRunner$4.evaluate(RandomizedRunner.java:682)
> [junit4] 1> at com.carrotsearch.randomizedtesting.RandomizedRunner$5.evaluate(RandomizedRunner.java:693)
> [junit4] 1> at org.apache.lucene.util.AbstractBeforeAfterRule$1.evaluate(AbstractBeforeAfterRule.java:46)
> [junit4] 1> at org.apache.lucene.util.TestRuleStoreClassName$1.evaluate(TestRuleStoreClassName.java:42)
> [junit4] 1> at com.carrotsearch.randomizedtesting.rules.SystemPropertiesInvariantRule$1.evaluate(SystemPropertiesInvariantRule.java:55)
> [junit4] 1> at com.carrotsearch.randomizedtesting.rules.NoShadowingOrOverridesOnMethodsRule$1.evaluate(NoShadowingOrOverridesOnMethodsRule.java:39)
> [junit4] 1> at com.carrotsearch.randomizedtesting.rules.NoShadowingOrOverridesOnMethodsRule$1.evaluate(NoShadowingOrOverridesOnMethodsRule.java:39)
> [junit4] 1> at com.carrotsearch.randomizedtesting.rules.StatementAdapter.evaluate(StatementAdapter.java:36)
> [junit4] 1> at org.apache.lucene.util.TestRuleAssertionsRequired$1.evaluate(TestRuleAssertionsRequired.java:43)
> [junit4] 1> at org.apache.lucene.util.TestRuleMarkFailure$1.evaluate(TestRuleMarkFailure.java:48)
> [junit4] 1> at org.apache.lucene.util.TestRuleIgnoreAfterMaxFailures$1.evaluate(TestRuleIgnoreAfterMaxFailures.java:70)
> [junit4] 1> at org.apache.lucene.util.TestRuleIgnoreTestSuites$1.evaluate(TestRuleIgnoreTestSuites.java:55)
> [junit4] 1> at com.carrotsearch.randomizedtesting.rules.StatementAdapter.evaluate(StatementAdapter.java:36)
> [junit4] 1> at com.carrotsearch.randomizedtesting.ThreadLeakControl$StatementRunner.run(ThreadLeakControl.java:358)
> [junit4] 1> at java.lang.Thread.run(Thread.java:724)
> [junit4] 1> test: docvalues...........OK [0 docvalues fields; 0 BINARY; 0 NUMERIC; 0 SORTED; 0 SORTED_SET]
> [junit4] 1> FAILED
> [junit4] 1> WARNING: fixIndex() would remove reference to this segment; full exception:
> [junit4] 1> java.lang.RuntimeException: Term Vector test failed
> [junit4] 1> at org.apache.lucene.index.CheckIndex.checkIndex(CheckIndex.java:624)
> [junit4] 1> at org.apache.lucene.util._TestUtil.checkIndex(_TestUtil.java:223)
> [junit4] 1> at org.apache.lucene.store.MockDirectoryWrapper.close(MockDirectoryWrapper.java:659)
> [junit4] 1> at org.apache.lucene.classification.ClassificationTestBase.tearDown(ClassificationTestBase.java:70)
> [junit4] 1> at sun.reflect.NativeMethodAccessorImpl.invoke0(Native Method)
> [junit4] 1> at sun.reflect.NativeMethodAccessorImpl.invoke(NativeMethodAccessorImpl.java:57)
> [junit4] 1> at sun.reflect.DelegatingMethodAccessorImpl.invoke(DelegatingMethodAccessorImpl.java:43)
> [junit4] 1> at java.lang.reflect.Method.invoke(Method.java:606)
> [junit4] 1> at com.carrotsearch.randomizedtesting.RandomizedRunner.invoke(RandomizedRunner.java:1559)
> [junit4] 1> at com.carrotsearch.randomizedtesting.RandomizedRunner.access$600(RandomizedRunner.java:79)
> [junit4] 1> at com.carrotsearch.randomizedtesting.RandomizedRunner$8.evaluate(RandomizedRunner.java:795)
> [junit4] 1> at org.apache.lucene.util.TestRuleSetupTeardownChained$1.evaluate(TestRuleSetupTeardownChained.java:50)
> [junit4] 1> at org.apache.lucene.util.TestRuleFieldCacheSanity$1.evaluate(TestRuleFieldCacheSanity.java:51)
> [junit4] 1> at org.apache.lucene.util.AbstractBeforeAfterRule$1.evaluate(AbstractBeforeAfterRule.java:46)
> [junit4] 1> at com.carrotsearch.randomizedtesting.rules.SystemPropertiesInvariantRule$1.evaluate(SystemPropertiesInvariantRule.java:55)
> [junit4] 1> at org.apache.lucene.util.TestRuleThreadAndTestName$1.evaluate(TestRuleThreadAndTestName.java:49)
> [junit4] 1> at org.apache.lucene.util.TestRuleIgnoreAfterMaxFailures$1.evaluate(TestRuleIgnoreAfterMaxFailures.java:70)
> [junit4] 1> at org.apache.lucene.util.TestRuleMarkFailure$1.evaluate(TestRuleMarkFailure.java:48)
> [junit4] 1> at com.carrotsearch.randomizedtesting.rules.StatementAdapter.evaluate(StatementAdapter.java:36)
> [junit4] 1> at com.carrotsearch.randomizedtesting.ThreadLeakControl$StatementRunner.run(ThreadLeakControl.java:358)
> [junit4] 1> at com.carrotsearch.randomizedtesting.ThreadLeakControl.forkTimeoutingTask(ThreadLeakControl.java:782)
> [junit4] 1> at com.carrotsearch.randomizedtesting.ThreadLeakControl$3.evaluate(ThreadLeakControl.java:442)
> [junit4] 1> at com.carrotsearch.randomizedtesting.RandomizedRunner.runSingleTest(RandomizedRunner.java:746)
> [junit4] 1> at com.carrotsearch.randomizedtesting.RandomizedRunner$3.evaluate(RandomizedRunner.java:648)
> [junit4] 1> at com.carrotsearch.randomizedtesting.RandomizedRunner$4.evaluate(RandomizedRunner.java:682)
> [junit4] 1> at com.carrotsearch.randomizedtesting.RandomizedRunner$5.evaluate(RandomizedRunner.java:693)
> [junit4] 1> at org.apache.lucene.util.AbstractBeforeAfterRule$1.evaluate(AbstractBeforeAfterRule.java:46)
> [junit4] 1> at org.apache.lucene.util.TestRuleStoreClassName$1.evaluate(TestRuleStoreClassName.java:42)
> [junit4] 1> at com.carrotsearch.randomizedtesting.rules.SystemPropertiesInvariantRule$1.evaluate(SystemPropertiesInvariantRule.java:55)
> [junit4] 1> at com.carrotsearch.randomizedtesting.rules.NoShadowingOrOverridesOnMethodsRule$1.evaluate(NoShadowingOrOverridesOnMethodsRule.java:39)
> [junit4] 1> at com.carrotsearch.randomizedtesting.rules.NoShadowingOrOverridesOnMethodsRule$1.evaluate(NoShadowingOrOverridesOnMethodsRule.java:39)
> [junit4] 1> at com.carrotsearch.randomizedtesting.rules.StatementAdapter.evaluate(StatementAdapter.java:36)
> [junit4] 1> at org.apache.lucene.util.TestRuleAssertionsRequired$1.evaluate(TestRuleAssertionsRequired.java:43)
> [junit4] 1> at org.apache.lucene.util.TestRuleMarkFailure$1.evaluate(TestRuleMarkFailure.java:48)
> [junit4] 1> at org.apache.lucene.util.TestRuleIgnoreAfterMaxFailures$1.evaluate(TestRuleIgnoreAfterMaxFailures.java:70)
> [junit4] 1> at org.apache.lucene.util.TestRuleIgnoreTestSuites$1.evaluate(TestRuleIgnoreTestSuites.java:55)
> [junit4] 1> at com.carrotsearch.randomizedtesting.rules.StatementAdapter.evaluate(StatementAdapter.java:36)
> [junit4] 1> at com.carrotsearch.randomizedtesting.ThreadLeakControl$StatementRunner.run(ThreadLeakControl.java:358)
> [junit4] 1> at java.lang.Thread.run(Thread.java:724)
> [junit4] 1>
> [junit4] 1> 2 of 2: name=_1 docCount=102
> [junit4] 1> codec=FastDecompressionCompressingStoredFields(storedFieldsFormat=CompressingStoredFieldsFormat(compressionMode=FAST_DECOMPRESSION, chunkSize=16384), termVectorsFormat=CompressingTermVectorsFormat(compressionMode=FAST_DECOMPRESSION, chunkSize=16384))
> [junit4] 1> compound=true
> [junit4] 1> numFiles=3
> [junit4] 1> size (MB)=0.034
> [junit4] 1> diagnostics = {timestamp=1378977956167, os=Linux, os.version=3.2.0-53-generic, source=flush, lucene.version=5.0-SNAPSHOT, os.arch=amd64, java.version=1.7.0_40, java.vendor=Oracle Corporation}
> [junit4] 1> no deletions
> [junit4] 1> test: open reader.........OK
> [junit4] 1> test: fields..............OK [3 fields]
> [junit4] 1> test: field norms.........OK [3 fields]
> [junit4] 1> test: terms, freq, prox...OK [1297 terms; 1894 terms/docs pairs; 1912 tokens]
> [junit4] 1> test: stored fields.......OK [306 total field count; avg 3 fields per doc]
> [junit4] 1> test: term vectors........OK [306 total vector count; avg 3 term/freq vector fields per doc]
> [junit4] 1> test: docvalues...........OK [0 docvalues fields; 0 BINARY; 0 NUMERIC; 0 SORTED; 0 SORTED_SET]
> [junit4] 1>
> [junit4] 1> WARNING: 1 broken segments (containing 898 documents) detected
> [junit4] 1>
> [junit4] 2> NOTE: reproduce with: ant test -Dtestcase=KNearestNeighborClassifierTest -Dtests.method=testPerformance -Dtests.seed=68F81CB00E47182B -Dtests.multiplier=3 -Dtests.slow=true -Dtests.locale=es_BO -Dtests.timezone=NST -Dtests.file.encoding=UTF-8
> [junit4] ERROR 2.72s J0 | KNearestNeighborClassifierTest.testPerformance <<<
> [junit4] > Throwable #1: java.lang.RuntimeException: CheckIndex failed
> [junit4] > at __randomizedtesting.SeedInfo.seed([68F81CB00E47182B:AF19EE9265F32084]:0)
> [junit4] > at org.apache.lucene.util._TestUtil.checkIndex(_TestUtil.java:227)
> [junit4] > at org.apache.lucene.store.MockDirectoryWrapper.close(MockDirectoryWrapper.java:659)
> [junit4] > at org.apache.lucene.classification.ClassificationTestBase.tearDown(ClassificationTestBase.java:70)
> [junit4] > at java.lang.Thread.run(Thread.java:724)
> [junit4] 2> NOTE: test params are: codec=FastDecompressionCompressingStoredFields(storedFieldsFormat=CompressingStoredFieldsFormat(compressionMode=FAST_DECOMPRESSION, chunkSize=168), termVectorsFormat=CompressingTermVectorsFormat(compressionMode=FAST_DECOMPRESSION, chunkSize=168)), sim=RandomSimilarityProvider(queryNorm=true,coord=yes): {text=DFR GB1, cat=DFR I(n)B1, bool=DFR G2}, locale=es_BO, timezone=NST
> [junit4] 2> NOTE: Linux 3.2.0-53-generic amd64/Oracle Corporation 1.7.0_40 (64-bit)/cpus=8,threads=1,free=59466608,total=131072000
> [junit4] 2> NOTE: All tests run in this JVM: [DataSplitterTest, KNearestNeighborClassifierTest]
> [junit4] Completed on J0 in 2.91s, 2 tests, 1 error <<< FAILURES!
>
> [...truncated 13 lines...]
> BUILD FAILED
> /mnt/ssd/jenkins/workspace/Lucene-Solr-trunk-Linux/build.xml:396: The following error occurred while executing this line:
> /mnt/ssd/jenkins/workspace/Lucene-Solr-trunk-Linux/build.xml:376: The following error occurred while executing this line:
> /mnt/ssd/jenkins/workspace/Lucene-Solr-trunk-Linux/build.xml:39: The following error occurred while executing this line:
> /mnt/ssd/jenkins/workspace/Lucene-Solr-trunk-Linux/lucene/build.xml:556: The following error occurred while executing this line:
> /mnt/ssd/jenkins/workspace/Lucene-Solr-trunk-Linux/lucene/common-build.xml:1885: The following error occurred while executing this line:
> /mnt/ssd/jenkins/workspace/Lucene-Solr-trunk-Linux/lucene/module-build.xml:61: The following error occurred while executing this line:
> /mnt/ssd/jenkins/workspace/Lucene-Solr-trunk-Linux/lucene/common-build.xml:1230: The following error occurred while executing this line:
> /mnt/ssd/jenkins/workspace/Lucene-Solr-trunk-Linux/lucene/common-build.xml:873: There were test failures: 4 suites, 10 tests, 1 error
>
> Total time: 12 minutes 29 seconds
> Build step 'Invoke Ant' marked build as failure
> Description set: Java: 64bit/jdk1.7.0_40 -XX:-UseCompressedOops -XX:+UseG1GC
> Archiving artifacts
> Recording test results
> Email was triggered for: Failure
> Sending email for trigger: Failure
>
>
>
>
> ---------------------------------------------------------------------
> To unsubscribe, e-mail: dev-unsubscribe@lucene.apache.org
> For additional commands, e-mail: dev-help@lucene.apache.org
---------------------------------------------------------------------
To unsubscribe, e-mail: dev-unsubscribe@lucene.apache.org
For additional commands, e-mail: dev-help@lucene.apache.org