You are viewing a plain text version of this content. The canonical link for it is here.
Posted to dev@geronimo.apache.org by ga...@apache.org on 2011/02/11 22:43:18 UTC
[BUILD] branches/2.2: Failed for Revision: 1069916
Geronimo Revision: 1069916 built with tests included
See the full build-1400.log file at http://people.apache.org/builds/geronimo/server/binaries/2.2/20110211/build-1400.log
Download the binaries from http://people.apache.org/builds/geronimo/server/binaries/2.2/20110211
[INFO] BUILD SUCCESSFUL
[INFO] ------------------------------------------------------------------------
[INFO] Total time: 33 minutes 34 seconds
[INFO] Finished at: Fri Feb 11 14:40:26 EST 2011
[INFO] Final Memory: 304M/963M
[INFO] ------------------------------------------------------------------------
TESTSUITE RESULTS (Failures only)
=================================
Assembly: tomcat
=================================
See full test results and logs at http://people.apache.org/builds/geronimo/server/binaries/2.2/20110211/logs-1400-tomcat/
[INFO] Running TestSuite
[INFO] Tests run: 40, Failures: 24, Errors: 0, Skipped: 0, Time elapsed: 208.146 sec <<< FAILURE!
[INFO] Running TestSuite
[INFO] Tests run: 12, Failures: 9, Errors: 0, Skipped: 0, Time elapsed: 74.314 sec <<< FAILURE!
--
[INFO] Running TestSuite
[INFO] Tests run: 36, Failures: 1, Errors: 0, Skipped: 0, Time elapsed: 68.994 sec <<< FAILURE!
Assembly: jetty
=================================
See full test results and logs at http://people.apache.org/builds/geronimo/server/binaries/2.2/20110211/logs-1400-jetty/
[INFO] Running TestSuite
[INFO] Tests run: 40, Failures: 25, Errors: 0, Skipped: 0, Time elapsed: 212.488 sec <<< FAILURE!
[INFO] Running TestSuite
[INFO] Tests run: 12, Failures: 10, Errors: 0, Skipped: 0, Time elapsed: 69.164 sec <<< FAILURE!
--
[INFO] Running TestSuite
[INFO] Tests run: 2, Failures: 2, Errors: 0, Skipped: 0, Time elapsed: 7.676 sec <<< FAILURE!
Samples: branches/2.2
=================================
Log: http://people.apache.org/builds/geronimo/server/binaries/2.2/20110211/samples-1400.log
Build status: OK