You are viewing a plain text version of this content. The canonical link for it is here.
Posted to dev@lucene.apache.org by Policeman Jenkins Server <je...@thetaphi.de> on 2018/12/05 10:00:20 UTC
[JENKINS] Lucene-Solr-7.6-Linux (64bit/jdk-10.0.1) - Build # 63 -
Still Unstable!
Build: https://jenkins.thetaphi.de/job/Lucene-Solr-7.6-Linux/63/
Java: 64bit/jdk-10.0.1 -XX:-UseCompressedOops -XX:+UseConcMarkSweepGC
4 tests failed.
FAILED: org.apache.solr.cloud.TestTlogReplica.testRecovery
Error Message:
Can not find doc 7 in https://127.0.0.1:46081/solr
Stack Trace:
java.lang.AssertionError: Can not find doc 7 in https://127.0.0.1:46081/solr
at __randomizedtesting.SeedInfo.seed([5678F9C8765930C5:978880645B09FA62]:0)
at org.junit.Assert.fail(Assert.java:93)
at org.junit.Assert.assertTrue(Assert.java:43)
at org.junit.Assert.assertNotNull(Assert.java:526)
at org.apache.solr.cloud.TestTlogReplica.checkRTG(TestTlogReplica.java:902)
at org.apache.solr.cloud.TestTlogReplica.testRecovery(TestTlogReplica.java:567)
at java.base/jdk.internal.reflect.NativeMethodAccessorImpl.invoke0(Native Method)
at java.base/jdk.internal.reflect.NativeMethodAccessorImpl.invoke(NativeMethodAccessorImpl.java:62)
at java.base/jdk.internal.reflect.DelegatingMethodAccessorImpl.invoke(DelegatingMethodAccessorImpl.java:43)
at java.base/java.lang.reflect.Method.invoke(Method.java:564)
at com.carrotsearch.randomizedtesting.RandomizedRunner.invoke(RandomizedRunner.java:1742)
at com.carrotsearch.randomizedtesting.RandomizedRunner$8.evaluate(RandomizedRunner.java:935)
at com.carrotsearch.randomizedtesting.RandomizedRunner$9.evaluate(RandomizedRunner.java:971)
at com.carrotsearch.randomizedtesting.RandomizedRunner$10.evaluate(RandomizedRunner.java:985)
at com.carrotsearch.randomizedtesting.rules.SystemPropertiesRestoreRule$1.evaluate(SystemPropertiesRestoreRule.java:57)
at org.apache.lucene.util.TestRuleSetupTeardownChained$1.evaluate(TestRuleSetupTeardownChained.java:49)
at org.apache.lucene.util.AbstractBeforeAfterRule$1.evaluate(AbstractBeforeAfterRule.java:45)
at org.apache.lucene.util.TestRuleThreadAndTestName$1.evaluate(TestRuleThreadAndTestName.java:48)
at org.apache.lucene.util.TestRuleIgnoreAfterMaxFailures$1.evaluate(TestRuleIgnoreAfterMaxFailures.java:64)
at org.apache.lucene.util.TestRuleMarkFailure$1.evaluate(TestRuleMarkFailure.java:47)
at com.carrotsearch.randomizedtesting.rules.StatementAdapter.evaluate(StatementAdapter.java:36)
at com.carrotsearch.randomizedtesting.ThreadLeakControl$StatementRunner.run(ThreadLeakControl.java:368)
at com.carrotsearch.randomizedtesting.ThreadLeakControl.forkTimeoutingTask(ThreadLeakControl.java:817)
at com.carrotsearch.randomizedtesting.ThreadLeakControl$3.evaluate(ThreadLeakControl.java:468)
at com.carrotsearch.randomizedtesting.RandomizedRunner.runSingleTest(RandomizedRunner.java:944)
at com.carrotsearch.randomizedtesting.RandomizedRunner$5.evaluate(RandomizedRunner.java:830)
at com.carrotsearch.randomizedtesting.RandomizedRunner$6.evaluate(RandomizedRunner.java:880)
at com.carrotsearch.randomizedtesting.RandomizedRunner$7.evaluate(RandomizedRunner.java:891)
at com.carrotsearch.randomizedtesting.rules.StatementAdapter.evaluate(StatementAdapter.java:36)
at com.carrotsearch.randomizedtesting.rules.SystemPropertiesRestoreRule$1.evaluate(SystemPropertiesRestoreRule.java:57)
at org.apache.lucene.util.AbstractBeforeAfterRule$1.evaluate(AbstractBeforeAfterRule.java:45)
at com.carrotsearch.randomizedtesting.rules.StatementAdapter.evaluate(StatementAdapter.java:36)
at org.apache.lucene.util.TestRuleStoreClassName$1.evaluate(TestRuleStoreClassName.java:41)
at com.carrotsearch.randomizedtesting.rules.NoShadowingOrOverridesOnMethodsRule$1.evaluate(NoShadowingOrOverridesOnMethodsRule.java:40)
at com.carrotsearch.randomizedtesting.rules.NoShadowingOrOverridesOnMethodsRule$1.evaluate(NoShadowingOrOverridesOnMethodsRule.java:40)
at com.carrotsearch.randomizedtesting.rules.StatementAdapter.evaluate(StatementAdapter.java:36)
at com.carrotsearch.randomizedtesting.rules.StatementAdapter.evaluate(StatementAdapter.java:36)
at org.apache.lucene.util.TestRuleAssertionsRequired$1.evaluate(TestRuleAssertionsRequired.java:53)
at org.apache.lucene.util.TestRuleMarkFailure$1.evaluate(TestRuleMarkFailure.java:47)
at org.apache.lucene.util.TestRuleIgnoreAfterMaxFailures$1.evaluate(TestRuleIgnoreAfterMaxFailures.java:64)
at org.apache.lucene.util.TestRuleIgnoreTestSuites$1.evaluate(TestRuleIgnoreTestSuites.java:54)
at com.carrotsearch.randomizedtesting.rules.StatementAdapter.evaluate(StatementAdapter.java:36)
at com.carrotsearch.randomizedtesting.ThreadLeakControl$StatementRunner.run(ThreadLeakControl.java:368)
at java.base/java.lang.Thread.run(Thread.java:844)
FAILED: org.apache.solr.cloud.TestTlogReplica.testRecovery
Error Message:
Can not find doc 7 in https://127.0.0.1:40807/solr
Stack Trace:
java.lang.AssertionError: Can not find doc 7 in https://127.0.0.1:40807/solr
at __randomizedtesting.SeedInfo.seed([5678F9C8765930C5:978880645B09FA62]:0)
at org.junit.Assert.fail(Assert.java:93)
at org.junit.Assert.assertTrue(Assert.java:43)
at org.junit.Assert.assertNotNull(Assert.java:526)
at org.apache.solr.cloud.TestTlogReplica.checkRTG(TestTlogReplica.java:902)
at org.apache.solr.cloud.TestTlogReplica.testRecovery(TestTlogReplica.java:567)
at java.base/jdk.internal.reflect.NativeMethodAccessorImpl.invoke0(Native Method)
at java.base/jdk.internal.reflect.NativeMethodAccessorImpl.invoke(NativeMethodAccessorImpl.java:62)
at java.base/jdk.internal.reflect.DelegatingMethodAccessorImpl.invoke(DelegatingMethodAccessorImpl.java:43)
at java.base/java.lang.reflect.Method.invoke(Method.java:564)
at com.carrotsearch.randomizedtesting.RandomizedRunner.invoke(RandomizedRunner.java:1742)
at com.carrotsearch.randomizedtesting.RandomizedRunner$8.evaluate(RandomizedRunner.java:935)
at com.carrotsearch.randomizedtesting.RandomizedRunner$9.evaluate(RandomizedRunner.java:971)
at com.carrotsearch.randomizedtesting.RandomizedRunner$10.evaluate(RandomizedRunner.java:985)
at com.carrotsearch.randomizedtesting.rules.SystemPropertiesRestoreRule$1.evaluate(SystemPropertiesRestoreRule.java:57)
at org.apache.lucene.util.TestRuleSetupTeardownChained$1.evaluate(TestRuleSetupTeardownChained.java:49)
at org.apache.lucene.util.AbstractBeforeAfterRule$1.evaluate(AbstractBeforeAfterRule.java:45)
at org.apache.lucene.util.TestRuleThreadAndTestName$1.evaluate(TestRuleThreadAndTestName.java:48)
at org.apache.lucene.util.TestRuleIgnoreAfterMaxFailures$1.evaluate(TestRuleIgnoreAfterMaxFailures.java:64)
at org.apache.lucene.util.TestRuleMarkFailure$1.evaluate(TestRuleMarkFailure.java:47)
at com.carrotsearch.randomizedtesting.rules.StatementAdapter.evaluate(StatementAdapter.java:36)
at com.carrotsearch.randomizedtesting.ThreadLeakControl$StatementRunner.run(ThreadLeakControl.java:368)
at com.carrotsearch.randomizedtesting.ThreadLeakControl.forkTimeoutingTask(ThreadLeakControl.java:817)
at com.carrotsearch.randomizedtesting.ThreadLeakControl$3.evaluate(ThreadLeakControl.java:468)
at com.carrotsearch.randomizedtesting.RandomizedRunner.runSingleTest(RandomizedRunner.java:944)
at com.carrotsearch.randomizedtesting.RandomizedRunner$5.evaluate(RandomizedRunner.java:830)
at com.carrotsearch.randomizedtesting.RandomizedRunner$6.evaluate(RandomizedRunner.java:880)
at com.carrotsearch.randomizedtesting.RandomizedRunner$7.evaluate(RandomizedRunner.java:891)
at com.carrotsearch.randomizedtesting.rules.StatementAdapter.evaluate(StatementAdapter.java:36)
at com.carrotsearch.randomizedtesting.rules.SystemPropertiesRestoreRule$1.evaluate(SystemPropertiesRestoreRule.java:57)
at org.apache.lucene.util.AbstractBeforeAfterRule$1.evaluate(AbstractBeforeAfterRule.java:45)
at com.carrotsearch.randomizedtesting.rules.StatementAdapter.evaluate(StatementAdapter.java:36)
at org.apache.lucene.util.TestRuleStoreClassName$1.evaluate(TestRuleStoreClassName.java:41)
at com.carrotsearch.randomizedtesting.rules.NoShadowingOrOverridesOnMethodsRule$1.evaluate(NoShadowingOrOverridesOnMethodsRule.java:40)
at com.carrotsearch.randomizedtesting.rules.NoShadowingOrOverridesOnMethodsRule$1.evaluate(NoShadowingOrOverridesOnMethodsRule.java:40)
at com.carrotsearch.randomizedtesting.rules.StatementAdapter.evaluate(StatementAdapter.java:36)
at com.carrotsearch.randomizedtesting.rules.StatementAdapter.evaluate(StatementAdapter.java:36)
at org.apache.lucene.util.TestRuleAssertionsRequired$1.evaluate(TestRuleAssertionsRequired.java:53)
at org.apache.lucene.util.TestRuleMarkFailure$1.evaluate(TestRuleMarkFailure.java:47)
at org.apache.lucene.util.TestRuleIgnoreAfterMaxFailures$1.evaluate(TestRuleIgnoreAfterMaxFailures.java:64)
at org.apache.lucene.util.TestRuleIgnoreTestSuites$1.evaluate(TestRuleIgnoreTestSuites.java:54)
at com.carrotsearch.randomizedtesting.rules.StatementAdapter.evaluate(StatementAdapter.java:36)
at com.carrotsearch.randomizedtesting.ThreadLeakControl$StatementRunner.run(ThreadLeakControl.java:368)
at java.base/java.lang.Thread.run(Thread.java:844)
FAILED: org.apache.solr.cloud.TestTlogReplica.testRecovery
Error Message:
Can not find doc 7 in https://127.0.0.1:36277/solr
Stack Trace:
java.lang.AssertionError: Can not find doc 7 in https://127.0.0.1:36277/solr
at __randomizedtesting.SeedInfo.seed([5678F9C8765930C5:978880645B09FA62]:0)
at org.junit.Assert.fail(Assert.java:93)
at org.junit.Assert.assertTrue(Assert.java:43)
at org.junit.Assert.assertNotNull(Assert.java:526)
at org.apache.solr.cloud.TestTlogReplica.checkRTG(TestTlogReplica.java:902)
at org.apache.solr.cloud.TestTlogReplica.testRecovery(TestTlogReplica.java:567)
at java.base/jdk.internal.reflect.NativeMethodAccessorImpl.invoke0(Native Method)
at java.base/jdk.internal.reflect.NativeMethodAccessorImpl.invoke(NativeMethodAccessorImpl.java:62)
at java.base/jdk.internal.reflect.DelegatingMethodAccessorImpl.invoke(DelegatingMethodAccessorImpl.java:43)
at java.base/java.lang.reflect.Method.invoke(Method.java:564)
at com.carrotsearch.randomizedtesting.RandomizedRunner.invoke(RandomizedRunner.java:1742)
at com.carrotsearch.randomizedtesting.RandomizedRunner$8.evaluate(RandomizedRunner.java:935)
at com.carrotsearch.randomizedtesting.RandomizedRunner$9.evaluate(RandomizedRunner.java:971)
at com.carrotsearch.randomizedtesting.RandomizedRunner$10.evaluate(RandomizedRunner.java:985)
at com.carrotsearch.randomizedtesting.rules.SystemPropertiesRestoreRule$1.evaluate(SystemPropertiesRestoreRule.java:57)
at org.apache.lucene.util.TestRuleSetupTeardownChained$1.evaluate(TestRuleSetupTeardownChained.java:49)
at org.apache.lucene.util.AbstractBeforeAfterRule$1.evaluate(AbstractBeforeAfterRule.java:45)
at org.apache.lucene.util.TestRuleThreadAndTestName$1.evaluate(TestRuleThreadAndTestName.java:48)
at org.apache.lucene.util.TestRuleIgnoreAfterMaxFailures$1.evaluate(TestRuleIgnoreAfterMaxFailures.java:64)
at org.apache.lucene.util.TestRuleMarkFailure$1.evaluate(TestRuleMarkFailure.java:47)
at com.carrotsearch.randomizedtesting.rules.StatementAdapter.evaluate(StatementAdapter.java:36)
at com.carrotsearch.randomizedtesting.ThreadLeakControl$StatementRunner.run(ThreadLeakControl.java:368)
at com.carrotsearch.randomizedtesting.ThreadLeakControl.forkTimeoutingTask(ThreadLeakControl.java:817)
at com.carrotsearch.randomizedtesting.ThreadLeakControl$3.evaluate(ThreadLeakControl.java:468)
at com.carrotsearch.randomizedtesting.RandomizedRunner.runSingleTest(RandomizedRunner.java:944)
at com.carrotsearch.randomizedtesting.RandomizedRunner$5.evaluate(RandomizedRunner.java:830)
at com.carrotsearch.randomizedtesting.RandomizedRunner$6.evaluate(RandomizedRunner.java:880)
at com.carrotsearch.randomizedtesting.RandomizedRunner$7.evaluate(RandomizedRunner.java:891)
at com.carrotsearch.randomizedtesting.rules.StatementAdapter.evaluate(StatementAdapter.java:36)
at com.carrotsearch.randomizedtesting.rules.SystemPropertiesRestoreRule$1.evaluate(SystemPropertiesRestoreRule.java:57)
at org.apache.lucene.util.AbstractBeforeAfterRule$1.evaluate(AbstractBeforeAfterRule.java:45)
at com.carrotsearch.randomizedtesting.rules.StatementAdapter.evaluate(StatementAdapter.java:36)
at org.apache.lucene.util.TestRuleStoreClassName$1.evaluate(TestRuleStoreClassName.java:41)
at com.carrotsearch.randomizedtesting.rules.NoShadowingOrOverridesOnMethodsRule$1.evaluate(NoShadowingOrOverridesOnMethodsRule.java:40)
at com.carrotsearch.randomizedtesting.rules.NoShadowingOrOverridesOnMethodsRule$1.evaluate(NoShadowingOrOverridesOnMethodsRule.java:40)
at com.carrotsearch.randomizedtesting.rules.StatementAdapter.evaluate(StatementAdapter.java:36)
at com.carrotsearch.randomizedtesting.rules.StatementAdapter.evaluate(StatementAdapter.java:36)
at org.apache.lucene.util.TestRuleAssertionsRequired$1.evaluate(TestRuleAssertionsRequired.java:53)
at org.apache.lucene.util.TestRuleMarkFailure$1.evaluate(TestRuleMarkFailure.java:47)
at org.apache.lucene.util.TestRuleIgnoreAfterMaxFailures$1.evaluate(TestRuleIgnoreAfterMaxFailures.java:64)
at org.apache.lucene.util.TestRuleIgnoreTestSuites$1.evaluate(TestRuleIgnoreTestSuites.java:54)
at com.carrotsearch.randomizedtesting.rules.StatementAdapter.evaluate(StatementAdapter.java:36)
at com.carrotsearch.randomizedtesting.ThreadLeakControl$StatementRunner.run(ThreadLeakControl.java:368)
at java.base/java.lang.Thread.run(Thread.java:844)
FAILED: org.apache.solr.cloud.TestTlogReplica.testRecovery
Error Message:
Can not find doc 7 in https://127.0.0.1:41907/solr
Stack Trace:
java.lang.AssertionError: Can not find doc 7 in https://127.0.0.1:41907/solr
at __randomizedtesting.SeedInfo.seed([5678F9C8765930C5:978880645B09FA62]:0)
at org.junit.Assert.fail(Assert.java:93)
at org.junit.Assert.assertTrue(Assert.java:43)
at org.junit.Assert.assertNotNull(Assert.java:526)
at org.apache.solr.cloud.TestTlogReplica.checkRTG(TestTlogReplica.java:902)
at org.apache.solr.cloud.TestTlogReplica.testRecovery(TestTlogReplica.java:567)
at java.base/jdk.internal.reflect.NativeMethodAccessorImpl.invoke0(Native Method)
at java.base/jdk.internal.reflect.NativeMethodAccessorImpl.invoke(NativeMethodAccessorImpl.java:62)
at java.base/jdk.internal.reflect.DelegatingMethodAccessorImpl.invoke(DelegatingMethodAccessorImpl.java:43)
at java.base/java.lang.reflect.Method.invoke(Method.java:564)
at com.carrotsearch.randomizedtesting.RandomizedRunner.invoke(RandomizedRunner.java:1742)
at com.carrotsearch.randomizedtesting.RandomizedRunner$8.evaluate(RandomizedRunner.java:935)
at com.carrotsearch.randomizedtesting.RandomizedRunner$9.evaluate(RandomizedRunner.java:971)
at com.carrotsearch.randomizedtesting.RandomizedRunner$10.evaluate(RandomizedRunner.java:985)
at com.carrotsearch.randomizedtesting.rules.SystemPropertiesRestoreRule$1.evaluate(SystemPropertiesRestoreRule.java:57)
at org.apache.lucene.util.TestRuleSetupTeardownChained$1.evaluate(TestRuleSetupTeardownChained.java:49)
at org.apache.lucene.util.AbstractBeforeAfterRule$1.evaluate(AbstractBeforeAfterRule.java:45)
at org.apache.lucene.util.TestRuleThreadAndTestName$1.evaluate(TestRuleThreadAndTestName.java:48)
at org.apache.lucene.util.TestRuleIgnoreAfterMaxFailures$1.evaluate(TestRuleIgnoreAfterMaxFailures.java:64)
at org.apache.lucene.util.TestRuleMarkFailure$1.evaluate(TestRuleMarkFailure.java:47)
at com.carrotsearch.randomizedtesting.rules.StatementAdapter.evaluate(StatementAdapter.java:36)
at com.carrotsearch.randomizedtesting.ThreadLeakControl$StatementRunner.run(ThreadLeakControl.java:368)
at com.carrotsearch.randomizedtesting.ThreadLeakControl.forkTimeoutingTask(ThreadLeakControl.java:817)
at com.carrotsearch.randomizedtesting.ThreadLeakControl$3.evaluate(ThreadLeakControl.java:468)
at com.carrotsearch.randomizedtesting.RandomizedRunner.runSingleTest(RandomizedRunner.java:944)
at com.carrotsearch.randomizedtesting.RandomizedRunner$5.evaluate(RandomizedRunner.java:830)
at com.carrotsearch.randomizedtesting.RandomizedRunner$6.evaluate(RandomizedRunner.java:880)
at com.carrotsearch.randomizedtesting.RandomizedRunner$7.evaluate(RandomizedRunner.java:891)
at com.carrotsearch.randomizedtesting.rules.StatementAdapter.evaluate(StatementAdapter.java:36)
at com.carrotsearch.randomizedtesting.rules.SystemPropertiesRestoreRule$1.evaluate(SystemPropertiesRestoreRule.java:57)
at org.apache.lucene.util.AbstractBeforeAfterRule$1.evaluate(AbstractBeforeAfterRule.java:45)
at com.carrotsearch.randomizedtesting.rules.StatementAdapter.evaluate(StatementAdapter.java:36)
at org.apache.lucene.util.TestRuleStoreClassName$1.evaluate(TestRuleStoreClassName.java:41)
at com.carrotsearch.randomizedtesting.rules.NoShadowingOrOverridesOnMethodsRule$1.evaluate(NoShadowingOrOverridesOnMethodsRule.java:40)
at com.carrotsearch.randomizedtesting.rules.NoShadowingOrOverridesOnMethodsRule$1.evaluate(NoShadowingOrOverridesOnMethodsRule.java:40)
at com.carrotsearch.randomizedtesting.rules.StatementAdapter.evaluate(StatementAdapter.java:36)
at com.carrotsearch.randomizedtesting.rules.StatementAdapter.evaluate(StatementAdapter.java:36)
at org.apache.lucene.util.TestRuleAssertionsRequired$1.evaluate(TestRuleAssertionsRequired.java:53)
at org.apache.lucene.util.TestRuleMarkFailure$1.evaluate(TestRuleMarkFailure.java:47)
at org.apache.lucene.util.TestRuleIgnoreAfterMaxFailures$1.evaluate(TestRuleIgnoreAfterMaxFailures.java:64)
at org.apache.lucene.util.TestRuleIgnoreTestSuites$1.evaluate(TestRuleIgnoreTestSuites.java:54)
at com.carrotsearch.randomizedtesting.rules.StatementAdapter.evaluate(StatementAdapter.java:36)
at com.carrotsearch.randomizedtesting.ThreadLeakControl$StatementRunner.run(ThreadLeakControl.java:368)
at java.base/java.lang.Thread.run(Thread.java:844)
Build Log:
[...truncated 1878 lines...]
[junit4] JVM J1: stderr was not empty, see: /home/jenkins/workspace/Lucene-Solr-7.6-Linux/lucene/build/core/test/temp/junit4-J1-20181205_084336_55416995805471644143990.syserr
[junit4] >>> JVM J1 emitted unexpected output (verbatim) ----
[junit4] OpenJDK 64-Bit Server VM warning: Option UseConcMarkSweepGC was deprecated in version 9.0 and will likely be removed in a future release.
[junit4] <<< JVM J1: EOF ----
[...truncated 5 lines...]
[junit4] JVM J2: stderr was not empty, see: /home/jenkins/workspace/Lucene-Solr-7.6-Linux/lucene/build/core/test/temp/junit4-J2-20181205_084336_55416615131647198372778.syserr
[junit4] >>> JVM J2 emitted unexpected output (verbatim) ----
[junit4] OpenJDK 64-Bit Server VM warning: Option UseConcMarkSweepGC was deprecated in version 9.0 and will likely be removed in a future release.
[junit4] <<< JVM J2: EOF ----
[...truncated 36 lines...]
[junit4] JVM J0: stderr was not empty, see: /home/jenkins/workspace/Lucene-Solr-7.6-Linux/lucene/build/core/test/temp/junit4-J0-20181205_084336_5542423577061696128484.syserr
[junit4] >>> JVM J0 emitted unexpected output (verbatim) ----
[junit4] OpenJDK 64-Bit Server VM warning: Option UseConcMarkSweepGC was deprecated in version 9.0 and will likely be removed in a future release.
[junit4] <<< JVM J0: EOF ----
[...truncated 301 lines...]
[junit4] JVM J2: stderr was not empty, see: /home/jenkins/workspace/Lucene-Solr-7.6-Linux/lucene/build/test-framework/test/temp/junit4-J2-20181205_084944_9236456390225321876505.syserr
[junit4] >>> JVM J2 emitted unexpected output (verbatim) ----
[junit4] OpenJDK 64-Bit Server VM warning: Option UseConcMarkSweepGC was deprecated in version 9.0 and will likely be removed in a future release.
[junit4] <<< JVM J2: EOF ----
[...truncated 3 lines...]
[junit4] JVM J1: stderr was not empty, see: /home/jenkins/workspace/Lucene-Solr-7.6-Linux/lucene/build/test-framework/test/temp/junit4-J1-20181205_084944_92313144288239094990326.syserr
[junit4] >>> JVM J1 emitted unexpected output (verbatim) ----
[junit4] OpenJDK 64-Bit Server VM warning: Option UseConcMarkSweepGC was deprecated in version 9.0 and will likely be removed in a future release.
[junit4] <<< JVM J1: EOF ----
[...truncated 3 lines...]
[junit4] JVM J0: stderr was not empty, see: /home/jenkins/workspace/Lucene-Solr-7.6-Linux/lucene/build/test-framework/test/temp/junit4-J0-20181205_084944_9237264989694931108709.syserr
[junit4] >>> JVM J0 emitted unexpected output (verbatim) ----
[junit4] OpenJDK 64-Bit Server VM warning: Option UseConcMarkSweepGC was deprecated in version 9.0 and will likely be removed in a future release.
[junit4] <<< JVM J0: EOF ----
[...truncated 1080 lines...]
[junit4] JVM J0: stderr was not empty, see: /home/jenkins/workspace/Lucene-Solr-7.6-Linux/lucene/build/analysis/common/test/temp/junit4-J0-20181205_085049_27712409327541870745976.syserr
[junit4] >>> JVM J0 emitted unexpected output (verbatim) ----
[junit4] OpenJDK 64-Bit Server VM warning: Option UseConcMarkSweepGC was deprecated in version 9.0 and will likely be removed in a future release.
[junit4] <<< JVM J0: EOF ----
[...truncated 3 lines...]
[junit4] JVM J1: stderr was not empty, see: /home/jenkins/workspace/Lucene-Solr-7.6-Linux/lucene/build/analysis/common/test/temp/junit4-J1-20181205_085049_27711914508793925473555.syserr
[junit4] >>> JVM J1 emitted unexpected output (verbatim) ----
[junit4] OpenJDK 64-Bit Server VM warning: Option UseConcMarkSweepGC was deprecated in version 9.0 and will likely be removed in a future release.
[junit4] <<< JVM J1: EOF ----
[...truncated 3 lines...]
[junit4] JVM J2: stderr was not empty, see: /home/jenkins/workspace/Lucene-Solr-7.6-Linux/lucene/build/analysis/common/test/temp/junit4-J2-20181205_085049_27715940064767427157980.syserr
[junit4] >>> JVM J2 emitted unexpected output (verbatim) ----
[junit4] OpenJDK 64-Bit Server VM warning: Option UseConcMarkSweepGC was deprecated in version 9.0 and will likely be removed in a future release.
[junit4] <<< JVM J2: EOF ----
[...truncated 255 lines...]
[junit4] JVM J0: stderr was not empty, see: /home/jenkins/workspace/Lucene-Solr-7.6-Linux/lucene/build/analysis/icu/test/temp/junit4-J0-20181205_085229_35814722996917606478194.syserr
[junit4] >>> JVM J0 emitted unexpected output (verbatim) ----
[junit4] OpenJDK 64-Bit Server VM warning: Option UseConcMarkSweepGC was deprecated in version 9.0 and will likely be removed in a future release.
[junit4] <<< JVM J0: EOF ----
[...truncated 3 lines...]
[junit4] JVM J2: stderr was not empty, see: /home/jenkins/workspace/Lucene-Solr-7.6-Linux/lucene/build/analysis/icu/test/temp/junit4-J2-20181205_085229_3585609575324375431589.syserr
[junit4] >>> JVM J2 emitted unexpected output (verbatim) ----
[junit4] OpenJDK 64-Bit Server VM warning: Option UseConcMarkSweepGC was deprecated in version 9.0 and will likely be removed in a future release.
[junit4] <<< JVM J2: EOF ----
[...truncated 3 lines...]
[junit4] JVM J1: stderr was not empty, see: /home/jenkins/workspace/Lucene-Solr-7.6-Linux/lucene/build/analysis/icu/test/temp/junit4-J1-20181205_085229_35816500034715671156242.syserr
[junit4] >>> JVM J1 emitted unexpected output (verbatim) ----
[junit4] OpenJDK 64-Bit Server VM warning: Option UseConcMarkSweepGC was deprecated in version 9.0 and will likely be removed in a future release.
[junit4] <<< JVM J1: EOF ----
[...truncated 253 lines...]
[junit4] JVM J1: stderr was not empty, see: /home/jenkins/workspace/Lucene-Solr-7.6-Linux/lucene/build/analysis/kuromoji/test/temp/junit4-J1-20181205_085248_7598257360989008953859.syserr
[junit4] >>> JVM J1 emitted unexpected output (verbatim) ----
[junit4] OpenJDK 64-Bit Server VM warning: Option UseConcMarkSweepGC was deprecated in version 9.0 and will likely be removed in a future release.
[junit4] <<< JVM J1: EOF ----
[junit4] JVM J0: stderr was not empty, see: /home/jenkins/workspace/Lucene-Solr-7.6-Linux/lucene/build/analysis/kuromoji/test/temp/junit4-J0-20181205_085248_75915518882072176067349.syserr
[junit4] >>> JVM J0 emitted unexpected output (verbatim) ----
[junit4] OpenJDK 64-Bit Server VM warning: Option UseConcMarkSweepGC was deprecated in version 9.0 and will likely be removed in a future release.
[junit4] <<< JVM J0: EOF ----
[...truncated 6 lines...]
[junit4] JVM J2: stderr was not empty, see: /home/jenkins/workspace/Lucene-Solr-7.6-Linux/lucene/build/analysis/kuromoji/test/temp/junit4-J2-20181205_085248_7597166593629198143309.syserr
[junit4] >>> JVM J2 emitted unexpected output (verbatim) ----
[junit4] OpenJDK 64-Bit Server VM warning: Option UseConcMarkSweepGC was deprecated in version 9.0 and will likely be removed in a future release.
[junit4] <<< JVM J2: EOF ----
[...truncated 162 lines...]
[junit4] JVM J1: stderr was not empty, see: /home/jenkins/workspace/Lucene-Solr-7.6-Linux/lucene/build/analysis/morfologik/test/temp/junit4-J1-20181205_085309_58715989604066468229021.syserr
[junit4] >>> JVM J1 emitted unexpected output (verbatim) ----
[junit4] OpenJDK 64-Bit Server VM warning: Option UseConcMarkSweepGC was deprecated in version 9.0 and will likely be removed in a future release.
[junit4] <<< JVM J1: EOF ----
[...truncated 3 lines...]
[junit4] JVM J0: stderr was not empty, see: /home/jenkins/workspace/Lucene-Solr-7.6-Linux/lucene/build/analysis/morfologik/test/temp/junit4-J0-20181205_085309_58710033960669963676048.syserr
[junit4] >>> JVM J0 emitted unexpected output (verbatim) ----
[junit4] OpenJDK 64-Bit Server VM warning: Option UseConcMarkSweepGC was deprecated in version 9.0 and will likely be removed in a future release.
[junit4] <<< JVM J0: EOF ----
[...truncated 3 lines...]
[junit4] JVM J2: stderr was not empty, see: /home/jenkins/workspace/Lucene-Solr-7.6-Linux/lucene/build/analysis/morfologik/test/temp/junit4-J2-20181205_085309_58718435285614805328296.syserr
[junit4] >>> JVM J2 emitted unexpected output (verbatim) ----
[junit4] OpenJDK 64-Bit Server VM warning: Option UseConcMarkSweepGC was deprecated in version 9.0 and will likely be removed in a future release.
[junit4] <<< JVM J2: EOF ----
[...truncated 204 lines...]
[junit4] JVM J2: stderr was not empty, see: /home/jenkins/workspace/Lucene-Solr-7.6-Linux/lucene/build/analysis/nori/test/temp/junit4-J2-20181205_085313_3431120955523147622933.syserr
[junit4] >>> JVM J2 emitted unexpected output (verbatim) ----
[junit4] OpenJDK 64-Bit Server VM warning: Option UseConcMarkSweepGC was deprecated in version 9.0 and will likely be removed in a future release.
[junit4] <<< JVM J2: EOF ----
[...truncated 3 lines...]
[junit4] JVM J0: stderr was not empty, see: /home/jenkins/workspace/Lucene-Solr-7.6-Linux/lucene/build/analysis/nori/test/temp/junit4-J0-20181205_085313_3428523741519377777582.syserr
[junit4] >>> JVM J0 emitted unexpected output (verbatim) ----
[junit4] OpenJDK 64-Bit Server VM warning: Option UseConcMarkSweepGC was deprecated in version 9.0 and will likely be removed in a future release.
[junit4] <<< JVM J0: EOF ----
[...truncated 6 lines...]
[junit4] JVM J1: stderr was not empty, see: /home/jenkins/workspace/Lucene-Solr-7.6-Linux/lucene/build/analysis/nori/test/temp/junit4-J1-20181205_085313_34213055939680517557324.syserr
[junit4] >>> JVM J1 emitted unexpected output (verbatim) ----
[junit4] OpenJDK 64-Bit Server VM warning: Option UseConcMarkSweepGC was deprecated in version 9.0 and will likely be removed in a future release.
[junit4] <<< JVM J1: EOF ----
[...truncated 174 lines...]
[junit4] JVM J0: stderr was not empty, see: /home/jenkins/workspace/Lucene-Solr-7.6-Linux/lucene/build/analysis/opennlp/test/temp/junit4-J0-20181205_085321_79212511996629758903115.syserr
[junit4] >>> JVM J0 emitted unexpected output (verbatim) ----
[junit4] OpenJDK 64-Bit Server VM warning: Option UseConcMarkSweepGC was deprecated in version 9.0 and will likely be removed in a future release.
[junit4] <<< JVM J0: EOF ----
[junit4] JVM J2: stderr was not empty, see: /home/jenkins/workspace/Lucene-Solr-7.6-Linux/lucene/build/analysis/opennlp/test/temp/junit4-J2-20181205_085321_7925846808717925108308.syserr
[junit4] >>> JVM J2 emitted unexpected output (verbatim) ----
[junit4] OpenJDK 64-Bit Server VM warning: Option UseConcMarkSweepGC was deprecated in version 9.0 and will likely be removed in a future release.
[junit4] <<< JVM J2: EOF ----
[junit4] JVM J1: stderr was not empty, see: /home/jenkins/workspace/Lucene-Solr-7.6-Linux/lucene/build/analysis/opennlp/test/temp/junit4-J1-20181205_085321_7927805012009084667793.syserr
[junit4] >>> JVM J1 emitted unexpected output (verbatim) ----
[junit4] OpenJDK 64-Bit Server VM warning: Option UseConcMarkSweepGC was deprecated in version 9.0 and will likely be removed in a future release.
[junit4] <<< JVM J1: EOF ----
[...truncated 173 lines...]
[junit4] JVM J1: stderr was not empty, see: /home/jenkins/workspace/Lucene-Solr-7.6-Linux/lucene/build/analysis/phonetic/test/temp/junit4-J1-20181205_085324_50116553846330236928204.syserr
[junit4] >>> JVM J1 emitted unexpected output (verbatim) ----
[junit4] OpenJDK 64-Bit Server VM warning: Option UseConcMarkSweepGC was deprecated in version 9.0 and will likely be removed in a future release.
[junit4] <<< JVM J1: EOF ----
[...truncated 6 lines...]
[junit4] JVM J0: stderr was not empty, see: /home/jenkins/workspace/Lucene-Solr-7.6-Linux/lucene/build/analysis/phonetic/test/temp/junit4-J0-20181205_085324_50112724335239128429468.syserr
[junit4] >>> JVM J0 emitted unexpected output (verbatim) ----
[junit4] OpenJDK 64-Bit Server VM warning: Option UseConcMarkSweepGC was deprecated in version 9.0 and will likely be removed in a future release.
[junit4] <<< JVM J0: EOF ----
[...truncated 3 lines...]
[junit4] JVM J2: stderr was not empty, see: /home/jenkins/workspace/Lucene-Solr-7.6-Linux/lucene/build/analysis/phonetic/test/temp/junit4-J2-20181205_085324_50110749388848139912274.syserr
[junit4] >>> JVM J2 emitted unexpected output (verbatim) ----
[junit4] OpenJDK 64-Bit Server VM warning: Option UseConcMarkSweepGC was deprecated in version 9.0 and will likely be removed in a future release.
[junit4] <<< JVM J2: EOF ----
[...truncated 161 lines...]
[junit4] JVM J0: stderr was not empty, see: /home/jenkins/workspace/Lucene-Solr-7.6-Linux/lucene/build/analysis/smartcn/test/temp/junit4-J0-20181205_085335_9735486354825335334045.syserr
[junit4] >>> JVM J0 emitted unexpected output (verbatim) ----
[junit4] OpenJDK 64-Bit Server VM warning: Option UseConcMarkSweepGC was deprecated in version 9.0 and will likely be removed in a future release.
[junit4] <<< JVM J0: EOF ----
[...truncated 3 lines...]
[junit4] JVM J1: stderr was not empty, see: /home/jenkins/workspace/Lucene-Solr-7.6-Linux/lucene/build/analysis/smartcn/test/temp/junit4-J1-20181205_085335_97313088011401695483876.syserr
[junit4] >>> JVM J1 emitted unexpected output (verbatim) ----
[junit4] OpenJDK 64-Bit Server VM warning: Option UseConcMarkSweepGC was deprecated in version 9.0 and will likely be removed in a future release.
[junit4] <<< JVM J1: EOF ----
[...truncated 165 lines...]
[junit4] JVM J1: stderr was not empty, see: /home/jenkins/workspace/Lucene-Solr-7.6-Linux/lucene/build/analysis/stempel/test/temp/junit4-J1-20181205_085342_26910825373494514775377.syserr
[junit4] >>> JVM J1 emitted unexpected output (verbatim) ----
[junit4] OpenJDK 64-Bit Server VM warning: Option UseConcMarkSweepGC was deprecated in version 9.0 and will likely be removed in a future release.
[junit4] <<< JVM J1: EOF ----
[junit4] JVM J2: stderr was not empty, see: /home/jenkins/workspace/Lucene-Solr-7.6-Linux/lucene/build/analysis/stempel/test/temp/junit4-J2-20181205_085342_269871388026223806516.syserr
[junit4] >>> JVM J2 emitted unexpected output (verbatim) ----
[junit4] OpenJDK 64-Bit Server VM warning: Option UseConcMarkSweepGC was deprecated in version 9.0 and will likely be removed in a future release.
[junit4] <<< JVM J2: EOF ----
[...truncated 3 lines...]
[junit4] JVM J0: stderr was not empty, see: /home/jenkins/workspace/Lucene-Solr-7.6-Linux/lucene/build/analysis/stempel/test/temp/junit4-J0-20181205_085342_26912758668974537994045.syserr
[junit4] >>> JVM J0 emitted unexpected output (verbatim) ----
[junit4] OpenJDK 64-Bit Server VM warning: Option UseConcMarkSweepGC was deprecated in version 9.0 and will likely be removed in a future release.
[junit4] <<< JVM J0: EOF ----
[...truncated 198 lines...]
[junit4] JVM J1: stderr was not empty, see: /home/jenkins/workspace/Lucene-Solr-7.6-Linux/lucene/build/backward-codecs/test/temp/junit4-J1-20181205_085345_11018026467556346836494.syserr
[junit4] >>> JVM J1 emitted unexpected output (verbatim) ----
[junit4] OpenJDK 64-Bit Server VM warning: Option UseConcMarkSweepGC was deprecated in version 9.0 and will likely be removed in a future release.
[junit4] <<< JVM J1: EOF ----
[...truncated 22 lines...]
[junit4] JVM J2: stderr was not empty, see: /home/jenkins/workspace/Lucene-Solr-7.6-Linux/lucene/build/backward-codecs/test/temp/junit4-J2-20181205_085345_11017343356959843251974.syserr
[junit4] >>> JVM J2 emitted unexpected output (verbatim) ----
[junit4] OpenJDK 64-Bit Server VM warning: Option UseConcMarkSweepGC was deprecated in version 9.0 and will likely be removed in a future release.
[junit4] <<< JVM J2: EOF ----
[...truncated 14 lines...]
[junit4] JVM J0: stderr was not empty, see: /home/jenkins/workspace/Lucene-Solr-7.6-Linux/lucene/build/backward-codecs/test/temp/junit4-J0-20181205_085345_11017254230812428583427.syserr
[junit4] >>> JVM J0 emitted unexpected output (verbatim) ----
[junit4] OpenJDK 64-Bit Server VM warning: Option UseConcMarkSweepGC was deprecated in version 9.0 and will likely be removed in a future release.
[junit4] <<< JVM J0: EOF ----
[...truncated 1552 lines...]
[junit4] JVM J1: stderr was not empty, see: /home/jenkins/workspace/Lucene-Solr-7.6-Linux/lucene/build/benchmark/test/temp/junit4-J1-20181205_085535_60512367342355504055441.syserr
[junit4] >>> JVM J1 emitted unexpected output (verbatim) ----
[junit4] OpenJDK 64-Bit Server VM warning: Option UseConcMarkSweepGC was deprecated in version 9.0 and will likely be removed in a future release.
[junit4] <<< JVM J1: EOF ----
[...truncated 3 lines...]
[junit4] JVM J2: stderr was not empty, see: /home/jenkins/workspace/Lucene-Solr-7.6-Linux/lucene/build/benchmark/test/temp/junit4-J2-20181205_085535_60514167801565879999574.syserr
[junit4] >>> JVM J2 emitted unexpected output (verbatim) ----
[junit4] OpenJDK 64-Bit Server VM warning: Option UseConcMarkSweepGC was deprecated in version 9.0 and will likely be removed in a future release.
[junit4] <<< JVM J2: EOF ----
[...truncated 6 lines...]
[junit4] JVM J0: stderr was not empty, see: /home/jenkins/workspace/Lucene-Solr-7.6-Linux/lucene/build/benchmark/test/temp/junit4-J0-20181205_085535_6051914466893318076616.syserr
[junit4] >>> JVM J0 emitted unexpected output (verbatim) ----
[junit4] OpenJDK 64-Bit Server VM warning: Option UseConcMarkSweepGC was deprecated in version 9.0 and will likely be removed in a future release.
[junit4] <<< JVM J0: EOF ----
[...truncated 250 lines...]
[junit4] JVM J0: stderr was not empty, see: /home/jenkins/workspace/Lucene-Solr-7.6-Linux/lucene/build/classification/test/temp/junit4-J0-20181205_085543_28413070081269021926461.syserr
[junit4] >>> JVM J0 emitted unexpected output (verbatim) ----
[junit4] OpenJDK 64-Bit Server VM warning: Option UseConcMarkSweepGC was deprecated in version 9.0 and will likely be removed in a future release.
[junit4] <<< JVM J0: EOF ----
[...truncated 3 lines...]
[junit4] JVM J2: stderr was not empty, see: /home/jenkins/workspace/Lucene-Solr-7.6-Linux/lucene/build/classification/test/temp/junit4-J2-20181205_085543_2845304788819362906766.syserr
[junit4] >>> JVM J2 emitted unexpected output (verbatim) ----
[junit4] OpenJDK 64-Bit Server VM warning: Option UseConcMarkSweepGC was deprecated in version 9.0 and will likely be removed in a future release.
[junit4] <<< JVM J2: EOF ----
[...truncated 3 lines...]
[junit4] JVM J1: stderr was not empty, see: /home/jenkins/workspace/Lucene-Solr-7.6-Linux/lucene/build/classification/test/temp/junit4-J1-20181205_085543_28414294022805079143355.syserr
[junit4] >>> JVM J1 emitted unexpected output (verbatim) ----
[junit4] OpenJDK 64-Bit Server VM warning: Option UseConcMarkSweepGC was deprecated in version 9.0 and will likely be removed in a future release.
[junit4] <<< JVM J1: EOF ----
[...truncated 258 lines...]
[junit4] JVM J0: stderr was not empty, see: /home/jenkins/workspace/Lucene-Solr-7.6-Linux/lucene/build/codecs/test/temp/junit4-J0-20181205_085552_5008694724023648502400.syserr
[junit4] >>> JVM J0 emitted unexpected output (verbatim) ----
[junit4] OpenJDK 64-Bit Server VM warning: Option UseConcMarkSweepGC was deprecated in version 9.0 and will likely be removed in a future release.
[junit4] <<< JVM J0: EOF ----
[...truncated 8 lines...]
[junit4] JVM J1: stderr was not empty, see: /home/jenkins/workspace/Lucene-Solr-7.6-Linux/lucene/build/codecs/test/temp/junit4-J1-20181205_085552_5008743641181822031787.syserr
[junit4] >>> JVM J1 emitted unexpected output (verbatim) ----
[junit4] OpenJDK 64-Bit Server VM warning: Option UseConcMarkSweepGC was deprecated in version 9.0 and will likely be removed in a future release.
[junit4] <<< JVM J1: EOF ----
[...truncated 8 lines...]
[junit4] JVM J2: stderr was not empty, see: /home/jenkins/workspace/Lucene-Solr-7.6-Linux/lucene/build/codecs/test/temp/junit4-J2-20181205_085552_5006057619484514925839.syserr
[junit4] >>> JVM J2 emitted unexpected output (verbatim) ----
[junit4] OpenJDK 64-Bit Server VM warning: Option UseConcMarkSweepGC was deprecated in version 9.0 and will likely be removed in a future release.
[junit4] <<< JVM J2: EOF ----
[...truncated 236 lines...]
[junit4] JVM J2: stderr was not empty, see: /home/jenkins/workspace/Lucene-Solr-7.6-Linux/lucene/build/demo/test/temp/junit4-J2-20181205_085759_71415430516722847202576.syserr
[junit4] >>> JVM J2 emitted unexpected output (verbatim) ----
[junit4] OpenJDK 64-Bit Server VM warning: Option UseConcMarkSweepGC was deprecated in version 9.0 and will likely be removed in a future release.
[junit4] <<< JVM J2: EOF ----
[junit4] JVM J0: stderr was not empty, see: /home/jenkins/workspace/Lucene-Solr-7.6-Linux/lucene/build/demo/test/temp/junit4-J0-20181205_085759_7141517077636029834555.syserr
[junit4] >>> JVM J0 emitted unexpected output (verbatim) ----
[junit4] OpenJDK 64-Bit Server VM warning: Option UseConcMarkSweepGC was deprecated in version 9.0 and will likely be removed in a future release.
[junit4] <<< JVM J0: EOF ----
[junit4] JVM J1: stderr was not empty, see: /home/jenkins/workspace/Lucene-Solr-7.6-Linux/lucene/build/demo/test/temp/junit4-J1-20181205_085759_71412635382591408531505.syserr
[junit4] >>> JVM J1 emitted unexpected output (verbatim) ----
[junit4] OpenJDK 64-Bit Server VM warning: Option UseConcMarkSweepGC was deprecated in version 9.0 and will likely be removed in a future release.
[junit4] <<< JVM J1: EOF ----
[...truncated 176 lines...]
[junit4] JVM J0: stderr was not empty, see: /home/jenkins/workspace/Lucene-Solr-7.6-Linux/lucene/build/expressions/test/temp/junit4-J0-20181205_085802_3308657007884710609448.syserr
[junit4] >>> JVM J0 emitted unexpected output (verbatim) ----
[junit4] OpenJDK 64-Bit Server VM warning: Option UseConcMarkSweepGC was deprecated in version 9.0 and will likely be removed in a future release.
[junit4] <<< JVM J0: EOF ----
[junit4] JVM J1: stderr was not empty, see: /home/jenkins/workspace/Lucene-Solr-7.6-Linux/lucene/build/expressions/test/temp/junit4-J1-20181205_085802_33010524561049637921626.syserr
[junit4] >>> JVM J1 emitted unexpected output (verbatim) ----
[junit4] OpenJDK 64-Bit Server VM warning: Option UseConcMarkSweepGC was deprecated in version 9.0 and will likely be removed in a future release.
[junit4] <<< JVM J1: EOF ----
[...truncated 3 lines...]
[junit4] JVM J2: stderr was not empty, see: /home/jenkins/workspace/Lucene-Solr-7.6-Linux/lucene/build/expressions/test/temp/junit4-J2-20181205_085802_3305275869443293060585.syserr
[junit4] >>> JVM J2 emitted unexpected output (verbatim) ----
[junit4] OpenJDK 64-Bit Server VM warning: Option UseConcMarkSweepGC was deprecated in version 9.0 and will likely be removed in a future release.
[junit4] <<< JVM J2: EOF ----
[...truncated 234 lines...]
[junit4] JVM J0: stderr was not empty, see: /home/jenkins/workspace/Lucene-Solr-7.6-Linux/lucene/build/facet/test/temp/junit4-J0-20181205_085807_42715485171934964089762.syserr
[junit4] >>> JVM J0 emitted unexpected output (verbatim) ----
[junit4] OpenJDK 64-Bit Server VM warning: Option UseConcMarkSweepGC was deprecated in version 9.0 and will likely be removed in a future release.
[junit4] <<< JVM J0: EOF ----
[...truncated 3 lines...]
[junit4] JVM J1: stderr was not empty, see: /home/jenkins/workspace/Lucene-Solr-7.6-Linux/lucene/build/facet/test/temp/junit4-J1-20181205_085807_4271939350090709796352.syserr
[junit4] >>> JVM J1 emitted unexpected output (verbatim) ----
[junit4] OpenJDK 64-Bit Server VM warning: Option UseConcMarkSweepGC was deprecated in version 9.0 and will likely be removed in a future release.
[junit4] <<< JVM J1: EOF ----
[...truncated 3 lines...]
[junit4] JVM J2: stderr was not empty, see: /home/jenkins/workspace/Lucene-Solr-7.6-Linux/lucene/build/facet/test/temp/junit4-J2-20181205_085807_42716980910601444445825.syserr
[junit4] >>> JVM J2 emitted unexpected output (verbatim) ----
[junit4] OpenJDK 64-Bit Server VM warning: Option UseConcMarkSweepGC was deprecated in version 9.0 and will likely be removed in a future release.
[junit4] <<< JVM J2: EOF ----
[...truncated 182 lines...]
[junit4] JVM J1: stderr was not empty, see: /home/jenkins/workspace/Lucene-Solr-7.6-Linux/lucene/build/grouping/test/temp/junit4-J1-20181205_085840_64415007772186517908780.syserr
[junit4] >>> JVM J1 emitted unexpected output (verbatim) ----
[junit4] OpenJDK 64-Bit Server VM warning: Option UseConcMarkSweepGC was deprecated in version 9.0 and will likely be removed in a future release.
[junit4] <<< JVM J1: EOF ----
[...truncated 3 lines...]
[junit4] JVM J0: stderr was not empty, see: /home/jenkins/workspace/Lucene-Solr-7.6-Linux/lucene/build/grouping/test/temp/junit4-J0-20181205_085840_6447085137426054993770.syserr
[junit4] >>> JVM J0 emitted unexpected output (verbatim) ----
[junit4] OpenJDK 64-Bit Server VM warning: Option UseConcMarkSweepGC was deprecated in version 9.0 and will likely be removed in a future release.
[junit4] <<< JVM J0: EOF ----
[...truncated 3 lines...]
[junit4] JVM J2: stderr was not empty, see: /home/jenkins/workspace/Lucene-Solr-7.6-Linux/lucene/build/grouping/test/temp/junit4-J2-20181205_085840_6447524758139335879163.syserr
[junit4] >>> JVM J2 emitted unexpected output (verbatim) ----
[junit4] OpenJDK 64-Bit Server VM warning: Option UseConcMarkSweepGC was deprecated in version 9.0 and will likely be removed in a future release.
[junit4] <<< JVM J2: EOF ----
[...truncated 245 lines...]
[junit4] JVM J1: stderr was not empty, see: /home/jenkins/workspace/Lucene-Solr-7.6-Linux/lucene/build/highlighter/test/temp/junit4-J1-20181205_085853_23015969291128734336792.syserr
[junit4] >>> JVM J1 emitted unexpected output (verbatim) ----
[junit4] OpenJDK 64-Bit Server VM warning: Option UseConcMarkSweepGC was deprecated in version 9.0 and will likely be removed in a future release.
[junit4] <<< JVM J1: EOF ----
[junit4] JVM J0: stderr was not empty, see: /home/jenkins/workspace/Lucene-Solr-7.6-Linux/lucene/build/highlighter/test/temp/junit4-J0-20181205_085853_23013376003811074211024.syserr
[junit4] >>> JVM J0 emitted unexpected output (verbatim) ----
[junit4] OpenJDK 64-Bit Server VM warning: Option UseConcMarkSweepGC was deprecated in version 9.0 and will likely be removed in a future release.
[junit4] <<< JVM J0: EOF ----
[...truncated 9 lines...]
[junit4] JVM J2: stderr was not empty, see: /home/jenkins/workspace/Lucene-Solr-7.6-Linux/lucene/build/highlighter/test/temp/junit4-J2-20181205_085853_23015181741583756813444.syserr
[junit4] >>> JVM J2 emitted unexpected output (verbatim) ----
[junit4] OpenJDK 64-Bit Server VM warning: Option UseConcMarkSweepGC was deprecated in version 9.0 and will likely be removed in a future release.
[junit4] <<< JVM J2: EOF ----
[...truncated 163 lines...]
[junit4] JVM J1: stderr was not empty, see: /home/jenkins/workspace/Lucene-Solr-7.6-Linux/lucene/build/join/test/temp/junit4-J1-20181205_085906_9394321520253427126574.syserr
[junit4] >>> JVM J1 emitted unexpected output (verbatim) ----
[junit4] OpenJDK 64-Bit Server VM warning: Option UseConcMarkSweepGC was deprecated in version 9.0 and will likely be removed in a future release.
[junit4] <<< JVM J1: EOF ----
[...truncated 3 lines...]
[junit4] JVM J2: stderr was not empty, see: /home/jenkins/workspace/Lucene-Solr-7.6-Linux/lucene/build/join/test/temp/junit4-J2-20181205_085906_9399727781696226055019.syserr
[junit4] >>> JVM J2 emitted unexpected output (verbatim) ----
[junit4] OpenJDK 64-Bit Server VM warning: Option UseConcMarkSweepGC was deprecated in version 9.0 and will likely be removed in a future release.
[junit4] <<< JVM J2: EOF ----
[...truncated 6 lines...]
[junit4] JVM J0: stderr was not empty, see: /home/jenkins/workspace/Lucene-Solr-7.6-Linux/lucene/build/join/test/temp/junit4-J0-20181205_085906_939229759172002249499.syserr
[junit4] >>> JVM J0 emitted unexpected output (verbatim) ----
[junit4] OpenJDK 64-Bit Server VM warning: Option UseConcMarkSweepGC was deprecated in version 9.0 and will likely be removed in a future release.
[junit4] <<< JVM J0: EOF ----
[...truncated 157 lines...]
[junit4] JVM J0: stderr was not empty, see: /home/jenkins/workspace/Lucene-Solr-7.6-Linux/lucene/build/memory/test/temp/junit4-J0-20181205_085925_47815494054559373090042.syserr
[junit4] >>> JVM J0 emitted unexpected output (verbatim) ----
[junit4] OpenJDK 64-Bit Server VM warning: Option UseConcMarkSweepGC was deprecated in version 9.0 and will likely be removed in a future release.
[junit4] <<< JVM J0: EOF ----
[...truncated 3 lines...]
[junit4] JVM J1: stderr was not empty, see: /home/jenkins/workspace/Lucene-Solr-7.6-Linux/lucene/build/memory/test/temp/junit4-J1-20181205_085925_4781917149807893793839.syserr
[junit4] >>> JVM J1 emitted unexpected output (verbatim) ----
[junit4] OpenJDK 64-Bit Server VM warning: Option UseConcMarkSweepGC was deprecated in version 9.0 and will likely be removed in a future release.
[junit4] <<< JVM J1: EOF ----
[...truncated 189 lines...]
[junit4] JVM J0: stderr was not empty, see: /home/jenkins/workspace/Lucene-Solr-7.6-Linux/lucene/build/misc/test/temp/junit4-J0-20181205_085934_78214040596417645259009.syserr
[junit4] >>> JVM J0 emitted unexpected output (verbatim) ----
[junit4] OpenJDK 64-Bit Server VM warning: Option UseConcMarkSweepGC was deprecated in version 9.0 and will likely be removed in a future release.
[junit4] <<< JVM J0: EOF ----
[...truncated 3 lines...]
[junit4] JVM J1: stderr was not empty, see: /home/jenkins/workspace/Lucene-Solr-7.6-Linux/lucene/build/misc/test/temp/junit4-J1-20181205_085934_7822535886473400900345.syserr
[junit4] >>> JVM J1 emitted unexpected output (verbatim) ----
[junit4] OpenJDK 64-Bit Server VM warning: Option UseConcMarkSweepGC was deprecated in version 9.0 and will likely be removed in a future release.
[junit4] <<< JVM J1: EOF ----
[...truncated 3 lines...]
[junit4] JVM J2: stderr was not empty, see: /home/jenkins/workspace/Lucene-Solr-7.6-Linux/lucene/build/misc/test/temp/junit4-J2-20181205_085934_7827263751168296257965.syserr
[junit4] >>> JVM J2 emitted unexpected output (verbatim) ----
[junit4] OpenJDK 64-Bit Server VM warning: Option UseConcMarkSweepGC was deprecated in version 9.0 and will likely be removed in a future release.
[junit4] <<< JVM J2: EOF ----
[...truncated 338 lines...]
[junit4] JVM J1: stderr was not empty, see: /home/jenkins/workspace/Lucene-Solr-7.6-Linux/lucene/build/queries/test/temp/junit4-J1-20181205_085948_9506634893718354658604.syserr
[junit4] >>> JVM J1 emitted unexpected output (verbatim) ----
[junit4] OpenJDK 64-Bit Server VM warning: Option UseConcMarkSweepGC was deprecated in version 9.0 and will likely be removed in a future release.
[junit4] <<< JVM J1: EOF ----
[...truncated 3 lines...]
[junit4] JVM J2: stderr was not empty, see: /home/jenkins/workspace/Lucene-Solr-7.6-Linux/lucene/build/queries/test/temp/junit4-J2-20181205_085948_9501614276451735659128.syserr
[junit4] >>> JVM J2 emitted unexpected output (verbatim) ----
[junit4] OpenJDK 64-Bit Server VM warning: Option UseConcMarkSweepGC was deprecated in version 9.0 and will likely be removed in a future release.
[junit4] <<< JVM J2: EOF ----
[...truncated 3 lines...]
[junit4] JVM J0: stderr was not empty, see: /home/jenkins/workspace/Lucene-Solr-7.6-Linux/lucene/build/queries/test/temp/junit4-J0-20181205_085948_95016405831199904465402.syserr
[junit4] >>> JVM J0 emitted unexpected output (verbatim) ----
[junit4] OpenJDK 64-Bit Server VM warning: Option UseConcMarkSweepGC was deprecated in version 9.0 and will likely be removed in a future release.
[junit4] <<< JVM J0: EOF ----
[...truncated 237 lines...]
[junit4] JVM J0: stderr was not empty, see: /home/jenkins/workspace/Lucene-Solr-7.6-Linux/lucene/build/queryparser/test/temp/junit4-J0-20181205_085956_58610720043167252681199.syserr
[junit4] >>> JVM J0 emitted unexpected output (verbatim) ----
[junit4] OpenJDK 64-Bit Server VM warning: Option UseConcMarkSweepGC was deprecated in version 9.0 and will likely be removed in a future release.
[junit4] <<< JVM J0: EOF ----
[junit4] JVM J2: stderr was not empty, see: /home/jenkins/workspace/Lucene-Solr-7.6-Linux/lucene/build/queryparser/test/temp/junit4-J2-20181205_085956_5862231281818781669290.syserr
[junit4] >>> JVM J2 emitted unexpected output (verbatim) ----
[junit4] OpenJDK 64-Bit Server VM warning: Option UseConcMarkSweepGC was deprecated in version 9.0 and will likely be removed in a future release.
[junit4] <<< JVM J2: EOF ----
[junit4] JVM J1: stderr was not empty, see: /home/jenkins/workspace/Lucene-Solr-7.6-Linux/lucene/build/queryparser/test/temp/junit4-J1-20181205_085956_5863718070034808457162.syserr
[junit4] >>> JVM J1 emitted unexpected output (verbatim) ----
[junit4] OpenJDK 64-Bit Server VM warning: Option UseConcMarkSweepGC was deprecated in version 9.0 and will likely be removed in a future release.
[junit4] <<< JVM J1: EOF ----
[...truncated 208 lines...]
[junit4] JVM J1: stderr was not empty, see: /home/jenkins/workspace/Lucene-Solr-7.6-Linux/lucene/build/replicator/test/temp/junit4-J1-20181205_090003_25012617238098305313177.syserr
[junit4] >>> JVM J1 emitted unexpected output (verbatim) ----
[junit4] OpenJDK 64-Bit Server VM warning: Option UseConcMarkSweepGC was deprecated in version 9.0 and will likely be removed in a future release.
[junit4] <<< JVM J1: EOF ----
[...truncated 8 lines...]
[junit4] JVM J2: stderr was not empty, see: /home/jenkins/workspace/Lucene-Solr-7.6-Linux/lucene/build/replicator/test/temp/junit4-J2-20181205_090003_2508736419375544029614.syserr
[junit4] >>> JVM J2 emitted unexpected output (verbatim) ----
[junit4] OpenJDK 64-Bit Server VM warning: Option UseConcMarkSweepGC was deprecated in version 9.0 and will likely be removed in a future release.
[junit4] <<< JVM J2: EOF ----
[...truncated 6 lines...]
[junit4] JVM J0: stderr was not empty, see: /home/jenkins/workspace/Lucene-Solr-7.6-Linux/lucene/build/replicator/test/temp/junit4-J0-20181205_090003_25012220621933001184284.syserr
[junit4] >>> JVM J0 emitted unexpected output (verbatim) ----
[junit4] OpenJDK 64-Bit Server VM warning: Option UseConcMarkSweepGC was deprecated in version 9.0 and will likely be removed in a future release.
[junit4] <<< JVM J0: EOF ----
[...truncated 201 lines...]
[junit4] JVM J0: stderr was not empty, see: /home/jenkins/workspace/Lucene-Solr-7.6-Linux/lucene/build/sandbox/test/temp/junit4-J0-20181205_090013_72511736687401149921788.syserr
[junit4] >>> JVM J0 emitted unexpected output (verbatim) ----
[junit4] OpenJDK 64-Bit Server VM warning: Option UseConcMarkSweepGC was deprecated in version 9.0 and will likely be removed in a future release.
[junit4] <<< JVM J0: EOF ----
[...truncated 18 lines...]
[junit4] JVM J2: stderr was not empty, see: /home/jenkins/workspace/Lucene-Solr-7.6-Linux/lucene/build/sandbox/test/temp/junit4-J2-20181205_090013_72516834876130592699452.syserr
[junit4] >>> JVM J2 emitted unexpected output (verbatim) ----
[junit4] OpenJDK 64-Bit Server VM warning: Option UseConcMarkSweepGC was deprecated in version 9.0 and will likely be removed in a future release.
[junit4] <<< JVM J2: EOF ----
[...truncated 7 lines...]
[junit4] JVM J1: stderr was not empty, see: /home/jenkins/workspace/Lucene-Solr-7.6-Linux/lucene/build/sandbox/test/temp/junit4-J1-20181205_090013_7257815729432033709750.syserr
[junit4] >>> JVM J1 emitted unexpected output (verbatim) ----
[junit4] OpenJDK 64-Bit Server VM warning: Option UseConcMarkSweepGC was deprecated in version 9.0 and will likely be removed in a future release.
[junit4] <<< JVM J1: EOF ----
[...truncated 299 lines...]
[junit4] JVM J2: stderr was not empty, see: /home/jenkins/workspace/Lucene-Solr-7.6-Linux/lucene/build/spatial-extras/test/temp/junit4-J2-20181205_090351_0987232865020425824407.syserr
[junit4] >>> JVM J2 emitted unexpected output (verbatim) ----
[junit4] OpenJDK 64-Bit Server VM warning: Option UseConcMarkSweepGC was deprecated in version 9.0 and will likely be removed in a future release.
[junit4] <<< JVM J2: EOF ----
[...truncated 3 lines...]
[junit4] JVM J0: stderr was not empty, see: /home/jenkins/workspace/Lucene-Solr-7.6-Linux/lucene/build/spatial-extras/test/temp/junit4-J0-20181205_090351_09810017099541088320329.syserr
[junit4] >>> JVM J0 emitted unexpected output (verbatim) ----
[junit4] OpenJDK 64-Bit Server VM warning: Option UseConcMarkSweepGC was deprecated in version 9.0 and will likely be removed in a future release.
[junit4] <<< JVM J0: EOF ----
[...truncated 3 lines...]
[junit4] JVM J1: stderr was not empty, see: /home/jenkins/workspace/Lucene-Solr-7.6-Linux/lucene/build/spatial-extras/test/temp/junit4-J1-20181205_090351_09812282201750742895094.syserr
[junit4] >>> JVM J1 emitted unexpected output (verbatim) ----
[junit4] OpenJDK 64-Bit Server VM warning: Option UseConcMarkSweepGC was deprecated in version 9.0 and will likely be removed in a future release.
[junit4] <<< JVM J1: EOF ----
[...truncated 153 lines...]
[junit4] JVM J0: stderr was not empty, see: /home/jenkins/workspace/Lucene-Solr-7.6-Linux/lucene/build/spatial/test/temp/junit4-J0-20181205_090422_7274893676227342931384.syserr
[junit4] >>> JVM J0 emitted unexpected output (verbatim) ----
[junit4] OpenJDK 64-Bit Server VM warning: Option UseConcMarkSweepGC was deprecated in version 9.0 and will likely be removed in a future release.
[junit4] <<< JVM J0: EOF ----
[...truncated 178 lines...]
[junit4] JVM J2: stderr was not empty, see: /home/jenkins/workspace/Lucene-Solr-7.6-Linux/lucene/build/spatial3d/test/temp/junit4-J2-20181205_090424_703546034420175686592.syserr
[junit4] >>> JVM J2 emitted unexpected output (verbatim) ----
[junit4] OpenJDK 64-Bit Server VM warning: Option UseConcMarkSweepGC was deprecated in version 9.0 and will likely be removed in a future release.
[junit4] <<< JVM J2: EOF ----
[...truncated 3 lines...]
[junit4] JVM J0: stderr was not empty, see: /home/jenkins/workspace/Lucene-Solr-7.6-Linux/lucene/build/spatial3d/test/temp/junit4-J0-20181205_090424_70317540513334447584592.syserr
[junit4] >>> JVM J0 emitted unexpected output (verbatim) ----
[junit4] OpenJDK 64-Bit Server VM warning: Option UseConcMarkSweepGC was deprecated in version 9.0 and will likely be removed in a future release.
[junit4] <<< JVM J0: EOF ----
[...truncated 11 lines...]
[junit4] JVM J1: stderr was not empty, see: /home/jenkins/workspace/Lucene-Solr-7.6-Linux/lucene/build/spatial3d/test/temp/junit4-J1-20181205_090424_7036662952009381639398.syserr
[junit4] >>> JVM J1 emitted unexpected output (verbatim) ----
[junit4] OpenJDK 64-Bit Server VM warning: Option UseConcMarkSweepGC was deprecated in version 9.0 and will likely be removed in a future release.
[junit4] <<< JVM J1: EOF ----
[...truncated 258 lines...]
[junit4] JVM J2: stderr was not empty, see: /home/jenkins/workspace/Lucene-Solr-7.6-Linux/lucene/build/suggest/test/temp/junit4-J2-20181205_090524_59215683063254087702083.syserr
[junit4] >>> JVM J2 emitted unexpected output (verbatim) ----
[junit4] OpenJDK 64-Bit Server VM warning: Option UseConcMarkSweepGC was deprecated in version 9.0 and will likely be removed in a future release.
[junit4] <<< JVM J2: EOF ----
[...truncated 6 lines...]
[junit4] JVM J1: stderr was not empty, see: /home/jenkins/workspace/Lucene-Solr-7.6-Linux/lucene/build/suggest/test/temp/junit4-J1-20181205_090524_59011893876857986804665.syserr
[junit4] >>> JVM J1 emitted unexpected output (verbatim) ----
[junit4] OpenJDK 64-Bit Server VM warning: Option UseConcMarkSweepGC was deprecated in version 9.0 and will likely be removed in a future release.
[junit4] <<< JVM J1: EOF ----
[...truncated 3 lines...]
[junit4] JVM J0: stderr was not empty, see: /home/jenkins/workspace/Lucene-Solr-7.6-Linux/lucene/build/suggest/test/temp/junit4-J0-20181205_090524_59012000911613348259730.syserr
[junit4] >>> JVM J0 emitted unexpected output (verbatim) ----
[junit4] OpenJDK 64-Bit Server VM warning: Option UseConcMarkSweepGC was deprecated in version 9.0 and will likely be removed in a future release.
[junit4] <<< JVM J0: EOF ----
[...truncated 2918 lines...]
[junit4] Suite: org.apache.solr.cloud.TestTlogReplica
[junit4] 2> Creating dataDir: /home/jenkins/workspace/Lucene-Solr-7.6-Linux/solr/build/solr-core/test/J1/temp/solr.cloud.TestTlogReplica_5678F9C8765930C5-001/init-core-data-001
[junit4] 2> 790617 WARN (SUITE-TestTlogReplica-seed#[5678F9C8765930C5]-worker) [ ] o.a.s.SolrTestCaseJ4 startTrackingSearchers: numOpens=5 numCloses=5
[junit4] 2> 790617 INFO (SUITE-TestTlogReplica-seed#[5678F9C8765930C5]-worker) [ ] o.a.s.SolrTestCaseJ4 Using PointFields (NUMERIC_POINTS_SYSPROP=true) w/NUMERIC_DOCVALUES_SYSPROP=true
[junit4] 2> 790617 INFO (SUITE-TestTlogReplica-seed#[5678F9C8765930C5]-worker) [ ] o.a.s.SolrTestCaseJ4 Randomized ssl (true) and clientAuth (true) via: @org.apache.solr.util.RandomizeSSL(reason="", ssl=0.0/0.0, value=0.0/0.0, clientAuth=0.0/0.0)
[junit4] 2> 790618 INFO (SUITE-TestTlogReplica-seed#[5678F9C8765930C5]-worker) [ ] o.a.s.SolrTestCaseJ4 SecureRandom sanity checks: test.solr.allowed.securerandom=null & java.security.egd=file:/dev/./urandom
[junit4] 2> 790618 INFO (SUITE-TestTlogReplica-seed#[5678F9C8765930C5]-worker) [ ] o.a.s.c.MiniSolrCloudCluster Starting cluster of 2 servers in /home/jenkins/workspace/Lucene-Solr-7.6-Linux/solr/build/solr-core/test/J1/temp/solr.cloud.TestTlogReplica_5678F9C8765930C5-001/tempDir-001
[junit4] 2> 790618 INFO (SUITE-TestTlogReplica-seed#[5678F9C8765930C5]-worker) [ ] o.a.s.c.ZkTestServer STARTING ZK TEST SERVER
[junit4] 2> 790618 INFO (Thread-1200) [ ] o.a.s.c.ZkTestServer client port:0.0.0.0/0.0.0.0:0
[junit4] 2> 790618 INFO (Thread-1200) [ ] o.a.s.c.ZkTestServer Starting server
[junit4] 2> 790620 ERROR (Thread-1200) [ ] o.a.z.s.ZooKeeperServer ZKShutdownHandler is not registered, so ZooKeeper server won't take any action on ERROR or SHUTDOWN server state changes
[junit4] 2> 790718 INFO (SUITE-TestTlogReplica-seed#[5678F9C8765930C5]-worker) [ ] o.a.s.c.ZkTestServer start zk server on port:34393
[junit4] 2> 790720 INFO (zkConnectionManagerCallback-3562-thread-1) [ ] o.a.s.c.c.ConnectionManager zkClient has connected
[junit4] 2> 790723 INFO (jetty-launcher-3559-thread-2) [ ] o.e.j.s.Server jetty-9.4.11.v20180605; built: 2018-06-05T18:24:03.829Z; git: d5fc0523cfa96bfebfbda19606cad384d772f04c; jvm 10.0.1+10
[junit4] 2> 790723 INFO (jetty-launcher-3559-thread-1) [ ] o.e.j.s.Server jetty-9.4.11.v20180605; built: 2018-06-05T18:24:03.829Z; git: d5fc0523cfa96bfebfbda19606cad384d772f04c; jvm 10.0.1+10
[junit4] 2> 790732 INFO (jetty-launcher-3559-thread-1) [ ] o.e.j.s.session DefaultSessionIdManager workerName=node0
[junit4] 2> 790732 INFO (jetty-launcher-3559-thread-1) [ ] o.e.j.s.session No SessionScavenger set, using defaults
[junit4] 2> 790732 INFO (jetty-launcher-3559-thread-1) [ ] o.e.j.s.session node0 Scavenging every 600000ms
[junit4] 2> 790732 INFO (jetty-launcher-3559-thread-2) [ ] o.e.j.s.session DefaultSessionIdManager workerName=node0
[junit4] 2> 790732 INFO (jetty-launcher-3559-thread-2) [ ] o.e.j.s.session No SessionScavenger set, using defaults
[junit4] 2> 790732 INFO (jetty-launcher-3559-thread-2) [ ] o.e.j.s.session node0 Scavenging every 600000ms
[junit4] 2> 790734 INFO (jetty-launcher-3559-thread-1) [ ] o.e.j.s.h.ContextHandler Started o.e.j.s.ServletContextHandler@4e78187c{/solr,null,AVAILABLE}
[junit4] 2> 790734 INFO (jetty-launcher-3559-thread-2) [ ] o.e.j.s.h.ContextHandler Started o.e.j.s.ServletContextHandler@52ee8f13{/solr,null,AVAILABLE}
[junit4] 2> 790736 INFO (jetty-launcher-3559-thread-1) [ ] o.e.j.s.AbstractConnector Started ServerConnector@1b98ca06{SSL,[ssl, http/1.1]}{127.0.0.1:41907}
[junit4] 2> 790736 INFO (jetty-launcher-3559-thread-2) [ ] o.e.j.s.AbstractConnector Started ServerConnector@19218f73{SSL,[ssl, http/1.1]}{127.0.0.1:42713}
[junit4] 2> 790736 INFO (jetty-launcher-3559-thread-1) [ ] o.e.j.s.Server Started @790757ms
[junit4] 2> 790736 INFO (jetty-launcher-3559-thread-2) [ ] o.e.j.s.Server Started @790757ms
[junit4] 2> 790736 INFO (jetty-launcher-3559-thread-2) [ ] o.a.s.c.s.e.JettySolrRunner Jetty properties: {hostContext=/solr, hostPort=42713}
[junit4] 2> 790736 INFO (jetty-launcher-3559-thread-1) [ ] o.a.s.c.s.e.JettySolrRunner Jetty properties: {hostContext=/solr, hostPort=41907}
[junit4] 2> 790737 ERROR (jetty-launcher-3559-thread-2) [ ] o.a.s.u.StartupLoggingUtils Missing Java Option solr.log.dir. Logging may be missing or incomplete.
[junit4] 2> 790737 ERROR (jetty-launcher-3559-thread-1) [ ] o.a.s.u.StartupLoggingUtils Missing Java Option solr.log.dir. Logging may be missing or incomplete.
[junit4] 2> 790737 INFO (jetty-launcher-3559-thread-2) [ ] o.a.s.s.SolrDispatchFilter Using logger factory org.apache.logging.slf4j.Log4jLoggerFactory
[junit4] 2> 790737 INFO (jetty-launcher-3559-thread-1) [ ] o.a.s.s.SolrDispatchFilter Using logger factory org.apache.logging.slf4j.Log4jLoggerFactory
[junit4] 2> 790737 INFO (jetty-launcher-3559-thread-2) [ ] o.a.s.s.SolrDispatchFilter ___ _ Welcome to Apache Solr™ version 7.6.0
[junit4] 2> 790737 INFO (jetty-launcher-3559-thread-1) [ ] o.a.s.s.SolrDispatchFilter ___ _ Welcome to Apache Solr™ version 7.6.0
[junit4] 2> 790737 INFO (jetty-launcher-3559-thread-2) [ ] o.a.s.s.SolrDispatchFilter / __| ___| |_ _ Starting in cloud mode on port null
[junit4] 2> 790737 INFO (jetty-launcher-3559-thread-1) [ ] o.a.s.s.SolrDispatchFilter / __| ___| |_ _ Starting in cloud mode on port null
[junit4] 2> 790737 INFO (jetty-launcher-3559-thread-2) [ ] o.a.s.s.SolrDispatchFilter \__ \/ _ \ | '_| Install dir: null
[junit4] 2> 790737 INFO (jetty-launcher-3559-thread-1) [ ] o.a.s.s.SolrDispatchFilter \__ \/ _ \ | '_| Install dir: null
[junit4] 2> 790737 INFO (jetty-launcher-3559-thread-2) [ ] o.a.s.s.SolrDispatchFilter |___/\___/_|_| Start time: 2018-12-05T09:19:30.240191Z
[junit4] 2> 790737 INFO (jetty-launcher-3559-thread-1) [ ] o.a.s.s.SolrDispatchFilter |___/\___/_|_| Start time: 2018-12-05T09:19:30.240199Z
[junit4] 2> 790742 INFO (zkConnectionManagerCallback-3566-thread-1) [ ] o.a.s.c.c.ConnectionManager zkClient has connected
[junit4] 2> 790742 INFO (zkConnectionManagerCallback-3565-thread-1) [ ] o.a.s.c.c.ConnectionManager zkClient has connected
[junit4] 2> 790742 INFO (jetty-launcher-3559-thread-2) [ ] o.a.s.s.SolrDispatchFilter solr.xml found in ZooKeeper. Loading...
[junit4] 2> 790742 INFO (jetty-launcher-3559-thread-1) [ ] o.a.s.s.SolrDispatchFilter solr.xml found in ZooKeeper. Loading...
[junit4] 2> 790807 INFO (jetty-launcher-3559-thread-2) [ ] o.a.s.c.ZkContainer Zookeeper client=127.0.0.1:34393/solr
[junit4] 2> 790808 INFO (zkConnectionManagerCallback-3570-thread-1) [ ] o.a.s.c.c.ConnectionManager zkClient has connected
[junit4] 2> 790810 INFO (zkConnectionManagerCallback-3572-thread-1) [ ] o.a.s.c.c.ConnectionManager zkClient has connected
[junit4] 2> 790829 INFO (jetty-launcher-3559-thread-1) [ ] o.a.s.c.ZkContainer Zookeeper client=127.0.0.1:34393/solr
[junit4] 2> 790836 INFO (zkConnectionManagerCallback-3578-thread-1) [ ] o.a.s.c.c.ConnectionManager zkClient has connected
[junit4] 2> 790841 INFO (zkConnectionManagerCallback-3580-thread-1) [ ] o.a.s.c.c.ConnectionManager zkClient has connected
[junit4] 2> 790851 INFO (jetty-launcher-3559-thread-1) [n:127.0.0.1:41907_solr ] o.a.s.c.OverseerElectionContext I am going to be the leader 127.0.0.1:41907_solr
[junit4] 2> 790852 INFO (jetty-launcher-3559-thread-1) [n:127.0.0.1:41907_solr ] o.a.s.c.Overseer Overseer (id=72140558253621254-127.0.0.1:41907_solr-n_0000000000) starting
[junit4] 2> 790855 INFO (jetty-launcher-3559-thread-2) [n:127.0.0.1:42713_solr ] o.a.s.c.ZkController Register node as live in ZooKeeper:/live_nodes/127.0.0.1:42713_solr
[junit4] 2> 790863 INFO (zkCallback-3571-thread-1) [ ] o.a.s.c.c.ZkStateReader Updated live nodes from ZooKeeper... (0) -> (1)
[junit4] 2> 790863 INFO (zkCallback-3579-thread-1) [ ] o.a.s.c.c.ZkStateReader Updated live nodes from ZooKeeper... (0) -> (1)
[junit4] 2> 790868 INFO (zkConnectionManagerCallback-3587-thread-1) [ ] o.a.s.c.c.ConnectionManager zkClient has connected
[junit4] 2> 790869 INFO (jetty-launcher-3559-thread-1) [n:127.0.0.1:41907_solr ] o.a.s.c.c.ZkStateReader Updated live nodes from ZooKeeper... (0) -> (1)
[junit4] 2> 790870 INFO (jetty-launcher-3559-thread-1) [n:127.0.0.1:41907_solr ] o.a.s.c.s.i.ZkClientClusterStateProvider Cluster at 127.0.0.1:34393/solr ready
[junit4] 2> 790873 INFO (OverseerStateUpdate-72140558253621254-127.0.0.1:41907_solr-n_0000000000) [n:127.0.0.1:41907_solr ] o.a.s.c.Overseer Starting to work on the main queue : 127.0.0.1:41907_solr
[junit4] 2> 790880 INFO (zkConnectionManagerCallback-3592-thread-1) [ ] o.a.s.c.c.ConnectionManager zkClient has connected
[junit4] 2> 790882 INFO (jetty-launcher-3559-thread-2) [n:127.0.0.1:42713_solr ] o.a.s.c.c.ZkStateReader Updated live nodes from ZooKeeper... (0) -> (1)
[junit4] 2> 790882 INFO (jetty-launcher-3559-thread-1) [n:127.0.0.1:41907_solr ] o.a.s.c.TransientSolrCoreCacheDefault Allocating transient cache for 2147483647 transient cores
[junit4] 2> 790882 INFO (jetty-launcher-3559-thread-1) [n:127.0.0.1:41907_solr ] o.a.s.c.ZkController Register node as live in ZooKeeper:/live_nodes/127.0.0.1:41907_solr
[junit4] 2> 790885 INFO (jetty-launcher-3559-thread-2) [n:127.0.0.1:42713_solr ] o.a.s.c.s.i.ZkClientClusterStateProvider Cluster at 127.0.0.1:34393/solr ready
[junit4] 2> 790885 INFO (zkCallback-3571-thread-1) [ ] o.a.s.c.c.ZkStateReader Updated live nodes from ZooKeeper... (1) -> (2)
[junit4] 2> 790885 INFO (zkCallback-3579-thread-1) [ ] o.a.s.c.c.ZkStateReader Updated live nodes from ZooKeeper... (1) -> (2)
[junit4] 2> 790893 INFO (zkCallback-3591-thread-1) [ ] o.a.s.c.c.ZkStateReader Updated live nodes from ZooKeeper... (1) -> (2)
[junit4] 2> 790904 INFO (jetty-launcher-3559-thread-2) [n:127.0.0.1:42713_solr ] o.a.s.h.a.MetricsHistoryHandler No .system collection, keeping metrics history in memory.
[junit4] 2> 790908 INFO (jetty-launcher-3559-thread-1) [n:127.0.0.1:41907_solr ] o.a.s.h.a.MetricsHistoryHandler No .system collection, keeping metrics history in memory.
[junit4] 2> 790925 INFO (jetty-launcher-3559-thread-2) [n:127.0.0.1:42713_solr ] o.a.s.m.r.SolrJmxReporter JMX monitoring for 'solr_42713.solr.node' (registry 'solr.node') enabled at server: com.sun.jmx.mbeanserver.JmxMBeanServer@5cba559b
[junit4] 2> 790927 INFO (zkCallback-3586-thread-1) [ ] o.a.s.c.c.ZkStateReader Updated live nodes from ZooKeeper... (1) -> (2)
[junit4] 2> 790934 INFO (jetty-launcher-3559-thread-2) [n:127.0.0.1:42713_solr ] o.a.s.m.r.SolrJmxReporter JMX monitoring for 'solr_42713.solr.jvm' (registry 'solr.jvm') enabled at server: com.sun.jmx.mbeanserver.JmxMBeanServer@5cba559b
[junit4] 2> 790934 INFO (jetty-launcher-3559-thread-2) [n:127.0.0.1:42713_solr ] o.a.s.m.r.SolrJmxReporter JMX monitoring for 'solr_42713.solr.jetty' (registry 'solr.jetty') enabled at server: com.sun.jmx.mbeanserver.JmxMBeanServer@5cba559b
[junit4] 2> 790936 INFO (jetty-launcher-3559-thread-2) [n:127.0.0.1:42713_solr ] o.a.s.c.CorePropertiesLocator Found 0 core definitions underneath /home/jenkins/workspace/Lucene-Solr-7.6-Linux/solr/build/solr-core/test/J1/temp/solr.cloud.TestTlogReplica_5678F9C8765930C5-001/tempDir-001/node2/.
[junit4] 2> 790936 INFO (jetty-launcher-3559-thread-1) [n:127.0.0.1:41907_solr ] o.a.s.m.r.SolrJmxReporter JMX monitoring for 'solr_41907.solr.node' (registry 'solr.node') enabled at server: com.sun.jmx.mbeanserver.JmxMBeanServer@5cba559b
[junit4] 2> 790941 INFO (jetty-launcher-3559-thread-1) [n:127.0.0.1:41907_solr ] o.a.s.m.r.SolrJmxReporter JMX monitoring for 'solr_41907.solr.jvm' (registry 'solr.jvm') enabled at server: com.sun.jmx.mbeanserver.JmxMBeanServer@5cba559b
[junit4] 2> 790941 INFO (jetty-launcher-3559-thread-1) [n:127.0.0.1:41907_solr ] o.a.s.m.r.SolrJmxReporter JMX monitoring for 'solr_41907.solr.jetty' (registry 'solr.jetty') enabled at server: com.sun.jmx.mbeanserver.JmxMBeanServer@5cba559b
[junit4] 2> 790941 INFO (jetty-launcher-3559-thread-1) [n:127.0.0.1:41907_solr ] o.a.s.c.CorePropertiesLocator Found 0 core definitions underneath /home/jenkins/workspace/Lucene-Solr-7.6-Linux/solr/build/solr-core/test/J1/temp/solr.cloud.TestTlogReplica_5678F9C8765930C5-001/tempDir-001/node1/.
[junit4] 2> 790967 INFO (zkConnectionManagerCallback-3596-thread-1) [ ] o.a.s.c.c.ConnectionManager zkClient has connected
[junit4] 2> 790979 INFO (zkConnectionManagerCallback-3601-thread-1) [ ] o.a.s.c.c.ConnectionManager zkClient has connected
[junit4] 2> 790980 INFO (SUITE-TestTlogReplica-seed#[5678F9C8765930C5]-worker) [ ] o.a.s.c.c.ZkStateReader Updated live nodes from ZooKeeper... (0) -> (2)
[junit4] 2> 790980 INFO (SUITE-TestTlogReplica-seed#[5678F9C8765930C5]-worker) [ ] o.a.s.c.s.i.ZkClientClusterStateProvider Cluster at 127.0.0.1:34393/solr ready
[junit4] 2> 790982 INFO (SUITE-TestTlogReplica-seed#[5678F9C8765930C5]-worker) [ ] o.a.s.c.TestTlogReplica Using legacyCloud?: false
[junit4] 2> 790992 INFO (qtp412150155-7636) [n:127.0.0.1:42713_solr ] o.a.s.h.a.CollectionsHandler Invoked Collection Action :clusterprop with params val=false&name=legacyCloud&action=CLUSTERPROP&wt=javabin&version=2 and sendToOCPQueue=true
[junit4] 2> 790993 INFO (qtp412150155-7636) [n:127.0.0.1:42713_solr ] o.a.s.s.HttpSolrCall [admin] webapp=null path=/admin/collections params={val=false&name=legacyCloud&action=CLUSTERPROP&wt=javabin&version=2} status=0 QTime=0
[junit4] 2> 791001 INFO (TEST-TestTlogReplica.testOnlyLeaderIndexes-seed#[5678F9C8765930C5]) [ ] o.a.s.SolrTestCaseJ4 ###Starting testOnlyLeaderIndexes
[junit4] 2> 791002 INFO (qtp412150155-7638) [n:127.0.0.1:42713_solr ] o.a.s.h.a.CollectionsHandler Invoked Collection Action :create with params pullReplicas=0&collection.configName=conf&maxShardsPerNode=100&name=tlog_replica_test_only_leader_indexes&nrtReplicas=0&action=CREATE&numShards=1&tlogReplicas=2&wt=javabin&version=2 and sendToOCPQueue=true
[junit4] 2> 791003 INFO (OverseerThreadFactory-2274-thread-1-processing-n:127.0.0.1:41907_solr) [n:127.0.0.1:41907_solr ] o.a.s.c.a.c.CreateCollectionCmd Create collection tlog_replica_test_only_leader_indexes
[junit4] 2> 791109 INFO (qtp412150155-7642) [n:127.0.0.1:42713_solr ] o.a.s.s.HttpSolrCall [admin] webapp=null path=/admin/metrics params={prefix=CONTAINER.fs.usableSpace,CONTAINER.fs.totalSpace,CORE.coreName&wt=javabin&version=2&group=solr.node,solr.core} status=0 QTime=0
[junit4] 2> 791121 INFO (qtp1802682154-7639) [n:127.0.0.1:41907_solr ] o.a.s.s.HttpSolrCall [admin] webapp=null path=/admin/metrics params={prefix=CONTAINER.fs.usableSpace,CONTAINER.fs.totalSpace,CORE.coreName&wt=javabin&version=2&group=solr.node,solr.core} status=0 QTime=0
[junit4] 2> 791124 INFO (OverseerStateUpdate-72140558253621254-127.0.0.1:41907_solr-n_0000000000) [n:127.0.0.1:41907_solr ] o.a.s.c.o.SliceMutator createReplica() {
[junit4] 2> "operation":"ADDREPLICA",
[junit4] 2> "collection":"tlog_replica_test_only_leader_indexes",
[junit4] 2> "shard":"shard1",
[junit4] 2> "core":"tlog_replica_test_only_leader_indexes_shard1_replica_t1",
[junit4] 2> "state":"down",
[junit4] 2> "base_url":"https://127.0.0.1:41907/solr",
[junit4] 2> "type":"TLOG",
[junit4] 2> "waitForFinalState":"false"}
[junit4] 2> 791124 INFO (OverseerStateUpdate-72140558253621254-127.0.0.1:41907_solr-n_0000000000) [n:127.0.0.1:41907_solr ] o.a.s.c.o.SliceMutator createReplica() {
[junit4] 2> "operation":"ADDREPLICA",
[junit4] 2> "collection":"tlog_replica_test_only_leader_indexes",
[junit4] 2> "shard":"shard1",
[junit4] 2> "core":"tlog_replica_test_only_leader_indexes_shard1_replica_t2",
[junit4] 2> "state":"down",
[junit4] 2> "base_url":"https://127.0.0.1:42713/solr",
[junit4] 2> "type":"TLOG",
[junit4] 2> "waitForFinalState":"false"}
[junit4] 2> 791328 INFO (qtp412150155-7629) [n:127.0.0.1:42713_solr x:tlog_replica_test_only_leader_indexes_shard1_replica_t2] o.a.s.h.a.CoreAdminOperation core create command qt=/admin/cores&coreNodeName=core_node4&collection.configName=conf&newCollection=true&name=tlog_replica_test_only_leader_indexes_shard1_replica_t2&action=CREATE&numShards=1&collection=tlog_replica_test_only_leader_indexes&shard=shard1&wt=javabin&version=2&replicaType=TLOG
[junit4] 2> 791328 INFO (qtp412150155-7629) [n:127.0.0.1:42713_solr x:tlog_replica_test_only_leader_indexes_shard1_replica_t2] o.a.s.c.TransientSolrCoreCacheDefault Allocating transient cache for 2147483647 transient cores
[junit4] 2> 791329 INFO (qtp1802682154-7641) [n:127.0.0.1:41907_solr x:tlog_replica_test_only_leader_indexes_shard1_replica_t1] o.a.s.h.a.CoreAdminOperation core create command qt=/admin/cores&coreNodeName=core_node3&collection.configName=conf&newCollection=true&name=tlog_replica_test_only_leader_indexes_shard1_replica_t1&action=CREATE&numShards=1&collection=tlog_replica_test_only_leader_indexes&shard=shard1&wt=javabin&version=2&replicaType=TLOG
[junit4] 2> 792339 INFO (qtp412150155-7629) [n:127.0.0.1:42713_solr c:tlog_replica_test_only_leader_indexes s:shard1 r:core_node4 x:tlog_replica_test_only_leader_indexes_shard1_replica_t2] o.a.s.c.SolrConfig Using Lucene MatchVersion: 7.6.0
[junit4] 2> 792339 INFO (qtp1802682154-7641) [n:127.0.0.1:41907_solr c:tlog_replica_test_only_leader_indexes s:shard1 r:core_node3 x:tlog_replica_test_only_leader_indexes_shard1_replica_t1] o.a.s.c.SolrConfig Using Lucene MatchVersion: 7.6.0
[junit4] 2> 792345 INFO (qtp412150155-7629) [n:127.0.0.1:42713_solr c:tlog_replica_test_only_leader_indexes s:shard1 r:core_node4 x:tlog_replica_test_only_leader_indexes_shard1_replica_t2] o.a.s.s.IndexSchema [tlog_replica_test_only_leader_indexes_shard1_replica_t2] Schema name=minimal
[junit4] 2> 792345 INFO (qtp1802682154-7641) [n:127.0.0.1:41907_solr c:tlog_replica_test_only_leader_indexes s:shard1 r:core_node3 x:tlog_replica_test_only_leader_indexes_shard1_replica_t1] o.a.s.s.IndexSchema [tlog_replica_test_only_leader_indexes_shard1_replica_t1] Schema name=minimal
[junit4] 2> 792346 INFO (qtp412150155-7629) [n:127.0.0.1:42713_solr c:tlog_replica_test_only_leader_indexes s:shard1 r:core_node4 x:tlog_replica_test_only_leader_indexes_shard1_replica_t2] o.a.s.s.IndexSchema Loaded schema minimal/1.1 with uniqueid field id
[junit4] 2> 792346 INFO (qtp1802682154-7641) [n:127.0.0.1:41907_solr c:tlog_replica_test_only_leader_indexes s:shard1 r:core_node3 x:tlog_replica_test_only_leader_indexes_shard1_replica_t1] o.a.s.s.IndexSchema Loaded schema minimal/1.1 with uniqueid field id
[junit4] 2> 792347 INFO (qtp1802682154-7641) [n:127.0.0.1:41907_solr c:tlog_replica_test_only_leader_indexes s:shard1 r:core_node3 x:tlog_replica_test_only_leader_indexes_shard1_replica_t1] o.a.s.c.CoreContainer Creating SolrCore 'tlog_replica_test_only_leader_indexes_shard1_replica_t1' using configuration from collection tlog_replica_test_only_leader_indexes, trusted=true
[junit4] 2> 792347 INFO (qtp412150155-7629) [n:127.0.0.1:42713_solr c:tlog_replica_test_only_leader_indexes s:shard1 r:core_node4 x:tlog_replica_test_only_leader_indexes_shard1_replica_t2] o.a.s.c.CoreContainer Creating SolrCore 'tlog_replica_test_only_leader_indexes_shard1_replica_t2' using configuration from collection tlog_replica_test_only_leader_indexes, trusted=true
[junit4] 2> 792347 INFO (qtp1802682154-7641) [n:127.0.0.1:41907_solr c:tlog_replica_test_only_leader_indexes s:shard1 r:core_node3 x:tlog_replica_test_only_leader_indexes_shard1_replica_t1] o.a.s.m.r.SolrJmxReporter JMX monitoring for 'solr_41907.solr.core.tlog_replica_test_only_leader_indexes.shard1.replica_t1' (registry 'solr.core.tlog_replica_test_only_leader_indexes.shard1.replica_t1') enabled at server: com.sun.jmx.mbeanserver.JmxMBeanServer@5cba559b
[junit4] 2> 792347 INFO (qtp412150155-7629) [n:127.0.0.1:42713_solr c:tlog_replica_test_only_leader_indexes s:shard1 r:core_node4 x:tlog_replica_test_only_leader_indexes_shard1_replica_t2] o.a.s.m.r.SolrJmxReporter JMX monitoring for 'solr_42713.solr.core.tlog_replica_test_only_leader_indexes.shard1.replica_t2' (registry 'solr.core.tlog_replica_test_only_leader_indexes.shard1.replica_t2') enabled at server: com.sun.jmx.mbeanserver.JmxMBeanServer@5cba559b
[junit4] 2> 792347 INFO (qtp412150155-7629) [n:127.0.0.1:42713_solr c:tlog_replica_test_only_leader_indexes s:shard1 r:core_node4 x:tlog_replica_test_only_leader_indexes_shard1_replica_t2] o.a.s.c.SolrCore [[tlog_replica_test_only_leader_indexes_shard1_replica_t2] ] Opening new SolrCore at [/home/jenkins/workspace/Lucene-Solr-7.6-Linux/solr/build/solr-core/test/J1/temp/solr.cloud.TestTlogReplica_5678F9C8765930C5-001/tempDir-001/node2/tlog_replica_test_only_leader_indexes_shard1_replica_t2], dataDir=[/home/jenkins/workspace/Lucene-Solr-7.6-Linux/solr/build/solr-core/test/J1/temp/solr.cloud.TestTlogReplica_5678F9C8765930C5-001/tempDir-001/node2/./tlog_replica_test_only_leader_indexes_shard1_replica_t2/data/]
[junit4] 2> 792347 INFO (qtp1802682154-7641) [n:127.0.0.1:41907_solr c:tlog_replica_test_only_leader_indexes s:shard1 r:core_node3 x:tlog_replica_test_only_leader_indexes_shard1_replica_t1] o.a.s.c.SolrCore [[tlog_replica_test_only_leader_indexes_shard1_replica_t1] ] Opening new SolrCore at [/home/jenkins/workspace/Lucene-Solr-7.6-Linux/solr/build/solr-core/test/J1/temp/solr.cloud.TestTlogReplica_5678F9C8765930C5-001/tempDir-001/node1/tlog_replica_test_only_leader_indexes_shard1_replica_t1], dataDir=[/home/jenkins/workspace/Lucene-Solr-7.6-Linux/solr/build/solr-core/test/J1/temp/solr.cloud.TestTlogReplica_5678F9C8765930C5-001/tempDir-001/node1/./tlog_replica_test_only_leader_indexes_shard1_replica_t1/data/]
[junit4] 2> 792385 INFO (qtp412150155-7629) [n:127.0.0.1:42713_solr c:tlog_replica_test_only_leader_indexes s:shard1 r:core_node4 x:tlog_replica_test_only_leader_indexes_shard1_replica_t2] o.a.s.u.UpdateHandler Using UpdateLog implementation: org.apache.solr.update.UpdateLog
[junit4] 2> 792385 INFO (qtp1802682154-7641) [n:127.0.0.1:41907_solr c:tlog_replica_test_only_leader_indexes s:shard1 r:core_node3 x:tlog_replica_test_only_leader_indexes_shard1_replica_t1] o.a.s.u.UpdateHandler Using UpdateLog implementation: org.apache.solr.update.UpdateLog
[junit4] 2> 792385 INFO (qtp412150155-7629) [n:127.0.0.1:42713_solr c:tlog_replica_test_only_leader_indexes s:shard1 r:core_node4 x:tlog_replica_test_only_leader_indexes_shard1_replica_t2] o.a.s.u.UpdateLog Initializing UpdateLog: dataDir=null defaultSyncLevel=FLUSH numRecordsToKeep=100 maxNumLogsToKeep=10 numVersionBuckets=65536
[junit4] 2> 792385 INFO (qtp1802682154-7641) [n:127.0.0.1:41907_solr c:tlog_replica_test_only_leader_indexes s:shard1 r:core_node3 x:tlog_replica_test_only_leader_indexes_shard1_replica_t1] o.a.s.u.UpdateLog Initializing UpdateLog: dataDir=null defaultSyncLevel=FLUSH numRecordsToKeep=100 maxNumLogsToKeep=10 numVersionBuckets=65536
[junit4] 2> 792387 INFO (qtp1802682154-7641) [n:127.0.0.1:41907_solr c:tlog_replica_test_only_leader_indexes s:shard1 r:core_node3 x:tlog_replica_test_only_leader_indexes_shard1_replica_t1] o.a.s.u.CommitTracker Hard AutoCommit: disabled
[junit4] 2> 792387 INFO (qtp412150155-7629) [n:127.0.0.1:42713_solr c:tlog_replica_test_only_leader_indexes s:shard1 r:core_node4 x:tlog_replica_test_only_leader_indexes_shard1_replica_t2] o.a.s.u.CommitTracker Hard AutoCommit: disabled
[junit4] 2> 792387 INFO (qtp1802682154-7641) [n:127.0.0.1:41907_solr c:tlog_replica_test_only_leader_indexes s:shard1 r:core_node3 x:tlog_replica_test_only_leader_indexes_shard1_replica_t1] o.a.s.u.CommitTracker Soft AutoCommit: disabled
[junit4] 2> 792387 INFO (qtp412150155-7629) [n:127.0.0.1:42713_solr c:tlog_replica_test_only_leader_indexes s:shard1 r:core_node4 x:tlog_replica_test_only_leader_indexes_shard1_replica_t2] o.a.s.u.CommitTracker Soft AutoCommit: disabled
[junit4] 2> 792388 INFO (qtp1802682154-7641) [n:127.0.0.1:41907_solr c:tlog_replica_test_only_leader_indexes s:shard1 r:core_node3 x:tlog_replica_test_only_leader_indexes_shard1_replica_t1] o.a.s.s.SolrIndexSearcher Opening [Searcher@9941fe9[tlog_replica_test_only_leader_indexes_shard1_replica_t1] main]
[junit4] 2> 792388 INFO (qtp412150155-7629) [n:127.0.0.1:42713_solr c:tlog_replica_test_only_leader_indexes s:shard1 r:core_node4 x:tlog_replica_test_only_leader_indexes_shard1_replica_t2] o.a.s.s.SolrIndexSearcher Opening [Searcher@30371628[tlog_replica_test_only_leader_indexes_shard1_replica_t2] main]
[junit4] 2> 792389 INFO (qtp1802682154-7641) [n:127.0.0.1:41907_solr c:tlog_replica_test_only_leader_indexes s:shard1 r:core_node3 x:tlog_replica_test_only_leader_indexes_shard1_replica_t1] o.a.s.r.ManagedResourceStorage Configured ZooKeeperStorageIO with znodeBase: /configs/conf
[junit4] 2> 792389 INFO (qtp412150155-7629) [n:127.0.0.1:42713_solr c:tlog_replica_test_only_leader_indexes s:shard1 r:core_node4 x:tlog_replica_test_only_leader_indexes_shard1_replica_t2] o.a.s.r.ManagedResourceStorage Configured ZooKeeperStorageIO with znodeBase: /configs/conf
[junit4] 2> 792389 INFO (qtp1802682154-7641) [n:127.0.0.1:41907_solr c:tlog_replica_test_only_leader_indexes s:shard1 r:core_node3 x:tlog_replica_test_only_leader_indexes_shard1_replica_t1] o.a.s.r.ManagedResourceStorage Loaded null at path _rest_managed.json using ZooKeeperStorageIO:path=/configs/conf
[junit4] 2> 792389 INFO (qtp412150155-7629) [n:127.0.0.1:42713_solr c:tlog_replica_test_only_leader_indexes s:shard1 r:core_node4 x:tlog_replica_test_only_leader_indexes_shard1_replica_t2] o.a.s.r.ManagedResourceStorage Loaded null at path _rest_managed.json using ZooKeeperStorageIO:path=/configs/conf
[junit4] 2> 792389 INFO (qtp1802682154-7641) [n:127.0.0.1:41907_solr c:tlog_replica_test_only_leader_indexes s:shard1 r:core_node3 x:tlog_replica_test_only_leader_indexes_shard1_replica_t1] o.a.s.h.ReplicationHandler Commits will be reserved for 10000ms.
[junit4] 2> 792389 INFO (qtp1802682154-7641) [n:127.0.0.1:41907_solr c:tlog_replica_test_only_leader_indexes s:shard1 r:core_node3 x:tlog_replica_test_only_leader_indexes_shard1_replica_t1] o.a.s.u.UpdateLog Could not find max version in index or recent updates, using new clock 1619002992248225792
[junit4] 2> 792390 INFO (qtp412150155-7629) [n:127.0.0.1:42713_solr c:tlog_replica_test_only_leader_indexes s:shard1 r:core_node4 x:tlog_replica_test_only_leader_indexes_shard1_replica_t2] o.a.s.h.ReplicationHandler Commits will be reserved for 10000ms.
[junit4] 2> 792390 INFO (qtp412150155-7629) [n:127.0.0.1:42713_solr c:tlog_replica_test_only_leader_indexes s:shard1 r:core_node4 x:tlog_replica_test_only_leader_indexes_shard1_replica_t2] o.a.s.u.UpdateLog Could not find max version in index or recent updates, using new clock 1619002992249274368
[junit4] 2> 792390 INFO (searcherExecutor-2283-thread-1-processing-n:127.0.0.1:41907_solr x:tlog_replica_test_only_leader_indexes_shard1_replica_t1 c:tlog_replica_test_only_leader_indexes s:shard1 r:core_node3) [n:127.0.0.1:41907_solr c:tlog_replica_test_only_leader_indexes s:shard1 r:core_node3 x:tlog_replica_test_only_leader_indexes_shard1_replica_t1] o.a.s.c.SolrCore [tlog_replica_test_only_leader_indexes_shard1_replica_t1] Registered new searcher Searcher@9941fe9[tlog_replica_test_only_leader_indexes_shard1_replica_t1] main{ExitableDirectoryReader(UninvertingDirectoryReader())}
[junit4] 2> 792390 INFO (searcherExecutor-2282-thread-1-processing-n:127.0.0.1:42713_solr x:tlog_replica_test_only_leader_indexes_shard1_replica_t2 c:tlog_replica_test_only_leader_indexes s:shard1 r:core_node4) [n:127.0.0.1:42713_solr c:tlog_replica_test_only_leader_indexes s:shard1 r:core_node4 x:tlog_replica_test_only_leader_indexes_shard1_replica_t2] o.a.s.c.SolrCore [tlog_replica_test_only_leader_indexes_shard1_replica_t2] Registered new searcher Searcher@30371628[tlog_replica_test_only_leader_indexes_shard1_replica_t2] main{ExitableDirectoryReader(UninvertingDirectoryReader())}
[junit4] 2> 792393 INFO (qtp412150155-7629) [n:127.0.0.1:42713_solr c:tlog_replica_test_only_leader_indexes s:shard1 r:core_node4 x:tlog_replica_test_only_leader_indexes_shard1_replica_t2] o.a.s.c.ZkShardTerms Successful update of terms at /collections/tlog_replica_test_only_leader_indexes/terms/shard1 to Terms{values={core_node4=0}, version=0}
[junit4] 2> 792393 INFO (qtp1802682154-7641) [n:127.0.0.1:41907_solr c:tlog_replica_test_only_leader_indexes s:shard1 r:core_node3 x:tlog_replica_test_only_leader_indexes_shard1_replica_t1] o.a.s.c.ZkShardTerms Failed to save terms, version is not a match, retrying
[junit4] 2> 792394 INFO (qtp1802682154-7641) [n:127.0.0.1:41907_solr c:tlog_replica_test_only_leader_indexes s:shard1 r:core_node3 x:tlog_replica_test_only_leader_indexes_shard1_replica_t1] o.a.s.c.ZkShardTerms Successful update of terms at /collections/tlog_replica_test_only_leader_indexes/terms/shard1 to Terms{values={core_node3=0, core_node4=0}, version=1}
[junit4] 2> 792396 INFO (qtp412150155-7629) [n:127.0.0.1:42713_solr c:tlog_replica_test_only_leader_indexes s:shard1 r:core_node4 x:tlog_replica_test_only_leader_indexes_shard1_replica_t2] o.a.s.c.ShardLeaderElectionContext Enough replicas found to continue.
[junit4] 2> 792396 INFO (qtp412150155-7629) [n:127.0.0.1:42713_solr c:tlog_replica_test_only_leader_indexes s:shard1 r:core_node4 x:tlog_replica_test_only_leader_indexes_shard1_replica_t2] o.a.s.c.ShardLeaderElectionContext I may be the new leader - try and sync
[junit4] 2> 792396 INFO (qtp412150155-7629) [n:127.0.0.1:42713_solr c:tlog_replica_test_only_leader_indexes s:shard1 r:core_node4 x:tlog_replica_test_only_leader_indexes_shard1_replica_t2] o.a.s.c.SyncStrategy Sync replicas to https://127.0.0.1:42713/solr/tlog_replica_test_only_leader_indexes_shard1_replica_t2/
[junit4] 2> 792396 INFO (qtp412150155-7629) [n:127.0.0.1:42713_solr c:tlog_replica_test_only_leader_indexes s:shard1 r:core_node4 x:tlog_replica_test_only_leader_indexes_shard1_replica_t2] o.a.s.u.PeerSync PeerSync: core=tlog_replica_test_only_leader_indexes_shard1_replica_t2 url=https://127.0.0.1:42713/solr START replicas=[https://127.0.0.1:41907/solr/tlog_replica_test_only_leader_indexes_shard1_replica_t1/] nUpdates=100
[junit4] 2> 792396 INFO (qtp412150155-7629) [n:127.0.0.1:42713_solr c:tlog_replica_test_only_leader_indexes s:shard1 r:core_node4 x:tlog_replica_test_only_leader_indexes_shard1_replica_t2] o.a.s.u.PeerSync PeerSync: core=tlog_replica_test_only_leader_indexes_shard1_replica_t2 url=https://127.0.0.1:42713/solr DONE. We have no versions. sync failed.
[junit4] 2> 792399 INFO (qtp1802682154-7709) [n:127.0.0.1:41907_solr c:tlog_replica_test_only_leader_indexes s:shard1 r:core_node3 x:tlog_replica_test_only_leader_indexes_shard1_replica_t1] o.a.s.c.S.Request [tlog_replica_test_only_leader_indexes_sh
[...truncated too long message...]
[junit4] 2> 207636 INFO (zkCallback-253-thread-1) [ ] o.a.s.c.c.ZkStateReader Updated live nodes from ZooKeeper... (2) -> (1)
[junit4] 2> 207637 INFO (jetty-closer-134-thread-1) [ ] o.a.s.c.ZkController Remove node as live in ZooKeeper:/live_nodes/127.0.0.1:36277_solr
[junit4] 2> 207637 INFO (jetty-closer-134-thread-1) [ ] o.a.s.m.SolrMetricManager Closing metric reporters for registry=solr.cluster, tag=null
[junit4] 2> 207637 INFO (jetty-closer-134-thread-2) [ ] o.a.s.c.Overseer Overseer (id=72140709008048153-127.0.0.1:35825_solr-n_0000000005) closing
[junit4] 2> 207637 INFO (OverseerStateUpdate-72140709008048153-127.0.0.1:35825_solr-n_0000000005) [n:127.0.0.1:35825_solr ] o.a.s.c.Overseer Overseer Loop exiting : 127.0.0.1:35825_solr
[junit4] 2> 207637 INFO (zkCallback-236-thread-2) [ ] o.a.s.c.c.ZkStateReader Updated live nodes from ZooKeeper... (1) -> (0)
[junit4] 2> 207637 INFO (zkCallback-260-thread-1) [ ] o.a.s.c.c.ZkStateReader Updated live nodes from ZooKeeper... (1) -> (0)
[junit4] 2> 207638 INFO (zkCallback-253-thread-1) [ ] o.a.s.c.c.ZkStateReader Updated live nodes from ZooKeeper... (1) -> (0)
[junit4] 2> 207638 INFO (zkCallback-243-thread-1) [ ] o.a.s.c.c.ZkStateReader Updated live nodes from ZooKeeper... (1) -> (0)
[junit4] 2> 207638 WARN (OverseerAutoScalingTriggerThread-72140709008048153-127.0.0.1:35825_solr-n_0000000005) [ ] o.a.s.c.a.OverseerTriggerThread OverseerTriggerThread woken up but we are closed, exiting.
[junit4] 2> 207640 INFO (zkCallback-253-thread-1) [ ] o.a.s.c.OverseerElectionContext I am going to be the leader 127.0.0.1:36277_solr
[junit4] 2> 207642 INFO (jetty-closer-134-thread-2) [ ] o.e.j.s.h.ContextHandler Stopped o.e.j.s.ServletContextHandler@7167bd4f{/solr,null,UNAVAILABLE}
[junit4] 2> 207642 INFO (jetty-closer-134-thread-2) [ ] o.e.j.s.session node0 Stopped scavenging
[junit4] 2> 209142 INFO (jetty-closer-134-thread-1) [ ] o.e.j.s.h.ContextHandler Stopped o.e.j.s.ServletContextHandler@7201934a{/solr,null,UNAVAILABLE}
[junit4] 2> 209142 INFO (jetty-closer-134-thread-1) [ ] o.e.j.s.session node0 Stopped scavenging
[junit4] 2> 209143 ERROR (SUITE-TestTlogReplica-seed#[5678F9C8765930C5]-worker) [ ] o.a.z.s.ZooKeeperServer ZKShutdownHandler is not registered, so ZooKeeper server won't take any action on ERROR or SHUTDOWN server state changes
[junit4] 2> 209143 INFO (SUITE-TestTlogReplica-seed#[5678F9C8765930C5]-worker) [ ] o.a.s.c.ZkTestServer connecting to 127.0.0.1:38349 38349
[junit4] 2> 209175 INFO (Thread-103) [ ] o.a.s.c.ZkTestServer connecting to 127.0.0.1:38349 38349
[junit4] 2> 209176 WARN (Thread-103) [ ] o.a.s.c.ZkTestServer Watch limit violations:
[junit4] 2> Maximum concurrent create/delete watches above limit:
[junit4] 2>
[junit4] 2> 32 /solr/configs/conf
[junit4] 2> 31 /solr/collections/tlog_replica_test_create_delete/terms/shard2
[junit4] 2> 30 /solr/collections/tlog_replica_test_create_delete/terms/shard1
[junit4] 2> 19 /solr/collections/tlog_replica_test_recovery/terms/shard1
[junit4] 2> 19 /solr/collections/tlog_replica_test_remove_leader/terms/shard1
[junit4] 2> 17 /solr/collections/tlog_replica_test_kill_leader/terms/shard1
[junit4] 2> 17 /solr/collections/tlog_replica_test_kill_tlog_replica/terms/shard1
[junit4] 2> 16 /solr/collections/tlog_replica_test_basic_leader_election/terms/shard1
[junit4] 2> 15 /solr/aliases.json
[junit4] 2> 14 /solr/collections/tlog_replica_test_out_of_order_db_qwith_in_place_updates/terms/shard1
[junit4] 2> 14 /solr/collections/tlog_replica_test_add_docs/terms/shard1
[junit4] 2> 14 /solr/collections/tlog_replica_test_real_time_get/terms/shard1
[junit4] 2> 10 /solr/collections/tlog_replica_test_delete_by_id/terms/shard1
[junit4] 2> 10 /solr/collections/tlog_replica_test_only_leader_indexes/terms/shard1
[junit4] 2> 8 /solr/collections/tlog_replica_test_add_remove_tlog_replica/terms/shard2
[junit4] 2> 7 /solr/security.json
[junit4] 2> 7 /solr/collections/tlog_replica_test_add_remove_tlog_replica/terms/shard1
[junit4] 2>
[junit4] 2> Maximum concurrent data watches above limit:
[junit4] 2>
[junit4] 2> 25 /solr/collections/tlog_replica_test_out_of_order_db_qwith_in_place_updates/state.json
[junit4] 2> 22 /solr/collections/tlog_replica_test_create_delete/state.json
[junit4] 2> 15 /solr/clusterstate.json
[junit4] 2> 15 /solr/clusterprops.json
[junit4] 2> 11 /solr/collections/tlog_replica_test_kill_leader/state.json
[junit4] 2> 11 /solr/collections/tlog_replica_test_recovery/state.json
[junit4] 2> 11 /solr/collections/tlog_replica_test_basic_leader_election/state.json
[junit4] 2> 10 /solr/collections/tlog_replica_test_kill_tlog_replica/state.json
[junit4] 2> 9 /solr/collections/tlog_replica_test_remove_leader/state.json
[junit4] 2> 5 /solr/collections/tlog_replica_test_real_time_get/state.json
[junit4] 2> 4 /solr/collections/tlog_replica_test_add_docs/state.json
[junit4] 2> 4 /solr/autoscaling.json
[junit4] 2> 3 /solr/overseer_elect/election/72140709008048141-127.0.0.1:36277_solr-n_0000000002
[junit4] 2> 3 /solr/collections/tlog_replica_test_create_delete/leader_elect/shard1/election/72140709008048157-core_node5-n_0000000001
[junit4] 2> 3 /solr/collections/tlog_replica_test_add_remove_tlog_replica/state.json
[junit4] 2> 3 /solr/collections/tlog_replica_test_only_leader_indexes/state.json
[junit4] 2> 3 /solr/collections/tlog_replica_test_delete_by_id/state.json
[junit4] 2> 2 /solr/collections/tlog_replica_test_create_delete/leader_elect/shard2/election/72140709008048153-core_node11-n_0000000002
[junit4] 2> 2 /solr/collections/tlog_replica_test_create_delete/leader_elect/shard2/election/72140709008048157-core_node13-n_0000000001
[junit4] 2> 2 /solr/collections/tlog_replica_test_recovery/leader_elect/shard1/election/72140709008048134-core_node3-n_0000000000
[junit4] 2> 2 /solr/collections/tlog_replica_test_real_time_get/leader_elect/shard1/election/72140709008048157-core_node6-n_0000000000
[junit4] 2>
[junit4] 2> Maximum concurrent children watches above limit:
[junit4] 2>
[junit4] 2> 15 /solr/live_nodes
[junit4] 2> 15 /solr/collections
[junit4] 2> 4 /solr/overseer/queue
[junit4] 2> 4 /solr/autoscaling/events/.scheduled_maintenance
[junit4] 2> 4 /solr/autoscaling/events/.auto_add_replicas
[junit4] 2> 4 /solr/overseer/collection-queue-work
[junit4] 2> 4 /solr/overseer/queue-work
[junit4] 2>
[junit4] 2> NOTE: leaving temporary files on disk at: /home/jenkins/workspace/Lucene-Solr-7.6-Linux/solr/build/solr-core/test/J2/temp/solr.cloud.TestTlogReplica_5678F9C8765930C5-002
[junit4] 2> Dec 05, 2018 9:59:31 AM com.carrotsearch.randomizedtesting.ThreadLeakControl checkThreadLeaks
[junit4] 2> WARNING: Will linger awaiting termination of 1 leaked thread(s).
[junit4] 2> NOTE: test params are: codec=Asserting(Lucene70), sim=RandomSimilarity(queryNorm=true): {}, locale=ca-AD, timezone=America/La_Paz
[junit4] 2> NOTE: Linux 4.15.0-39-generic amd64/Oracle Corporation 10.0.1 (64-bit)/cpus=8,threads=1,free=101532000,total=518979584
[junit4] 2> NOTE: All tests run in this JVM: [TestTlogReplica, TestTlogReplica]
[junit4] Completed [5/5 (5!)] on J2 in 101.43s, 13 tests, 1 failure <<< FAILURES!
[...truncated 1 lines...]
[junit4] JVM J2: stderr was not empty, see: /home/jenkins/workspace/Lucene-Solr-7.6-Linux/solr/build/solr-core/test/temp/junit4-J2-20181205_095602_28416033528735349599322.syserr
[junit4] >>> JVM J2 emitted unexpected output (verbatim) ----
[junit4] OpenJDK 64-Bit Server VM warning: Option UseConcMarkSweepGC was deprecated in version 9.0 and will likely be removed in a future release.
[junit4] <<< JVM J2: EOF ----
[...truncated 14 lines...]
BUILD FAILED
/home/jenkins/workspace/Lucene-Solr-7.6-Linux/lucene/common-build.xml:1567: The following error occurred while executing this line:
/home/jenkins/workspace/Lucene-Solr-7.6-Linux/lucene/common-build.xml:1092: There were test failures: 5 suites, 65 tests, 5 failures [seed: 5678F9C8765930C5]
Total time: 3 minutes 31 seconds
[repro] Setting last failure code to 256
[repro] Failures:
[repro] 5/5 failed: org.apache.solr.cloud.TestTlogReplica
[repro] Exiting with code 256
+ mv lucene/build lucene/build.repro
+ mv solr/build solr/build.repro
+ mv lucene/build.orig lucene/build
+ mv solr/build.orig solr/build
Archiving artifacts
Setting ANT_1_8_2_HOME=/var/lib/jenkins/tools/hudson.tasks.Ant_AntInstallation/ANT_1.8.2
[WARNINGS] Parsing warnings in console log with parser Java Compiler (javac)
Setting ANT_1_8_2_HOME=/var/lib/jenkins/tools/hudson.tasks.Ant_AntInstallation/ANT_1.8.2
Setting ANT_1_8_2_HOME=/var/lib/jenkins/tools/hudson.tasks.Ant_AntInstallation/ANT_1.8.2
<Git Blamer> Using GitBlamer to create author and commit information for all warnings.
<Git Blamer> GIT_COMMIT=d764aa2223b229f6522037b6997d642ba031c79c, workspace=/var/lib/jenkins/workspace/Lucene-Solr-7.6-Linux
[WARNINGS] Computing warning deltas based on reference build #62
Recording test results
Setting ANT_1_8_2_HOME=/var/lib/jenkins/tools/hudson.tasks.Ant_AntInstallation/ANT_1.8.2
Build step 'Publish JUnit test result report' changed build result to UNSTABLE
Email was triggered for: Unstable (Test Failures)
Sending email for trigger: Unstable (Test Failures)
Setting ANT_1_8_2_HOME=/var/lib/jenkins/tools/hudson.tasks.Ant_AntInstallation/ANT_1.8.2
Setting ANT_1_8_2_HOME=/var/lib/jenkins/tools/hudson.tasks.Ant_AntInstallation/ANT_1.8.2
Setting ANT_1_8_2_HOME=/var/lib/jenkins/tools/hudson.tasks.Ant_AntInstallation/ANT_1.8.2
Setting ANT_1_8_2_HOME=/var/lib/jenkins/tools/hudson.tasks.Ant_AntInstallation/ANT_1.8.2
[JENKINS] Lucene-Solr-7.6-Linux (64bit/jdk-9.0.4) - Build # 64 -
Still Unstable!
Posted by Policeman Jenkins Server <je...@thetaphi.de>.
Build: https://jenkins.thetaphi.de/job/Lucene-Solr-7.6-Linux/64/
Java: 64bit/jdk-9.0.4 -XX:+UseCompressedOops -XX:+UseConcMarkSweepGC
3 tests failed.
FAILED: org.apache.solr.cloud.TestTlogReplica.testRecovery
Error Message:
Can not find doc 7 in https://127.0.0.1:38415/solr
Stack Trace:
java.lang.AssertionError: Can not find doc 7 in https://127.0.0.1:38415/solr
at __randomizedtesting.SeedInfo.seed([801E4B7502599BD:C9F19D1B7D75531A]:0)
at org.junit.Assert.fail(Assert.java:93)
at org.junit.Assert.assertTrue(Assert.java:43)
at org.junit.Assert.assertNotNull(Assert.java:526)
at org.apache.solr.cloud.TestTlogReplica.checkRTG(TestTlogReplica.java:902)
at org.apache.solr.cloud.TestTlogReplica.testRecovery(TestTlogReplica.java:567)
at java.base/jdk.internal.reflect.NativeMethodAccessorImpl.invoke0(Native Method)
at java.base/jdk.internal.reflect.NativeMethodAccessorImpl.invoke(NativeMethodAccessorImpl.java:62)
at java.base/jdk.internal.reflect.DelegatingMethodAccessorImpl.invoke(DelegatingMethodAccessorImpl.java:43)
at java.base/java.lang.reflect.Method.invoke(Method.java:564)
at com.carrotsearch.randomizedtesting.RandomizedRunner.invoke(RandomizedRunner.java:1742)
at com.carrotsearch.randomizedtesting.RandomizedRunner$8.evaluate(RandomizedRunner.java:935)
at com.carrotsearch.randomizedtesting.RandomizedRunner$9.evaluate(RandomizedRunner.java:971)
at com.carrotsearch.randomizedtesting.RandomizedRunner$10.evaluate(RandomizedRunner.java:985)
at com.carrotsearch.randomizedtesting.rules.SystemPropertiesRestoreRule$1.evaluate(SystemPropertiesRestoreRule.java:57)
at org.apache.lucene.util.TestRuleSetupTeardownChained$1.evaluate(TestRuleSetupTeardownChained.java:49)
at org.apache.lucene.util.AbstractBeforeAfterRule$1.evaluate(AbstractBeforeAfterRule.java:45)
at org.apache.lucene.util.TestRuleThreadAndTestName$1.evaluate(TestRuleThreadAndTestName.java:48)
at org.apache.lucene.util.TestRuleIgnoreAfterMaxFailures$1.evaluate(TestRuleIgnoreAfterMaxFailures.java:64)
at org.apache.lucene.util.TestRuleMarkFailure$1.evaluate(TestRuleMarkFailure.java:47)
at com.carrotsearch.randomizedtesting.rules.StatementAdapter.evaluate(StatementAdapter.java:36)
at com.carrotsearch.randomizedtesting.ThreadLeakControl$StatementRunner.run(ThreadLeakControl.java:368)
at com.carrotsearch.randomizedtesting.ThreadLeakControl.forkTimeoutingTask(ThreadLeakControl.java:817)
at com.carrotsearch.randomizedtesting.ThreadLeakControl$3.evaluate(ThreadLeakControl.java:468)
at com.carrotsearch.randomizedtesting.RandomizedRunner.runSingleTest(RandomizedRunner.java:944)
at com.carrotsearch.randomizedtesting.RandomizedRunner$5.evaluate(RandomizedRunner.java:830)
at com.carrotsearch.randomizedtesting.RandomizedRunner$6.evaluate(RandomizedRunner.java:880)
at com.carrotsearch.randomizedtesting.RandomizedRunner$7.evaluate(RandomizedRunner.java:891)
at com.carrotsearch.randomizedtesting.rules.StatementAdapter.evaluate(StatementAdapter.java:36)
at com.carrotsearch.randomizedtesting.rules.SystemPropertiesRestoreRule$1.evaluate(SystemPropertiesRestoreRule.java:57)
at org.apache.lucene.util.AbstractBeforeAfterRule$1.evaluate(AbstractBeforeAfterRule.java:45)
at com.carrotsearch.randomizedtesting.rules.StatementAdapter.evaluate(StatementAdapter.java:36)
at org.apache.lucene.util.TestRuleStoreClassName$1.evaluate(TestRuleStoreClassName.java:41)
at com.carrotsearch.randomizedtesting.rules.NoShadowingOrOverridesOnMethodsRule$1.evaluate(NoShadowingOrOverridesOnMethodsRule.java:40)
at com.carrotsearch.randomizedtesting.rules.NoShadowingOrOverridesOnMethodsRule$1.evaluate(NoShadowingOrOverridesOnMethodsRule.java:40)
at com.carrotsearch.randomizedtesting.rules.StatementAdapter.evaluate(StatementAdapter.java:36)
at com.carrotsearch.randomizedtesting.rules.StatementAdapter.evaluate(StatementAdapter.java:36)
at org.apache.lucene.util.TestRuleAssertionsRequired$1.evaluate(TestRuleAssertionsRequired.java:53)
at org.apache.lucene.util.TestRuleMarkFailure$1.evaluate(TestRuleMarkFailure.java:47)
at org.apache.lucene.util.TestRuleIgnoreAfterMaxFailures$1.evaluate(TestRuleIgnoreAfterMaxFailures.java:64)
at org.apache.lucene.util.TestRuleIgnoreTestSuites$1.evaluate(TestRuleIgnoreTestSuites.java:54)
at com.carrotsearch.randomizedtesting.rules.StatementAdapter.evaluate(StatementAdapter.java:36)
at com.carrotsearch.randomizedtesting.ThreadLeakControl$StatementRunner.run(ThreadLeakControl.java:368)
at java.base/java.lang.Thread.run(Thread.java:844)
FAILED: org.apache.solr.cloud.TestTlogReplica.testRecovery
Error Message:
Can not find doc 7 in https://127.0.0.1:43763/solr
Stack Trace:
java.lang.AssertionError: Can not find doc 7 in https://127.0.0.1:43763/solr
at __randomizedtesting.SeedInfo.seed([801E4B7502599BD:C9F19D1B7D75531A]:0)
at org.junit.Assert.fail(Assert.java:93)
at org.junit.Assert.assertTrue(Assert.java:43)
at org.junit.Assert.assertNotNull(Assert.java:526)
at org.apache.solr.cloud.TestTlogReplica.checkRTG(TestTlogReplica.java:902)
at org.apache.solr.cloud.TestTlogReplica.testRecovery(TestTlogReplica.java:567)
at java.base/jdk.internal.reflect.NativeMethodAccessorImpl.invoke0(Native Method)
at java.base/jdk.internal.reflect.NativeMethodAccessorImpl.invoke(NativeMethodAccessorImpl.java:62)
at java.base/jdk.internal.reflect.DelegatingMethodAccessorImpl.invoke(DelegatingMethodAccessorImpl.java:43)
at java.base/java.lang.reflect.Method.invoke(Method.java:564)
at com.carrotsearch.randomizedtesting.RandomizedRunner.invoke(RandomizedRunner.java:1742)
at com.carrotsearch.randomizedtesting.RandomizedRunner$8.evaluate(RandomizedRunner.java:935)
at com.carrotsearch.randomizedtesting.RandomizedRunner$9.evaluate(RandomizedRunner.java:971)
at com.carrotsearch.randomizedtesting.RandomizedRunner$10.evaluate(RandomizedRunner.java:985)
at com.carrotsearch.randomizedtesting.rules.SystemPropertiesRestoreRule$1.evaluate(SystemPropertiesRestoreRule.java:57)
at org.apache.lucene.util.TestRuleSetupTeardownChained$1.evaluate(TestRuleSetupTeardownChained.java:49)
at org.apache.lucene.util.AbstractBeforeAfterRule$1.evaluate(AbstractBeforeAfterRule.java:45)
at org.apache.lucene.util.TestRuleThreadAndTestName$1.evaluate(TestRuleThreadAndTestName.java:48)
at org.apache.lucene.util.TestRuleIgnoreAfterMaxFailures$1.evaluate(TestRuleIgnoreAfterMaxFailures.java:64)
at org.apache.lucene.util.TestRuleMarkFailure$1.evaluate(TestRuleMarkFailure.java:47)
at com.carrotsearch.randomizedtesting.rules.StatementAdapter.evaluate(StatementAdapter.java:36)
at com.carrotsearch.randomizedtesting.ThreadLeakControl$StatementRunner.run(ThreadLeakControl.java:368)
at com.carrotsearch.randomizedtesting.ThreadLeakControl.forkTimeoutingTask(ThreadLeakControl.java:817)
at com.carrotsearch.randomizedtesting.ThreadLeakControl$3.evaluate(ThreadLeakControl.java:468)
at com.carrotsearch.randomizedtesting.RandomizedRunner.runSingleTest(RandomizedRunner.java:944)
at com.carrotsearch.randomizedtesting.RandomizedRunner$5.evaluate(RandomizedRunner.java:830)
at com.carrotsearch.randomizedtesting.RandomizedRunner$6.evaluate(RandomizedRunner.java:880)
at com.carrotsearch.randomizedtesting.RandomizedRunner$7.evaluate(RandomizedRunner.java:891)
at com.carrotsearch.randomizedtesting.rules.StatementAdapter.evaluate(StatementAdapter.java:36)
at com.carrotsearch.randomizedtesting.rules.SystemPropertiesRestoreRule$1.evaluate(SystemPropertiesRestoreRule.java:57)
at org.apache.lucene.util.AbstractBeforeAfterRule$1.evaluate(AbstractBeforeAfterRule.java:45)
at com.carrotsearch.randomizedtesting.rules.StatementAdapter.evaluate(StatementAdapter.java:36)
at org.apache.lucene.util.TestRuleStoreClassName$1.evaluate(TestRuleStoreClassName.java:41)
at com.carrotsearch.randomizedtesting.rules.NoShadowingOrOverridesOnMethodsRule$1.evaluate(NoShadowingOrOverridesOnMethodsRule.java:40)
at com.carrotsearch.randomizedtesting.rules.NoShadowingOrOverridesOnMethodsRule$1.evaluate(NoShadowingOrOverridesOnMethodsRule.java:40)
at com.carrotsearch.randomizedtesting.rules.StatementAdapter.evaluate(StatementAdapter.java:36)
at com.carrotsearch.randomizedtesting.rules.StatementAdapter.evaluate(StatementAdapter.java:36)
at org.apache.lucene.util.TestRuleAssertionsRequired$1.evaluate(TestRuleAssertionsRequired.java:53)
at org.apache.lucene.util.TestRuleMarkFailure$1.evaluate(TestRuleMarkFailure.java:47)
at org.apache.lucene.util.TestRuleIgnoreAfterMaxFailures$1.evaluate(TestRuleIgnoreAfterMaxFailures.java:64)
at org.apache.lucene.util.TestRuleIgnoreTestSuites$1.evaluate(TestRuleIgnoreTestSuites.java:54)
at com.carrotsearch.randomizedtesting.rules.StatementAdapter.evaluate(StatementAdapter.java:36)
at com.carrotsearch.randomizedtesting.ThreadLeakControl$StatementRunner.run(ThreadLeakControl.java:368)
at java.base/java.lang.Thread.run(Thread.java:844)
FAILED: org.apache.solr.cloud.TestTlogReplica.testRecovery
Error Message:
Can not find doc 7 in https://127.0.0.1:39021/solr
Stack Trace:
java.lang.AssertionError: Can not find doc 7 in https://127.0.0.1:39021/solr
at __randomizedtesting.SeedInfo.seed([801E4B7502599BD:C9F19D1B7D75531A]:0)
at org.junit.Assert.fail(Assert.java:93)
at org.junit.Assert.assertTrue(Assert.java:43)
at org.junit.Assert.assertNotNull(Assert.java:526)
at org.apache.solr.cloud.TestTlogReplica.checkRTG(TestTlogReplica.java:902)
at org.apache.solr.cloud.TestTlogReplica.testRecovery(TestTlogReplica.java:567)
at java.base/jdk.internal.reflect.NativeMethodAccessorImpl.invoke0(Native Method)
at java.base/jdk.internal.reflect.NativeMethodAccessorImpl.invoke(NativeMethodAccessorImpl.java:62)
at java.base/jdk.internal.reflect.DelegatingMethodAccessorImpl.invoke(DelegatingMethodAccessorImpl.java:43)
at java.base/java.lang.reflect.Method.invoke(Method.java:564)
at com.carrotsearch.randomizedtesting.RandomizedRunner.invoke(RandomizedRunner.java:1742)
at com.carrotsearch.randomizedtesting.RandomizedRunner$8.evaluate(RandomizedRunner.java:935)
at com.carrotsearch.randomizedtesting.RandomizedRunner$9.evaluate(RandomizedRunner.java:971)
at com.carrotsearch.randomizedtesting.RandomizedRunner$10.evaluate(RandomizedRunner.java:985)
at com.carrotsearch.randomizedtesting.rules.SystemPropertiesRestoreRule$1.evaluate(SystemPropertiesRestoreRule.java:57)
at org.apache.lucene.util.TestRuleSetupTeardownChained$1.evaluate(TestRuleSetupTeardownChained.java:49)
at org.apache.lucene.util.AbstractBeforeAfterRule$1.evaluate(AbstractBeforeAfterRule.java:45)
at org.apache.lucene.util.TestRuleThreadAndTestName$1.evaluate(TestRuleThreadAndTestName.java:48)
at org.apache.lucene.util.TestRuleIgnoreAfterMaxFailures$1.evaluate(TestRuleIgnoreAfterMaxFailures.java:64)
at org.apache.lucene.util.TestRuleMarkFailure$1.evaluate(TestRuleMarkFailure.java:47)
at com.carrotsearch.randomizedtesting.rules.StatementAdapter.evaluate(StatementAdapter.java:36)
at com.carrotsearch.randomizedtesting.ThreadLeakControl$StatementRunner.run(ThreadLeakControl.java:368)
at com.carrotsearch.randomizedtesting.ThreadLeakControl.forkTimeoutingTask(ThreadLeakControl.java:817)
at com.carrotsearch.randomizedtesting.ThreadLeakControl$3.evaluate(ThreadLeakControl.java:468)
at com.carrotsearch.randomizedtesting.RandomizedRunner.runSingleTest(RandomizedRunner.java:944)
at com.carrotsearch.randomizedtesting.RandomizedRunner$5.evaluate(RandomizedRunner.java:830)
at com.carrotsearch.randomizedtesting.RandomizedRunner$6.evaluate(RandomizedRunner.java:880)
at com.carrotsearch.randomizedtesting.RandomizedRunner$7.evaluate(RandomizedRunner.java:891)
at com.carrotsearch.randomizedtesting.rules.StatementAdapter.evaluate(StatementAdapter.java:36)
at com.carrotsearch.randomizedtesting.rules.SystemPropertiesRestoreRule$1.evaluate(SystemPropertiesRestoreRule.java:57)
at org.apache.lucene.util.AbstractBeforeAfterRule$1.evaluate(AbstractBeforeAfterRule.java:45)
at com.carrotsearch.randomizedtesting.rules.StatementAdapter.evaluate(StatementAdapter.java:36)
at org.apache.lucene.util.TestRuleStoreClassName$1.evaluate(TestRuleStoreClassName.java:41)
at com.carrotsearch.randomizedtesting.rules.NoShadowingOrOverridesOnMethodsRule$1.evaluate(NoShadowingOrOverridesOnMethodsRule.java:40)
at com.carrotsearch.randomizedtesting.rules.NoShadowingOrOverridesOnMethodsRule$1.evaluate(NoShadowingOrOverridesOnMethodsRule.java:40)
at com.carrotsearch.randomizedtesting.rules.StatementAdapter.evaluate(StatementAdapter.java:36)
at com.carrotsearch.randomizedtesting.rules.StatementAdapter.evaluate(StatementAdapter.java:36)
at org.apache.lucene.util.TestRuleAssertionsRequired$1.evaluate(TestRuleAssertionsRequired.java:53)
at org.apache.lucene.util.TestRuleMarkFailure$1.evaluate(TestRuleMarkFailure.java:47)
at org.apache.lucene.util.TestRuleIgnoreAfterMaxFailures$1.evaluate(TestRuleIgnoreAfterMaxFailures.java:64)
at org.apache.lucene.util.TestRuleIgnoreTestSuites$1.evaluate(TestRuleIgnoreTestSuites.java:54)
at com.carrotsearch.randomizedtesting.rules.StatementAdapter.evaluate(StatementAdapter.java:36)
at com.carrotsearch.randomizedtesting.ThreadLeakControl$StatementRunner.run(ThreadLeakControl.java:368)
at java.base/java.lang.Thread.run(Thread.java:844)
Build Log:
[...truncated 1918 lines...]
[junit4] JVM J1: stderr was not empty, see: /home/jenkins/workspace/Lucene-Solr-7.6-Linux/lucene/build/core/test/temp/junit4-J1-20181205_140945_04817554694821839206777.syserr
[junit4] >>> JVM J1 emitted unexpected output (verbatim) ----
[junit4] Java HotSpot(TM) 64-Bit Server VM warning: Option UseConcMarkSweepGC was deprecated in version 9.0 and will likely be removed in a future release.
[junit4] <<< JVM J1: EOF ----
[...truncated 3 lines...]
[junit4] JVM J0: stderr was not empty, see: /home/jenkins/workspace/Lucene-Solr-7.6-Linux/lucene/build/core/test/temp/junit4-J0-20181205_140945_04813406452455922268342.syserr
[junit4] >>> JVM J0 emitted unexpected output (verbatim) ----
[junit4] Java HotSpot(TM) 64-Bit Server VM warning: Option UseConcMarkSweepGC was deprecated in version 9.0 and will likely be removed in a future release.
[junit4] <<< JVM J0: EOF ----
[...truncated 3 lines...]
[junit4] JVM J2: stderr was not empty, see: /home/jenkins/workspace/Lucene-Solr-7.6-Linux/lucene/build/core/test/temp/junit4-J2-20181205_140945_0488650048641389897142.syserr
[junit4] >>> JVM J2 emitted unexpected output (verbatim) ----
[junit4] Java HotSpot(TM) 64-Bit Server VM warning: Option UseConcMarkSweepGC was deprecated in version 9.0 and will likely be removed in a future release.
[junit4] <<< JVM J2: EOF ----
[...truncated 304 lines...]
[junit4] JVM J2: stderr was not empty, see: /home/jenkins/workspace/Lucene-Solr-7.6-Linux/lucene/build/test-framework/test/temp/junit4-J2-20181205_141639_421993402362208452222.syserr
[junit4] >>> JVM J2 emitted unexpected output (verbatim) ----
[junit4] Java HotSpot(TM) 64-Bit Server VM warning: Option UseConcMarkSweepGC was deprecated in version 9.0 and will likely be removed in a future release.
[junit4] <<< JVM J2: EOF ----
[junit4] JVM J1: stderr was not empty, see: /home/jenkins/workspace/Lucene-Solr-7.6-Linux/lucene/build/test-framework/test/temp/junit4-J1-20181205_141639_421252734998049141022.syserr
[junit4] >>> JVM J1 emitted unexpected output (verbatim) ----
[junit4] Java HotSpot(TM) 64-Bit Server VM warning: Option UseConcMarkSweepGC was deprecated in version 9.0 and will likely be removed in a future release.
[junit4] <<< JVM J1: EOF ----
[...truncated 3 lines...]
[junit4] JVM J0: stderr was not empty, see: /home/jenkins/workspace/Lucene-Solr-7.6-Linux/lucene/build/test-framework/test/temp/junit4-J0-20181205_141639_42111885544842657315010.syserr
[junit4] >>> JVM J0 emitted unexpected output (verbatim) ----
[junit4] Java HotSpot(TM) 64-Bit Server VM warning: Option UseConcMarkSweepGC was deprecated in version 9.0 and will likely be removed in a future release.
[junit4] <<< JVM J0: EOF ----
[...truncated 1083 lines...]
[junit4] JVM J1: stderr was not empty, see: /home/jenkins/workspace/Lucene-Solr-7.6-Linux/lucene/build/analysis/common/test/temp/junit4-J1-20181205_141756_3903557766101204714777.syserr
[junit4] >>> JVM J1 emitted unexpected output (verbatim) ----
[junit4] Java HotSpot(TM) 64-Bit Server VM warning: Option UseConcMarkSweepGC was deprecated in version 9.0 and will likely be removed in a future release.
[junit4] <<< JVM J1: EOF ----
[junit4] JVM J2: stderr was not empty, see: /home/jenkins/workspace/Lucene-Solr-7.6-Linux/lucene/build/analysis/common/test/temp/junit4-J2-20181205_141756_3902644206765087714476.syserr
[junit4] >>> JVM J2 emitted unexpected output (verbatim) ----
[junit4] Java HotSpot(TM) 64-Bit Server VM warning: Option UseConcMarkSweepGC was deprecated in version 9.0 and will likely be removed in a future release.
[junit4] <<< JVM J2: EOF ----
[...truncated 3 lines...]
[junit4] JVM J0: stderr was not empty, see: /home/jenkins/workspace/Lucene-Solr-7.6-Linux/lucene/build/analysis/common/test/temp/junit4-J0-20181205_141756_39016623745065316488315.syserr
[junit4] >>> JVM J0 emitted unexpected output (verbatim) ----
[junit4] Java HotSpot(TM) 64-Bit Server VM warning: Option UseConcMarkSweepGC was deprecated in version 9.0 and will likely be removed in a future release.
[junit4] <<< JVM J0: EOF ----
[...truncated 252 lines...]
[junit4] JVM J1: stderr was not empty, see: /home/jenkins/workspace/Lucene-Solr-7.6-Linux/lucene/build/analysis/icu/test/temp/junit4-J1-20181205_141925_8477932417213423549178.syserr
[junit4] >>> JVM J1 emitted unexpected output (verbatim) ----
[junit4] Java HotSpot(TM) 64-Bit Server VM warning: Option UseConcMarkSweepGC was deprecated in version 9.0 and will likely be removed in a future release.
[junit4] <<< JVM J1: EOF ----
[...truncated 9 lines...]
[junit4] JVM J2: stderr was not empty, see: /home/jenkins/workspace/Lucene-Solr-7.6-Linux/lucene/build/analysis/icu/test/temp/junit4-J2-20181205_141925_84715653958536258434021.syserr
[junit4] >>> JVM J2 emitted unexpected output (verbatim) ----
[junit4] Java HotSpot(TM) 64-Bit Server VM warning: Option UseConcMarkSweepGC was deprecated in version 9.0 and will likely be removed in a future release.
[junit4] <<< JVM J2: EOF ----
[junit4] JVM J0: stderr was not empty, see: /home/jenkins/workspace/Lucene-Solr-7.6-Linux/lucene/build/analysis/icu/test/temp/junit4-J0-20181205_141925_8473129455499362152926.syserr
[junit4] >>> JVM J0 emitted unexpected output (verbatim) ----
[junit4] Java HotSpot(TM) 64-Bit Server VM warning: Option UseConcMarkSweepGC was deprecated in version 9.0 and will likely be removed in a future release.
[junit4] <<< JVM J0: EOF ----
[...truncated 256 lines...]
[junit4] JVM J0: stderr was not empty, see: /home/jenkins/workspace/Lucene-Solr-7.6-Linux/lucene/build/analysis/kuromoji/test/temp/junit4-J0-20181205_141936_6834283562211118560165.syserr
[junit4] >>> JVM J0 emitted unexpected output (verbatim) ----
[junit4] Java HotSpot(TM) 64-Bit Server VM warning: Option UseConcMarkSweepGC was deprecated in version 9.0 and will likely be removed in a future release.
[junit4] <<< JVM J0: EOF ----
[junit4] JVM J1: stderr was not empty, see: /home/jenkins/workspace/Lucene-Solr-7.6-Linux/lucene/build/analysis/kuromoji/test/temp/junit4-J1-20181205_141936_6839906142758739643841.syserr
[junit4] >>> JVM J1 emitted unexpected output (verbatim) ----
[junit4] Java HotSpot(TM) 64-Bit Server VM warning: Option UseConcMarkSweepGC was deprecated in version 9.0 and will likely be removed in a future release.
[junit4] <<< JVM J1: EOF ----
[...truncated 3 lines...]
[junit4] JVM J2: stderr was not empty, see: /home/jenkins/workspace/Lucene-Solr-7.6-Linux/lucene/build/analysis/kuromoji/test/temp/junit4-J2-20181205_141936_6832144551829299477908.syserr
[junit4] >>> JVM J2 emitted unexpected output (verbatim) ----
[junit4] Java HotSpot(TM) 64-Bit Server VM warning: Option UseConcMarkSweepGC was deprecated in version 9.0 and will likely be removed in a future release.
[junit4] <<< JVM J2: EOF ----
[...truncated 162 lines...]
[junit4] JVM J1: stderr was not empty, see: /home/jenkins/workspace/Lucene-Solr-7.6-Linux/lucene/build/analysis/morfologik/test/temp/junit4-J1-20181205_141957_7363211900628966033073.syserr
[junit4] >>> JVM J1 emitted unexpected output (verbatim) ----
[junit4] Java HotSpot(TM) 64-Bit Server VM warning: Option UseConcMarkSweepGC was deprecated in version 9.0 and will likely be removed in a future release.
[junit4] <<< JVM J1: EOF ----
[...truncated 3 lines...]
[junit4] JVM J0: stderr was not empty, see: /home/jenkins/workspace/Lucene-Solr-7.6-Linux/lucene/build/analysis/morfologik/test/temp/junit4-J0-20181205_141957_7366281671450442115712.syserr
[junit4] >>> JVM J0 emitted unexpected output (verbatim) ----
[junit4] Java HotSpot(TM) 64-Bit Server VM warning: Option UseConcMarkSweepGC was deprecated in version 9.0 and will likely be removed in a future release.
[junit4] <<< JVM J0: EOF ----
[...truncated 3 lines...]
[junit4] JVM J2: stderr was not empty, see: /home/jenkins/workspace/Lucene-Solr-7.6-Linux/lucene/build/analysis/morfologik/test/temp/junit4-J2-20181205_141957_7365533614613265288176.syserr
[junit4] >>> JVM J2 emitted unexpected output (verbatim) ----
[junit4] Java HotSpot(TM) 64-Bit Server VM warning: Option UseConcMarkSweepGC was deprecated in version 9.0 and will likely be removed in a future release.
[junit4] <<< JVM J2: EOF ----
[...truncated 204 lines...]
[junit4] JVM J0: stderr was not empty, see: /home/jenkins/workspace/Lucene-Solr-7.6-Linux/lucene/build/analysis/nori/test/temp/junit4-J0-20181205_142001_46517308822068271436380.syserr
[junit4] >>> JVM J0 emitted unexpected output (verbatim) ----
[junit4] Java HotSpot(TM) 64-Bit Server VM warning: Option UseConcMarkSweepGC was deprecated in version 9.0 and will likely be removed in a future release.
[junit4] <<< JVM J0: EOF ----
[...truncated 3 lines...]
[junit4] JVM J2: stderr was not empty, see: /home/jenkins/workspace/Lucene-Solr-7.6-Linux/lucene/build/analysis/nori/test/temp/junit4-J2-20181205_142001_4651322030405181926339.syserr
[junit4] >>> JVM J2 emitted unexpected output (verbatim) ----
[junit4] Java HotSpot(TM) 64-Bit Server VM warning: Option UseConcMarkSweepGC was deprecated in version 9.0 and will likely be removed in a future release.
[junit4] <<< JVM J2: EOF ----
[...truncated 6 lines...]
[junit4] JVM J1: stderr was not empty, see: /home/jenkins/workspace/Lucene-Solr-7.6-Linux/lucene/build/analysis/nori/test/temp/junit4-J1-20181205_142001_4657181333421290158971.syserr
[junit4] >>> JVM J1 emitted unexpected output (verbatim) ----
[junit4] Java HotSpot(TM) 64-Bit Server VM warning: Option UseConcMarkSweepGC was deprecated in version 9.0 and will likely be removed in a future release.
[junit4] <<< JVM J1: EOF ----
[...truncated 174 lines...]
[junit4] JVM J1: stderr was not empty, see: /home/jenkins/workspace/Lucene-Solr-7.6-Linux/lucene/build/analysis/opennlp/test/temp/junit4-J1-20181205_142010_1833079363648445894084.syserr
[junit4] >>> JVM J1 emitted unexpected output (verbatim) ----
[junit4] Java HotSpot(TM) 64-Bit Server VM warning: Option UseConcMarkSweepGC was deprecated in version 9.0 and will likely be removed in a future release.
[junit4] <<< JVM J1: EOF ----
[junit4] JVM J0: stderr was not empty, see: /home/jenkins/workspace/Lucene-Solr-7.6-Linux/lucene/build/analysis/opennlp/test/temp/junit4-J0-20181205_142010_183378998510870414053.syserr
[junit4] >>> JVM J0 emitted unexpected output (verbatim) ----
[junit4] Java HotSpot(TM) 64-Bit Server VM warning: Option UseConcMarkSweepGC was deprecated in version 9.0 and will likely be removed in a future release.
[junit4] <<< JVM J0: EOF ----
[junit4] JVM J2: stderr was not empty, see: /home/jenkins/workspace/Lucene-Solr-7.6-Linux/lucene/build/analysis/opennlp/test/temp/junit4-J2-20181205_142010_1831553776241669442824.syserr
[junit4] >>> JVM J2 emitted unexpected output (verbatim) ----
[junit4] Java HotSpot(TM) 64-Bit Server VM warning: Option UseConcMarkSweepGC was deprecated in version 9.0 and will likely be removed in a future release.
[junit4] <<< JVM J2: EOF ----
[...truncated 173 lines...]
[junit4] JVM J0: stderr was not empty, see: /home/jenkins/workspace/Lucene-Solr-7.6-Linux/lucene/build/analysis/phonetic/test/temp/junit4-J0-20181205_142012_9321881433167669456369.syserr
[junit4] >>> JVM J0 emitted unexpected output (verbatim) ----
[junit4] Java HotSpot(TM) 64-Bit Server VM warning: Option UseConcMarkSweepGC was deprecated in version 9.0 and will likely be removed in a future release.
[junit4] <<< JVM J0: EOF ----
[...truncated 6 lines...]
[junit4] JVM J1: stderr was not empty, see: /home/jenkins/workspace/Lucene-Solr-7.6-Linux/lucene/build/analysis/phonetic/test/temp/junit4-J1-20181205_142012_93218058169508597366740.syserr
[junit4] >>> JVM J1 emitted unexpected output (verbatim) ----
[junit4] Java HotSpot(TM) 64-Bit Server VM warning: Option UseConcMarkSweepGC was deprecated in version 9.0 and will likely be removed in a future release.
[junit4] <<< JVM J1: EOF ----
[...truncated 3 lines...]
[junit4] JVM J2: stderr was not empty, see: /home/jenkins/workspace/Lucene-Solr-7.6-Linux/lucene/build/analysis/phonetic/test/temp/junit4-J2-20181205_142012_9322172039555430151009.syserr
[junit4] >>> JVM J2 emitted unexpected output (verbatim) ----
[junit4] Java HotSpot(TM) 64-Bit Server VM warning: Option UseConcMarkSweepGC was deprecated in version 9.0 and will likely be removed in a future release.
[junit4] <<< JVM J2: EOF ----
[...truncated 161 lines...]
[junit4] JVM J0: stderr was not empty, see: /home/jenkins/workspace/Lucene-Solr-7.6-Linux/lucene/build/analysis/smartcn/test/temp/junit4-J0-20181205_142021_8519129573811943626981.syserr
[junit4] >>> JVM J0 emitted unexpected output (verbatim) ----
[junit4] Java HotSpot(TM) 64-Bit Server VM warning: Option UseConcMarkSweepGC was deprecated in version 9.0 and will likely be removed in a future release.
[junit4] <<< JVM J0: EOF ----
[...truncated 3 lines...]
[junit4] JVM J1: stderr was not empty, see: /home/jenkins/workspace/Lucene-Solr-7.6-Linux/lucene/build/analysis/smartcn/test/temp/junit4-J1-20181205_142021_85114562845083699266177.syserr
[junit4] >>> JVM J1 emitted unexpected output (verbatim) ----
[junit4] Java HotSpot(TM) 64-Bit Server VM warning: Option UseConcMarkSweepGC was deprecated in version 9.0 and will likely be removed in a future release.
[junit4] <<< JVM J1: EOF ----
[...truncated 165 lines...]
[junit4] JVM J1: stderr was not empty, see: /home/jenkins/workspace/Lucene-Solr-7.6-Linux/lucene/build/analysis/stempel/test/temp/junit4-J1-20181205_142027_75111807456306129564273.syserr
[junit4] >>> JVM J1 emitted unexpected output (verbatim) ----
[junit4] Java HotSpot(TM) 64-Bit Server VM warning: Option UseConcMarkSweepGC was deprecated in version 9.0 and will likely be removed in a future release.
[junit4] <<< JVM J1: EOF ----
[junit4] JVM J2: stderr was not empty, see: /home/jenkins/workspace/Lucene-Solr-7.6-Linux/lucene/build/analysis/stempel/test/temp/junit4-J2-20181205_142027_7517206492644227641623.syserr
[junit4] >>> JVM J2 emitted unexpected output (verbatim) ----
[junit4] Java HotSpot(TM) 64-Bit Server VM warning: Option UseConcMarkSweepGC was deprecated in version 9.0 and will likely be removed in a future release.
[junit4] <<< JVM J2: EOF ----
[...truncated 3 lines...]
[junit4] JVM J0: stderr was not empty, see: /home/jenkins/workspace/Lucene-Solr-7.6-Linux/lucene/build/analysis/stempel/test/temp/junit4-J0-20181205_142027_7518466774381935645600.syserr
[junit4] >>> JVM J0 emitted unexpected output (verbatim) ----
[junit4] Java HotSpot(TM) 64-Bit Server VM warning: Option UseConcMarkSweepGC was deprecated in version 9.0 and will likely be removed in a future release.
[junit4] <<< JVM J0: EOF ----
[...truncated 198 lines...]
[junit4] JVM J1: stderr was not empty, see: /home/jenkins/workspace/Lucene-Solr-7.6-Linux/lucene/build/backward-codecs/test/temp/junit4-J1-20181205_142030_60618346038255117563579.syserr
[junit4] >>> JVM J1 emitted unexpected output (verbatim) ----
[junit4] Java HotSpot(TM) 64-Bit Server VM warning: Option UseConcMarkSweepGC was deprecated in version 9.0 and will likely be removed in a future release.
[junit4] <<< JVM J1: EOF ----
[...truncated 22 lines...]
[junit4] JVM J2: stderr was not empty, see: /home/jenkins/workspace/Lucene-Solr-7.6-Linux/lucene/build/backward-codecs/test/temp/junit4-J2-20181205_142030_60615246044043349429638.syserr
[junit4] >>> JVM J2 emitted unexpected output (verbatim) ----
[junit4] Java HotSpot(TM) 64-Bit Server VM warning: Option UseConcMarkSweepGC was deprecated in version 9.0 and will likely be removed in a future release.
[junit4] <<< JVM J2: EOF ----
[...truncated 14 lines...]
[junit4] JVM J0: stderr was not empty, see: /home/jenkins/workspace/Lucene-Solr-7.6-Linux/lucene/build/backward-codecs/test/temp/junit4-J0-20181205_142030_6064442340909931728318.syserr
[junit4] >>> JVM J0 emitted unexpected output (verbatim) ----
[junit4] Java HotSpot(TM) 64-Bit Server VM warning: Option UseConcMarkSweepGC was deprecated in version 9.0 and will likely be removed in a future release.
[junit4] <<< JVM J0: EOF ----
[...truncated 1555 lines...]
[junit4] JVM J1: stderr was not empty, see: /home/jenkins/workspace/Lucene-Solr-7.6-Linux/lucene/build/benchmark/test/temp/junit4-J1-20181205_142226_54915223525026533882963.syserr
[junit4] >>> JVM J1 emitted unexpected output (verbatim) ----
[junit4] Java HotSpot(TM) 64-Bit Server VM warning: Option UseConcMarkSweepGC was deprecated in version 9.0 and will likely be removed in a future release.
[junit4] <<< JVM J1: EOF ----
[...truncated 3 lines...]
[junit4] JVM J2: stderr was not empty, see: /home/jenkins/workspace/Lucene-Solr-7.6-Linux/lucene/build/benchmark/test/temp/junit4-J2-20181205_142226_549617306763942698016.syserr
[junit4] >>> JVM J2 emitted unexpected output (verbatim) ----
[junit4] Java HotSpot(TM) 64-Bit Server VM warning: Option UseConcMarkSweepGC was deprecated in version 9.0 and will likely be removed in a future release.
[junit4] <<< JVM J2: EOF ----
[...truncated 3 lines...]
[junit4] JVM J0: stderr was not empty, see: /home/jenkins/workspace/Lucene-Solr-7.6-Linux/lucene/build/benchmark/test/temp/junit4-J0-20181205_142226_54916803454266574068363.syserr
[junit4] >>> JVM J0 emitted unexpected output (verbatim) ----
[junit4] Java HotSpot(TM) 64-Bit Server VM warning: Option UseConcMarkSweepGC was deprecated in version 9.0 and will likely be removed in a future release.
[junit4] <<< JVM J0: EOF ----
[...truncated 253 lines...]
[junit4] JVM J2: stderr was not empty, see: /home/jenkins/workspace/Lucene-Solr-7.6-Linux/lucene/build/classification/test/temp/junit4-J2-20181205_142235_0218550707153881333988.syserr
[junit4] >>> JVM J2 emitted unexpected output (verbatim) ----
[junit4] Java HotSpot(TM) 64-Bit Server VM warning: Option UseConcMarkSweepGC was deprecated in version 9.0 and will likely be removed in a future release.
[junit4] <<< JVM J2: EOF ----
[junit4] JVM J0: stderr was not empty, see: /home/jenkins/workspace/Lucene-Solr-7.6-Linux/lucene/build/classification/test/temp/junit4-J0-20181205_142235_0211716469993776908798.syserr
[junit4] >>> JVM J0 emitted unexpected output (verbatim) ----
[junit4] Java HotSpot(TM) 64-Bit Server VM warning: Option UseConcMarkSweepGC was deprecated in version 9.0 and will likely be removed in a future release.
[junit4] <<< JVM J0: EOF ----
[...truncated 3 lines...]
[junit4] JVM J1: stderr was not empty, see: /home/jenkins/workspace/Lucene-Solr-7.6-Linux/lucene/build/classification/test/temp/junit4-J1-20181205_142235_0211566106392979454140.syserr
[junit4] >>> JVM J1 emitted unexpected output (verbatim) ----
[junit4] Java HotSpot(TM) 64-Bit Server VM warning: Option UseConcMarkSweepGC was deprecated in version 9.0 and will likely be removed in a future release.
[junit4] <<< JVM J1: EOF ----
[...truncated 208 lines...]
[junit4] JVM J0: stderr was not empty, see: /home/jenkins/workspace/Lucene-Solr-7.6-Linux/lucene/build/codecs/test/temp/junit4-J0-20181205_142243_8507051113776292548815.syserr
[junit4] >>> JVM J0 emitted unexpected output (verbatim) ----
[junit4] Java HotSpot(TM) 64-Bit Server VM warning: Option UseConcMarkSweepGC was deprecated in version 9.0 and will likely be removed in a future release.
[junit4] <<< JVM J0: EOF ----
[...truncated 62 lines...]
[junit4] JVM J2: stderr was not empty, see: /home/jenkins/workspace/Lucene-Solr-7.6-Linux/lucene/build/codecs/test/temp/junit4-J2-20181205_142243_850111363162485232691.syserr
[junit4] >>> JVM J2 emitted unexpected output (verbatim) ----
[junit4] Java HotSpot(TM) 64-Bit Server VM warning: Option UseConcMarkSweepGC was deprecated in version 9.0 and will likely be removed in a future release.
[junit4] <<< JVM J2: EOF ----
[...truncated 3 lines...]
[junit4] JVM J1: stderr was not empty, see: /home/jenkins/workspace/Lucene-Solr-7.6-Linux/lucene/build/codecs/test/temp/junit4-J1-20181205_142243_85010888270549485435833.syserr
[junit4] >>> JVM J1 emitted unexpected output (verbatim) ----
[junit4] Java HotSpot(TM) 64-Bit Server VM warning: Option UseConcMarkSweepGC was deprecated in version 9.0 and will likely be removed in a future release.
[junit4] <<< JVM J1: EOF ----
[...truncated 236 lines...]
[junit4] JVM J2: stderr was not empty, see: /home/jenkins/workspace/Lucene-Solr-7.6-Linux/lucene/build/demo/test/temp/junit4-J2-20181205_142441_1027189305797221763709.syserr
[junit4] >>> JVM J2 emitted unexpected output (verbatim) ----
[junit4] Java HotSpot(TM) 64-Bit Server VM warning: Option UseConcMarkSweepGC was deprecated in version 9.0 and will likely be removed in a future release.
[junit4] <<< JVM J2: EOF ----
[junit4] JVM J1: stderr was not empty, see: /home/jenkins/workspace/Lucene-Solr-7.6-Linux/lucene/build/demo/test/temp/junit4-J1-20181205_142441_1028623293174637329111.syserr
[junit4] >>> JVM J1 emitted unexpected output (verbatim) ----
[junit4] Java HotSpot(TM) 64-Bit Server VM warning: Option UseConcMarkSweepGC was deprecated in version 9.0 and will likely be removed in a future release.
[junit4] <<< JVM J1: EOF ----
[junit4] JVM J0: stderr was not empty, see: /home/jenkins/workspace/Lucene-Solr-7.6-Linux/lucene/build/demo/test/temp/junit4-J0-20181205_142441_1025537359806114092545.syserr
[junit4] >>> JVM J0 emitted unexpected output (verbatim) ----
[junit4] Java HotSpot(TM) 64-Bit Server VM warning: Option UseConcMarkSweepGC was deprecated in version 9.0 and will likely be removed in a future release.
[junit4] <<< JVM J0: EOF ----
[...truncated 173 lines...]
[junit4] JVM J2: stderr was not empty, see: /home/jenkins/workspace/Lucene-Solr-7.6-Linux/lucene/build/expressions/test/temp/junit4-J2-20181205_142444_0097098059451713675132.syserr
[junit4] >>> JVM J2 emitted unexpected output (verbatim) ----
[junit4] Java HotSpot(TM) 64-Bit Server VM warning: Option UseConcMarkSweepGC was deprecated in version 9.0 and will likely be removed in a future release.
[junit4] <<< JVM J2: EOF ----
[...truncated 3 lines...]
[junit4] JVM J0: stderr was not empty, see: /home/jenkins/workspace/Lucene-Solr-7.6-Linux/lucene/build/expressions/test/temp/junit4-J0-20181205_142444_009816725394517078820.syserr
[junit4] >>> JVM J0 emitted unexpected output (verbatim) ----
[junit4] Java HotSpot(TM) 64-Bit Server VM warning: Option UseConcMarkSweepGC was deprecated in version 9.0 and will likely be removed in a future release.
[junit4] <<< JVM J0: EOF ----
[...truncated 3 lines...]
[junit4] JVM J1: stderr was not empty, see: /home/jenkins/workspace/Lucene-Solr-7.6-Linux/lucene/build/expressions/test/temp/junit4-J1-20181205_142444_00914905380005389555712.syserr
[junit4] >>> JVM J1 emitted unexpected output (verbatim) ----
[junit4] Java HotSpot(TM) 64-Bit Server VM warning: Option UseConcMarkSweepGC was deprecated in version 9.0 and will likely be removed in a future release.
[junit4] <<< JVM J1: EOF ----
[...truncated 234 lines...]
[junit4] JVM J1: stderr was not empty, see: /home/jenkins/workspace/Lucene-Solr-7.6-Linux/lucene/build/facet/test/temp/junit4-J1-20181205_142449_83118010775212363528459.syserr
[junit4] >>> JVM J1 emitted unexpected output (verbatim) ----
[junit4] Java HotSpot(TM) 64-Bit Server VM warning: Option UseConcMarkSweepGC was deprecated in version 9.0 and will likely be removed in a future release.
[junit4] <<< JVM J1: EOF ----
[...truncated 3 lines...]
[junit4] JVM J0: stderr was not empty, see: /home/jenkins/workspace/Lucene-Solr-7.6-Linux/lucene/build/facet/test/temp/junit4-J0-20181205_142449_8319790649513571392253.syserr
[junit4] >>> JVM J0 emitted unexpected output (verbatim) ----
[junit4] Java HotSpot(TM) 64-Bit Server VM warning: Option UseConcMarkSweepGC was deprecated in version 9.0 and will likely be removed in a future release.
[junit4] <<< JVM J0: EOF ----
[...truncated 3 lines...]
[junit4] JVM J2: stderr was not empty, see: /home/jenkins/workspace/Lucene-Solr-7.6-Linux/lucene/build/facet/test/temp/junit4-J2-20181205_142449_8314226331997975273200.syserr
[junit4] >>> JVM J2 emitted unexpected output (verbatim) ----
[junit4] Java HotSpot(TM) 64-Bit Server VM warning: Option UseConcMarkSweepGC was deprecated in version 9.0 and will likely be removed in a future release.
[junit4] <<< JVM J2: EOF ----
[...truncated 182 lines...]
[junit4] JVM J0: stderr was not empty, see: /home/jenkins/workspace/Lucene-Solr-7.6-Linux/lucene/build/grouping/test/temp/junit4-J0-20181205_142521_7553189975910617435941.syserr
[junit4] >>> JVM J0 emitted unexpected output (verbatim) ----
[junit4] Java HotSpot(TM) 64-Bit Server VM warning: Option UseConcMarkSweepGC was deprecated in version 9.0 and will likely be removed in a future release.
[junit4] <<< JVM J0: EOF ----
[...truncated 3 lines...]
[junit4] JVM J1: stderr was not empty, see: /home/jenkins/workspace/Lucene-Solr-7.6-Linux/lucene/build/grouping/test/temp/junit4-J1-20181205_142521_7553261148289898118825.syserr
[junit4] >>> JVM J1 emitted unexpected output (verbatim) ----
[junit4] Java HotSpot(TM) 64-Bit Server VM warning: Option UseConcMarkSweepGC was deprecated in version 9.0 and will likely be removed in a future release.
[junit4] <<< JVM J1: EOF ----
[...truncated 3 lines...]
[junit4] JVM J2: stderr was not empty, see: /home/jenkins/workspace/Lucene-Solr-7.6-Linux/lucene/build/grouping/test/temp/junit4-J2-20181205_142521_75513578624364355150918.syserr
[junit4] >>> JVM J2 emitted unexpected output (verbatim) ----
[junit4] Java HotSpot(TM) 64-Bit Server VM warning: Option UseConcMarkSweepGC was deprecated in version 9.0 and will likely be removed in a future release.
[junit4] <<< JVM J2: EOF ----
[...truncated 239 lines...]
[junit4] JVM J0: stderr was not empty, see: /home/jenkins/workspace/Lucene-Solr-7.6-Linux/lucene/build/highlighter/test/temp/junit4-J0-20181205_142531_55111869089444509560184.syserr
[junit4] >>> JVM J0 emitted unexpected output (verbatim) ----
[junit4] Java HotSpot(TM) 64-Bit Server VM warning: Option UseConcMarkSweepGC was deprecated in version 9.0 and will likely be removed in a future release.
[junit4] <<< JVM J0: EOF ----
[junit4] JVM J1: stderr was not empty, see: /home/jenkins/workspace/Lucene-Solr-7.6-Linux/lucene/build/highlighter/test/temp/junit4-J1-20181205_142531_55115370573977249469765.syserr
[junit4] >>> JVM J1 emitted unexpected output (verbatim) ----
[junit4] Java HotSpot(TM) 64-Bit Server VM warning: Option UseConcMarkSweepGC was deprecated in version 9.0 and will likely be removed in a future release.
[junit4] <<< JVM J1: EOF ----
[...truncated 15 lines...]
[junit4] JVM J2: stderr was not empty, see: /home/jenkins/workspace/Lucene-Solr-7.6-Linux/lucene/build/highlighter/test/temp/junit4-J2-20181205_142531_5519228060320842810656.syserr
[junit4] >>> JVM J2 emitted unexpected output (verbatim) ----
[junit4] Java HotSpot(TM) 64-Bit Server VM warning: Option UseConcMarkSweepGC was deprecated in version 9.0 and will likely be removed in a future release.
[junit4] <<< JVM J2: EOF ----
[...truncated 166 lines...]
[junit4] JVM J1: stderr was not empty, see: /home/jenkins/workspace/Lucene-Solr-7.6-Linux/lucene/build/join/test/temp/junit4-J1-20181205_142546_18312015482806444086933.syserr
[junit4] >>> JVM J1 emitted unexpected output (verbatim) ----
[junit4] Java HotSpot(TM) 64-Bit Server VM warning: Option UseConcMarkSweepGC was deprecated in version 9.0 and will likely be removed in a future release.
[junit4] <<< JVM J1: EOF ----
[...truncated 3 lines...]
[junit4] JVM J2: stderr was not empty, see: /home/jenkins/workspace/Lucene-Solr-7.6-Linux/lucene/build/join/test/temp/junit4-J2-20181205_142546_1834390076741481389745.syserr
[junit4] >>> JVM J2 emitted unexpected output (verbatim) ----
[junit4] Java HotSpot(TM) 64-Bit Server VM warning: Option UseConcMarkSweepGC was deprecated in version 9.0 and will likely be removed in a future release.
[junit4] <<< JVM J2: EOF ----
[...truncated 3 lines...]
[junit4] JVM J0: stderr was not empty, see: /home/jenkins/workspace/Lucene-Solr-7.6-Linux/lucene/build/join/test/temp/junit4-J0-20181205_142546_183453801569999003519.syserr
[junit4] >>> JVM J0 emitted unexpected output (verbatim) ----
[junit4] Java HotSpot(TM) 64-Bit Server VM warning: Option UseConcMarkSweepGC was deprecated in version 9.0 and will likely be removed in a future release.
[junit4] <<< JVM J0: EOF ----
[...truncated 157 lines...]
[junit4] JVM J0: stderr was not empty, see: /home/jenkins/workspace/Lucene-Solr-7.6-Linux/lucene/build/memory/test/temp/junit4-J0-20181205_142600_2219642686772106288460.syserr
[junit4] >>> JVM J0 emitted unexpected output (verbatim) ----
[junit4] Java HotSpot(TM) 64-Bit Server VM warning: Option UseConcMarkSweepGC was deprecated in version 9.0 and will likely be removed in a future release.
[junit4] <<< JVM J0: EOF ----
[...truncated 3 lines...]
[junit4] JVM J1: stderr was not empty, see: /home/jenkins/workspace/Lucene-Solr-7.6-Linux/lucene/build/memory/test/temp/junit4-J1-20181205_142600_22115917641523261411346.syserr
[junit4] >>> JVM J1 emitted unexpected output (verbatim) ----
[junit4] Java HotSpot(TM) 64-Bit Server VM warning: Option UseConcMarkSweepGC was deprecated in version 9.0 and will likely be removed in a future release.
[junit4] <<< JVM J1: EOF ----
[...truncated 189 lines...]
[junit4] JVM J0: stderr was not empty, see: /home/jenkins/workspace/Lucene-Solr-7.6-Linux/lucene/build/misc/test/temp/junit4-J0-20181205_142609_06115223470701085696552.syserr
[junit4] >>> JVM J0 emitted unexpected output (verbatim) ----
[junit4] Java HotSpot(TM) 64-Bit Server VM warning: Option UseConcMarkSweepGC was deprecated in version 9.0 and will likely be removed in a future release.
[junit4] <<< JVM J0: EOF ----
[...truncated 3 lines...]
[junit4] JVM J1: stderr was not empty, see: /home/jenkins/workspace/Lucene-Solr-7.6-Linux/lucene/build/misc/test/temp/junit4-J1-20181205_142609_0617159061806020003390.syserr
[junit4] >>> JVM J1 emitted unexpected output (verbatim) ----
[junit4] Java HotSpot(TM) 64-Bit Server VM warning: Option UseConcMarkSweepGC was deprecated in version 9.0 and will likely be removed in a future release.
[junit4] <<< JVM J1: EOF ----
[...truncated 3 lines...]
[junit4] JVM J2: stderr was not empty, see: /home/jenkins/workspace/Lucene-Solr-7.6-Linux/lucene/build/misc/test/temp/junit4-J2-20181205_142609_061379178889504299477.syserr
[junit4] >>> JVM J2 emitted unexpected output (verbatim) ----
[junit4] Java HotSpot(TM) 64-Bit Server VM warning: Option UseConcMarkSweepGC was deprecated in version 9.0 and will likely be removed in a future release.
[junit4] <<< JVM J2: EOF ----
[...truncated 338 lines...]
[junit4] JVM J0: stderr was not empty, see: /home/jenkins/workspace/Lucene-Solr-7.6-Linux/lucene/build/queries/test/temp/junit4-J0-20181205_142622_95613382747034117128607.syserr
[junit4] >>> JVM J0 emitted unexpected output (verbatim) ----
[junit4] Java HotSpot(TM) 64-Bit Server VM warning: Option UseConcMarkSweepGC was deprecated in version 9.0 and will likely be removed in a future release.
[junit4] <<< JVM J0: EOF ----
[...truncated 3 lines...]
[junit4] JVM J2: stderr was not empty, see: /home/jenkins/workspace/Lucene-Solr-7.6-Linux/lucene/build/queries/test/temp/junit4-J2-20181205_142622_95614661685492670834043.syserr
[junit4] >>> JVM J2 emitted unexpected output (verbatim) ----
[junit4] Java HotSpot(TM) 64-Bit Server VM warning: Option UseConcMarkSweepGC was deprecated in version 9.0 and will likely be removed in a future release.
[junit4] <<< JVM J2: EOF ----
[...truncated 3 lines...]
[junit4] JVM J1: stderr was not empty, see: /home/jenkins/workspace/Lucene-Solr-7.6-Linux/lucene/build/queries/test/temp/junit4-J1-20181205_142622_95612233343341573712173.syserr
[junit4] >>> JVM J1 emitted unexpected output (verbatim) ----
[junit4] Java HotSpot(TM) 64-Bit Server VM warning: Option UseConcMarkSweepGC was deprecated in version 9.0 and will likely be removed in a future release.
[junit4] <<< JVM J1: EOF ----
[...truncated 231 lines...]
[junit4] JVM J0: stderr was not empty, see: /home/jenkins/workspace/Lucene-Solr-7.6-Linux/lucene/build/queryparser/test/temp/junit4-J0-20181205_142630_9741616173022906298570.syserr
[junit4] >>> JVM J0 emitted unexpected output (verbatim) ----
[junit4] Java HotSpot(TM) 64-Bit Server VM warning: Option UseConcMarkSweepGC was deprecated in version 9.0 and will likely be removed in a future release.
[junit4] <<< JVM J0: EOF ----
[...truncated 6 lines...]
[junit4] JVM J1: stderr was not empty, see: /home/jenkins/workspace/Lucene-Solr-7.6-Linux/lucene/build/queryparser/test/temp/junit4-J1-20181205_142630_9744545772511466492549.syserr
[junit4] >>> JVM J1 emitted unexpected output (verbatim) ----
[junit4] Java HotSpot(TM) 64-Bit Server VM warning: Option UseConcMarkSweepGC was deprecated in version 9.0 and will likely be removed in a future release.
[junit4] <<< JVM J1: EOF ----
[junit4] JVM J2: stderr was not empty, see: /home/jenkins/workspace/Lucene-Solr-7.6-Linux/lucene/build/queryparser/test/temp/junit4-J2-20181205_142630_9745665941780833803520.syserr
[junit4] >>> JVM J2 emitted unexpected output (verbatim) ----
[junit4] Java HotSpot(TM) 64-Bit Server VM warning: Option UseConcMarkSweepGC was deprecated in version 9.0 and will likely be removed in a future release.
[junit4] <<< JVM J2: EOF ----
[...truncated 216 lines...]
[junit4] JVM J1: stderr was not empty, see: /home/jenkins/workspace/Lucene-Solr-7.6-Linux/lucene/build/replicator/test/temp/junit4-J1-20181205_142637_2763268439605188123042.syserr
[junit4] >>> JVM J1 emitted unexpected output (verbatim) ----
[junit4] Java HotSpot(TM) 64-Bit Server VM warning: Option UseConcMarkSweepGC was deprecated in version 9.0 and will likely be removed in a future release.
[junit4] <<< JVM J1: EOF ----
[...truncated 3 lines...]
[junit4] JVM J2: stderr was not empty, see: /home/jenkins/workspace/Lucene-Solr-7.6-Linux/lucene/build/replicator/test/temp/junit4-J2-20181205_142637_27610358602139177336888.syserr
[junit4] >>> JVM J2 emitted unexpected output (verbatim) ----
[junit4] Java HotSpot(TM) 64-Bit Server VM warning: Option UseConcMarkSweepGC was deprecated in version 9.0 and will likely be removed in a future release.
[junit4] <<< JVM J2: EOF ----
[...truncated 3 lines...]
[junit4] JVM J0: stderr was not empty, see: /home/jenkins/workspace/Lucene-Solr-7.6-Linux/lucene/build/replicator/test/temp/junit4-J0-20181205_142637_2767518036526774679334.syserr
[junit4] >>> JVM J0 emitted unexpected output (verbatim) ----
[junit4] Java HotSpot(TM) 64-Bit Server VM warning: Option UseConcMarkSweepGC was deprecated in version 9.0 and will likely be removed in a future release.
[junit4] <<< JVM J0: EOF ----
[...truncated 203 lines...]
[junit4] JVM J0: stderr was not empty, see: /home/jenkins/workspace/Lucene-Solr-7.6-Linux/lucene/build/sandbox/test/temp/junit4-J0-20181205_142649_17714920916461453141544.syserr
[junit4] >>> JVM J0 emitted unexpected output (verbatim) ----
[junit4] Java HotSpot(TM) 64-Bit Server VM warning: Option UseConcMarkSweepGC was deprecated in version 9.0 and will likely be removed in a future release.
[junit4] <<< JVM J0: EOF ----
[...truncated 7 lines...]
[junit4] JVM J2: stderr was not empty, see: /home/jenkins/workspace/Lucene-Solr-7.6-Linux/lucene/build/sandbox/test/temp/junit4-J2-20181205_142649_1771934060068781681082.syserr
[junit4] >>> JVM J2 emitted unexpected output (verbatim) ----
[junit4] Java HotSpot(TM) 64-Bit Server VM warning: Option UseConcMarkSweepGC was deprecated in version 9.0 and will likely be removed in a future release.
[junit4] <<< JVM J2: EOF ----
[...truncated 15 lines...]
[junit4] JVM J1: stderr was not empty, see: /home/jenkins/workspace/Lucene-Solr-7.6-Linux/lucene/build/sandbox/test/temp/junit4-J1-20181205_142649_17711433721018327020034.syserr
[junit4] >>> JVM J1 emitted unexpected output (verbatim) ----
[junit4] Java HotSpot(TM) 64-Bit Server VM warning: Option UseConcMarkSweepGC was deprecated in version 9.0 and will likely be removed in a future release.
[junit4] <<< JVM J1: EOF ----
[...truncated 293 lines...]
[junit4] JVM J1: stderr was not empty, see: /home/jenkins/workspace/Lucene-Solr-7.6-Linux/lucene/build/spatial-extras/test/temp/junit4-J1-20181205_142926_05511420384798735328519.syserr
[junit4] >>> JVM J1 emitted unexpected output (verbatim) ----
[junit4] Java HotSpot(TM) 64-Bit Server VM warning: Option UseConcMarkSweepGC was deprecated in version 9.0 and will likely be removed in a future release.
[junit4] <<< JVM J1: EOF ----
[...truncated 9 lines...]
[junit4] JVM J2: stderr was not empty, see: /home/jenkins/workspace/Lucene-Solr-7.6-Linux/lucene/build/spatial-extras/test/temp/junit4-J2-20181205_142926_05513091209847674794370.syserr
[junit4] >>> JVM J2 emitted unexpected output (verbatim) ----
[junit4] Java HotSpot(TM) 64-Bit Server VM warning: Option UseConcMarkSweepGC was deprecated in version 9.0 and will likely be removed in a future release.
[junit4] <<< JVM J2: EOF ----
[...truncated 3 lines...]
[junit4] JVM J0: stderr was not empty, see: /home/jenkins/workspace/Lucene-Solr-7.6-Linux/lucene/build/spatial-extras/test/temp/junit4-J0-20181205_142926_0555656639302065314417.syserr
[junit4] >>> JVM J0 emitted unexpected output (verbatim) ----
[junit4] Java HotSpot(TM) 64-Bit Server VM warning: Option UseConcMarkSweepGC was deprecated in version 9.0 and will likely be removed in a future release.
[junit4] <<< JVM J0: EOF ----
[...truncated 153 lines...]
[junit4] JVM J0: stderr was not empty, see: /home/jenkins/workspace/Lucene-Solr-7.6-Linux/lucene/build/spatial/test/temp/junit4-J0-20181205_142946_23114336249183794657723.syserr
[junit4] >>> JVM J0 emitted unexpected output (verbatim) ----
[junit4] Java HotSpot(TM) 64-Bit Server VM warning: Option UseConcMarkSweepGC was deprecated in version 9.0 and will likely be removed in a future release.
[junit4] <<< JVM J0: EOF ----
[...truncated 184 lines...]
[junit4] JVM J2: stderr was not empty, see: /home/jenkins/workspace/Lucene-Solr-7.6-Linux/lucene/build/spatial3d/test/temp/junit4-J2-20181205_142947_9569594439540629489443.syserr
[junit4] >>> JVM J2 emitted unexpected output (verbatim) ----
[junit4] Java HotSpot(TM) 64-Bit Server VM warning: Option UseConcMarkSweepGC was deprecated in version 9.0 and will likely be removed in a future release.
[junit4] <<< JVM J2: EOF ----
[...truncated 3 lines...]
[junit4] JVM J0: stderr was not empty, see: /home/jenkins/workspace/Lucene-Solr-7.6-Linux/lucene/build/spatial3d/test/temp/junit4-J0-20181205_142947_956234882630346025160.syserr
[junit4] >>> JVM J0 emitted unexpected output (verbatim) ----
[junit4] Java HotSpot(TM) 64-Bit Server VM warning: Option UseConcMarkSweepGC was deprecated in version 9.0 and will likely be removed in a future release.
[junit4] <<< JVM J0: EOF ----
[...truncated 5 lines...]
[junit4] JVM J1: stderr was not empty, see: /home/jenkins/workspace/Lucene-Solr-7.6-Linux/lucene/build/spatial3d/test/temp/junit4-J1-20181205_142947_9562773146513124754464.syserr
[junit4] >>> JVM J1 emitted unexpected output (verbatim) ----
[junit4] Java HotSpot(TM) 64-Bit Server VM warning: Option UseConcMarkSweepGC was deprecated in version 9.0 and will likely be removed in a future release.
[junit4] <<< JVM J1: EOF ----
[...truncated 252 lines...]
[junit4] JVM J2: stderr was not empty, see: /home/jenkins/workspace/Lucene-Solr-7.6-Linux/lucene/build/suggest/test/temp/junit4-J2-20181205_143111_46418409250056895231836.syserr
[junit4] >>> JVM J2 emitted unexpected output (verbatim) ----
[junit4] Java HotSpot(TM) 64-Bit Server VM warning: Option UseConcMarkSweepGC was deprecated in version 9.0 and will likely be removed in a future release.
[junit4] <<< JVM J2: EOF ----
[...truncated 3 lines...]
[junit4] JVM J1: stderr was not empty, see: /home/jenkins/workspace/Lucene-Solr-7.6-Linux/lucene/build/suggest/test/temp/junit4-J1-20181205_143111_4644756095072223659716.syserr
[junit4] >>> JVM J1 emitted unexpected output (verbatim) ----
[junit4] Java HotSpot(TM) 64-Bit Server VM warning: Option UseConcMarkSweepGC was deprecated in version 9.0 and will likely be removed in a future release.
[junit4] <<< JVM J1: EOF ----
[...truncated 12 lines...]
[junit4] JVM J0: stderr was not empty, see: /home/jenkins/workspace/Lucene-Solr-7.6-Linux/lucene/build/suggest/test/temp/junit4-J0-20181205_143111_46412143010523141838526.syserr
[junit4] >>> JVM J0 emitted unexpected output (verbatim) ----
[junit4] Java HotSpot(TM) 64-Bit Server VM warning: Option UseConcMarkSweepGC was deprecated in version 9.0 and will likely be removed in a future release.
[junit4] <<< JVM J0: EOF ----
[...truncated 3582 lines...]
[junit4] Suite: org.apache.solr.cloud.TestTlogReplica
[junit4] 2> Creating dataDir: /home/jenkins/workspace/Lucene-Solr-7.6-Linux/solr/build/solr-core/test/J1/temp/solr.cloud.TestTlogReplica_801E4B7502599BD-001/init-core-data-001
[junit4] 2> 1545566 WARN (SUITE-TestTlogReplica-seed#[801E4B7502599BD]-worker) [ ] o.a.s.SolrTestCaseJ4 startTrackingSearchers: numOpens=9 numCloses=9
[junit4] 2> 1545566 INFO (SUITE-TestTlogReplica-seed#[801E4B7502599BD]-worker) [ ] o.a.s.SolrTestCaseJ4 Using PointFields (NUMERIC_POINTS_SYSPROP=true) w/NUMERIC_DOCVALUES_SYSPROP=false
[junit4] 2> 1545566 INFO (SUITE-TestTlogReplica-seed#[801E4B7502599BD]-worker) [ ] o.a.s.SolrTestCaseJ4 Randomized ssl (true) and clientAuth (true) via: @org.apache.solr.util.RandomizeSSL(reason="", value=0.0/0.0, ssl=0.0/0.0, clientAuth=0.0/0.0)
[junit4] 2> 1545567 INFO (SUITE-TestTlogReplica-seed#[801E4B7502599BD]-worker) [ ] o.a.s.SolrTestCaseJ4 SecureRandom sanity checks: test.solr.allowed.securerandom=null & java.security.egd=file:/dev/./urandom
[junit4] 2> 1545567 INFO (SUITE-TestTlogReplica-seed#[801E4B7502599BD]-worker) [ ] o.a.s.c.MiniSolrCloudCluster Starting cluster of 2 servers in /home/jenkins/workspace/Lucene-Solr-7.6-Linux/solr/build/solr-core/test/J1/temp/solr.cloud.TestTlogReplica_801E4B7502599BD-001/tempDir-001
[junit4] 2> 1545567 INFO (SUITE-TestTlogReplica-seed#[801E4B7502599BD]-worker) [ ] o.a.s.c.ZkTestServer STARTING ZK TEST SERVER
[junit4] 2> 1545568 INFO (Thread-2783) [ ] o.a.s.c.ZkTestServer client port:0.0.0.0/0.0.0.0:0
[junit4] 2> 1545568 INFO (Thread-2783) [ ] o.a.s.c.ZkTestServer Starting server
[junit4] 2> 1545569 ERROR (Thread-2783) [ ] o.a.z.s.ZooKeeperServer ZKShutdownHandler is not registered, so ZooKeeper server won't take any action on ERROR or SHUTDOWN server state changes
[junit4] 2> 1545668 INFO (SUITE-TestTlogReplica-seed#[801E4B7502599BD]-worker) [ ] o.a.s.c.ZkTestServer start zk server on port:43849
[junit4] 2> 1545670 INFO (zkConnectionManagerCallback-3578-thread-1) [ ] o.a.s.c.c.ConnectionManager zkClient has connected
[junit4] 2> 1545674 INFO (jetty-launcher-3575-thread-2) [ ] o.e.j.s.Server jetty-9.4.11.v20180605; built: 2018-06-05T18:24:03.829Z; git: d5fc0523cfa96bfebfbda19606cad384d772f04c; jvm 9.0.4+11
[junit4] 2> 1545674 INFO (jetty-launcher-3575-thread-1) [ ] o.e.j.s.Server jetty-9.4.11.v20180605; built: 2018-06-05T18:24:03.829Z; git: d5fc0523cfa96bfebfbda19606cad384d772f04c; jvm 9.0.4+11
[junit4] 2> 1545675 INFO (jetty-launcher-3575-thread-2) [ ] o.e.j.s.session DefaultSessionIdManager workerName=node0
[junit4] 2> 1545675 INFO (jetty-launcher-3575-thread-2) [ ] o.e.j.s.session No SessionScavenger set, using defaults
[junit4] 2> 1545675 INFO (jetty-launcher-3575-thread-2) [ ] o.e.j.s.session node0 Scavenging every 660000ms
[junit4] 2> 1545675 INFO (jetty-launcher-3575-thread-1) [ ] o.e.j.s.session DefaultSessionIdManager workerName=node0
[junit4] 2> 1545675 INFO (jetty-launcher-3575-thread-1) [ ] o.e.j.s.session No SessionScavenger set, using defaults
[junit4] 2> 1545675 INFO (jetty-launcher-3575-thread-1) [ ] o.e.j.s.session node0 Scavenging every 660000ms
[junit4] 2> 1545675 INFO (jetty-launcher-3575-thread-2) [ ] o.e.j.s.h.ContextHandler Started o.e.j.s.ServletContextHandler@1b1eed7a{/solr,null,AVAILABLE}
[junit4] 2> 1545675 INFO (jetty-launcher-3575-thread-1) [ ] o.e.j.s.h.ContextHandler Started o.e.j.s.ServletContextHandler@5c729a0e{/solr,null,AVAILABLE}
[junit4] 2> 1545675 INFO (jetty-launcher-3575-thread-1) [ ] o.e.j.s.AbstractConnector Started ServerConnector@53ceaff8{SSL,[ssl, http/1.1]}{127.0.0.1:42273}
[junit4] 2> 1545675 INFO (jetty-launcher-3575-thread-2) [ ] o.e.j.s.AbstractConnector Started ServerConnector@55096267{SSL,[ssl, http/1.1]}{127.0.0.1:39021}
[junit4] 2> 1545676 INFO (jetty-launcher-3575-thread-1) [ ] o.e.j.s.Server Started @1545709ms
[junit4] 2> 1545676 INFO (jetty-launcher-3575-thread-2) [ ] o.e.j.s.Server Started @1545709ms
[junit4] 2> 1545676 INFO (jetty-launcher-3575-thread-2) [ ] o.a.s.c.s.e.JettySolrRunner Jetty properties: {hostContext=/solr, hostPort=39021}
[junit4] 2> 1545676 INFO (jetty-launcher-3575-thread-1) [ ] o.a.s.c.s.e.JettySolrRunner Jetty properties: {hostContext=/solr, hostPort=42273}
[junit4] 2> 1545676 ERROR (jetty-launcher-3575-thread-2) [ ] o.a.s.u.StartupLoggingUtils Missing Java Option solr.log.dir. Logging may be missing or incomplete.
[junit4] 2> 1545676 ERROR (jetty-launcher-3575-thread-1) [ ] o.a.s.u.StartupLoggingUtils Missing Java Option solr.log.dir. Logging may be missing or incomplete.
[junit4] 2> 1545676 INFO (jetty-launcher-3575-thread-2) [ ] o.a.s.s.SolrDispatchFilter Using logger factory org.apache.logging.slf4j.Log4jLoggerFactory
[junit4] 2> 1545676 INFO (jetty-launcher-3575-thread-1) [ ] o.a.s.s.SolrDispatchFilter Using logger factory org.apache.logging.slf4j.Log4jLoggerFactory
[junit4] 2> 1545676 INFO (jetty-launcher-3575-thread-2) [ ] o.a.s.s.SolrDispatchFilter ___ _ Welcome to Apache Solr™ version 7.6.0
[junit4] 2> 1545676 INFO (jetty-launcher-3575-thread-1) [ ] o.a.s.s.SolrDispatchFilter ___ _ Welcome to Apache Solr™ version 7.6.0
[junit4] 2> 1545676 INFO (jetty-launcher-3575-thread-2) [ ] o.a.s.s.SolrDispatchFilter / __| ___| |_ _ Starting in cloud mode on port null
[junit4] 2> 1545676 INFO (jetty-launcher-3575-thread-1) [ ] o.a.s.s.SolrDispatchFilter / __| ___| |_ _ Starting in cloud mode on port null
[junit4] 2> 1545676 INFO (jetty-launcher-3575-thread-2) [ ] o.a.s.s.SolrDispatchFilter \__ \/ _ \ | '_| Install dir: null
[junit4] 2> 1545676 INFO (jetty-launcher-3575-thread-1) [ ] o.a.s.s.SolrDispatchFilter \__ \/ _ \ | '_| Install dir: null
[junit4] 2> 1545676 INFO (jetty-launcher-3575-thread-2) [ ] o.a.s.s.SolrDispatchFilter |___/\___/_|_| Start time: 2018-12-05T14:57:53.019291Z
[junit4] 2> 1545676 INFO (jetty-launcher-3575-thread-1) [ ] o.a.s.s.SolrDispatchFilter |___/\___/_|_| Start time: 2018-12-05T14:57:53.019298Z
[junit4] 2> 1545677 INFO (zkConnectionManagerCallback-3581-thread-1) [ ] o.a.s.c.c.ConnectionManager zkClient has connected
[junit4] 2> 1545677 INFO (zkConnectionManagerCallback-3582-thread-1) [ ] o.a.s.c.c.ConnectionManager zkClient has connected
[junit4] 2> 1545677 INFO (jetty-launcher-3575-thread-1) [ ] o.a.s.s.SolrDispatchFilter solr.xml found in ZooKeeper. Loading...
[junit4] 2> 1545677 INFO (jetty-launcher-3575-thread-2) [ ] o.a.s.s.SolrDispatchFilter solr.xml found in ZooKeeper. Loading...
[junit4] 2> 1545679 WARN (NIOServerCxn.Factory:0.0.0.0/0.0.0.0:0) [ ] o.a.z.s.NIOServerCnxn Unable to read additional data from client sessionid 0x1004caa68600002, likely client has closed socket
[junit4] 2> 1545758 INFO (jetty-launcher-3575-thread-1) [ ] o.a.s.c.ZkContainer Zookeeper client=127.0.0.1:43849/solr
[junit4] 2> 1545758 INFO (zkConnectionManagerCallback-3586-thread-1) [ ] o.a.s.c.c.ConnectionManager zkClient has connected
[junit4] 2> 1545759 INFO (zkConnectionManagerCallback-3588-thread-1) [ ] o.a.s.c.c.ConnectionManager zkClient has connected
[junit4] 2> 1545802 INFO (jetty-launcher-3575-thread-1) [n:127.0.0.1:42273_solr ] o.a.s.c.OverseerElectionContext I am going to be the leader 127.0.0.1:42273_solr
[junit4] 2> 1545802 INFO (jetty-launcher-3575-thread-1) [n:127.0.0.1:42273_solr ] o.a.s.c.Overseer Overseer (id=72141888817201156-127.0.0.1:42273_solr-n_0000000000) starting
[junit4] 2> 1545808 INFO (zkConnectionManagerCallback-3595-thread-1) [ ] o.a.s.c.c.ConnectionManager zkClient has connected
[junit4] 2> 1545809 INFO (jetty-launcher-3575-thread-1) [n:127.0.0.1:42273_solr ] o.a.s.c.s.i.ZkClientClusterStateProvider Cluster at 127.0.0.1:43849/solr ready
[junit4] 2> 1545810 INFO (OverseerStateUpdate-72141888817201156-127.0.0.1:42273_solr-n_0000000000) [n:127.0.0.1:42273_solr ] o.a.s.c.Overseer Starting to work on the main queue : 127.0.0.1:42273_solr
[junit4] 2> 1545810 INFO (jetty-launcher-3575-thread-1) [n:127.0.0.1:42273_solr ] o.a.s.c.ZkController Register node as live in ZooKeeper:/live_nodes/127.0.0.1:42273_solr
[junit4] 2> 1545813 INFO (zkCallback-3587-thread-1) [ ] o.a.s.c.c.ZkStateReader Updated live nodes from ZooKeeper... (0) -> (1)
[junit4] 2> 1545820 INFO (zkCallback-3594-thread-1) [ ] o.a.s.c.c.ZkStateReader Updated live nodes from ZooKeeper... (0) -> (1)
[junit4] 2> 1545821 INFO (jetty-launcher-3575-thread-1) [n:127.0.0.1:42273_solr ] o.a.s.h.a.MetricsHistoryHandler No .system collection, keeping metrics history in memory.
[junit4] 2> 1545830 INFO (jetty-launcher-3575-thread-2) [ ] o.a.s.c.ZkContainer Zookeeper client=127.0.0.1:43849/solr
[junit4] 2> 1545832 INFO (jetty-launcher-3575-thread-1) [n:127.0.0.1:42273_solr ] o.a.s.m.r.SolrJmxReporter JMX monitoring for 'solr_42273.solr.node' (registry 'solr.node') enabled at server: com.sun.jmx.mbeanserver.JmxMBeanServer@2a19b0ab
[junit4] 2> 1545836 INFO (zkConnectionManagerCallback-3600-thread-1) [ ] o.a.s.c.c.ConnectionManager zkClient has connected
[junit4] 2> 1545838 INFO (jetty-launcher-3575-thread-1) [n:127.0.0.1:42273_solr ] o.a.s.m.r.SolrJmxReporter JMX monitoring for 'solr_42273.solr.jvm' (registry 'solr.jvm') enabled at server: com.sun.jmx.mbeanserver.JmxMBeanServer@2a19b0ab
[junit4] 2> 1545838 INFO (jetty-launcher-3575-thread-1) [n:127.0.0.1:42273_solr ] o.a.s.m.r.SolrJmxReporter JMX monitoring for 'solr_42273.solr.jetty' (registry 'solr.jetty') enabled at server: com.sun.jmx.mbeanserver.JmxMBeanServer@2a19b0ab
[junit4] 2> 1545839 INFO (jetty-launcher-3575-thread-1) [n:127.0.0.1:42273_solr ] o.a.s.c.CorePropertiesLocator Found 0 core definitions underneath /home/jenkins/workspace/Lucene-Solr-7.6-Linux/solr/build/solr-core/test/J1/temp/solr.cloud.TestTlogReplica_801E4B7502599BD-001/tempDir-001/node1/.
[junit4] 2> 1545841 INFO (zkConnectionManagerCallback-3602-thread-1) [ ] o.a.s.c.c.ConnectionManager zkClient has connected
[junit4] 2> 1545844 INFO (jetty-launcher-3575-thread-2) [n:127.0.0.1:39021_solr ] o.a.s.c.c.ZkStateReader Updated live nodes from ZooKeeper... (0) -> (1)
[junit4] 2> 1545845 INFO (jetty-launcher-3575-thread-2) [n:127.0.0.1:39021_solr ] o.a.s.c.TransientSolrCoreCacheDefault Allocating transient cache for 2147483647 transient cores
[junit4] 2> 1545845 INFO (jetty-launcher-3575-thread-2) [n:127.0.0.1:39021_solr ] o.a.s.c.ZkController Register node as live in ZooKeeper:/live_nodes/127.0.0.1:39021_solr
[junit4] 2> 1545846 INFO (zkCallback-3587-thread-1) [ ] o.a.s.c.c.ZkStateReader Updated live nodes from ZooKeeper... (1) -> (2)
[junit4] 2> 1545846 INFO (zkCallback-3601-thread-1) [ ] o.a.s.c.c.ZkStateReader Updated live nodes from ZooKeeper... (1) -> (2)
[junit4] 2> 1545846 INFO (zkCallback-3594-thread-1) [ ] o.a.s.c.c.ZkStateReader Updated live nodes from ZooKeeper... (1) -> (2)
[junit4] 2> 1545864 INFO (zkConnectionManagerCallback-3609-thread-1) [ ] o.a.s.c.c.ConnectionManager zkClient has connected
[junit4] 2> 1545865 INFO (jetty-launcher-3575-thread-2) [n:127.0.0.1:39021_solr ] o.a.s.c.c.ZkStateReader Updated live nodes from ZooKeeper... (0) -> (2)
[junit4] 2> 1545866 INFO (jetty-launcher-3575-thread-2) [n:127.0.0.1:39021_solr ] o.a.s.c.s.i.ZkClientClusterStateProvider Cluster at 127.0.0.1:43849/solr ready
[junit4] 2> 1545868 INFO (jetty-launcher-3575-thread-2) [n:127.0.0.1:39021_solr ] o.a.s.h.a.MetricsHistoryHandler No .system collection, keeping metrics history in memory.
[junit4] 2> 1545878 INFO (jetty-launcher-3575-thread-2) [n:127.0.0.1:39021_solr ] o.a.s.m.r.SolrJmxReporter JMX monitoring for 'solr_39021.solr.node' (registry 'solr.node') enabled at server: com.sun.jmx.mbeanserver.JmxMBeanServer@2a19b0ab
[junit4] 2> 1545884 INFO (jetty-launcher-3575-thread-2) [n:127.0.0.1:39021_solr ] o.a.s.m.r.SolrJmxReporter JMX monitoring for 'solr_39021.solr.jvm' (registry 'solr.jvm') enabled at server: com.sun.jmx.mbeanserver.JmxMBeanServer@2a19b0ab
[junit4] 2> 1545884 INFO (jetty-launcher-3575-thread-2) [n:127.0.0.1:39021_solr ] o.a.s.m.r.SolrJmxReporter JMX monitoring for 'solr_39021.solr.jetty' (registry 'solr.jetty') enabled at server: com.sun.jmx.mbeanserver.JmxMBeanServer@2a19b0ab
[junit4] 2> 1545885 INFO (jetty-launcher-3575-thread-2) [n:127.0.0.1:39021_solr ] o.a.s.c.CorePropertiesLocator Found 0 core definitions underneath /home/jenkins/workspace/Lucene-Solr-7.6-Linux/solr/build/solr-core/test/J1/temp/solr.cloud.TestTlogReplica_801E4B7502599BD-001/tempDir-001/node2/.
[junit4] 2> 1545903 INFO (zkConnectionManagerCallback-3612-thread-1) [ ] o.a.s.c.c.ConnectionManager zkClient has connected
[junit4] 2> 1545905 INFO (zkConnectionManagerCallback-3617-thread-1) [ ] o.a.s.c.c.ConnectionManager zkClient has connected
[junit4] 2> 1545906 INFO (SUITE-TestTlogReplica-seed#[801E4B7502599BD]-worker) [ ] o.a.s.c.c.ZkStateReader Updated live nodes from ZooKeeper... (0) -> (2)
[junit4] 2> 1545906 INFO (SUITE-TestTlogReplica-seed#[801E4B7502599BD]-worker) [ ] o.a.s.c.s.i.ZkClientClusterStateProvider Cluster at 127.0.0.1:43849/solr ready
[junit4] 2> 1545907 INFO (SUITE-TestTlogReplica-seed#[801E4B7502599BD]-worker) [ ] o.a.s.c.TestTlogReplica Using legacyCloud?: false
[junit4] 2> 1545921 INFO (qtp911409741-14035) [n:127.0.0.1:39021_solr ] o.a.s.h.a.CollectionsHandler Invoked Collection Action :clusterprop with params val=false&name=legacyCloud&action=CLUSTERPROP&wt=javabin&version=2 and sendToOCPQueue=true
[junit4] 2> 1545922 INFO (qtp911409741-14035) [n:127.0.0.1:39021_solr ] o.a.s.s.HttpSolrCall [admin] webapp=null path=/admin/collections params={val=false&name=legacyCloud&action=CLUSTERPROP&wt=javabin&version=2} status=0 QTime=0
[junit4] 2> 1545934 INFO (TEST-TestTlogReplica.testKillLeader-seed#[801E4B7502599BD]) [ ] o.a.s.SolrTestCaseJ4 ###Starting testKillLeader
[junit4] 2> 1545935 INFO (qtp911409741-14037) [n:127.0.0.1:39021_solr ] o.a.s.h.a.CollectionsHandler Invoked Collection Action :create with params pullReplicas=0&collection.configName=conf&maxShardsPerNode=100&name=tlog_replica_test_kill_leader&nrtReplicas=0&action=CREATE&numShards=1&tlogReplicas=2&wt=javabin&version=2 and sendToOCPQueue=true
[junit4] 2> 1545936 INFO (OverseerThreadFactory-6738-thread-1-processing-n:127.0.0.1:42273_solr) [n:127.0.0.1:42273_solr ] o.a.s.c.a.c.CreateCollectionCmd Create collection tlog_replica_test_kill_leader
[junit4] 2> 1546041 INFO (qtp911409741-14039) [n:127.0.0.1:39021_solr ] o.a.s.s.HttpSolrCall [admin] webapp=null path=/admin/metrics params={prefix=CONTAINER.fs.usableSpace,CONTAINER.fs.totalSpace,CORE.coreName&wt=javabin&version=2&group=solr.node,solr.core} status=0 QTime=0
[junit4] 2> 1546052 INFO (qtp883944814-14038) [n:127.0.0.1:42273_solr ] o.a.s.s.HttpSolrCall [admin] webapp=null path=/admin/metrics params={prefix=CONTAINER.fs.usableSpace,CONTAINER.fs.totalSpace,CORE.coreName&wt=javabin&version=2&group=solr.node,solr.core} status=0 QTime=0
[junit4] 2> 1546057 INFO (OverseerStateUpdate-72141888817201156-127.0.0.1:42273_solr-n_0000000000) [n:127.0.0.1:42273_solr ] o.a.s.c.o.SliceMutator createReplica() {
[junit4] 2> "operation":"ADDREPLICA",
[junit4] 2> "collection":"tlog_replica_test_kill_leader",
[junit4] 2> "shard":"shard1",
[junit4] 2> "core":"tlog_replica_test_kill_leader_shard1_replica_t1",
[junit4] 2> "state":"down",
[junit4] 2> "base_url":"https://127.0.0.1:42273/solr",
[junit4] 2> "type":"TLOG",
[junit4] 2> "waitForFinalState":"false"}
[junit4] 2> 1546057 INFO (OverseerStateUpdate-72141888817201156-127.0.0.1:42273_solr-n_0000000000) [n:127.0.0.1:42273_solr ] o.a.s.c.o.SliceMutator createReplica() {
[junit4] 2> "operation":"ADDREPLICA",
[junit4] 2> "collection":"tlog_replica_test_kill_leader",
[junit4] 2> "shard":"shard1",
[junit4] 2> "core":"tlog_replica_test_kill_leader_shard1_replica_t2",
[junit4] 2> "state":"down",
[junit4] 2> "base_url":"https://127.0.0.1:39021/solr",
[junit4] 2> "type":"TLOG",
[junit4] 2> "waitForFinalState":"false"}
[junit4] 2> 1546262 INFO (qtp883944814-14041) [n:127.0.0.1:42273_solr x:tlog_replica_test_kill_leader_shard1_replica_t1] o.a.s.h.a.CoreAdminOperation core create command qt=/admin/cores&coreNodeName=core_node3&collection.configName=conf&newCollection=true&name=tlog_replica_test_kill_leader_shard1_replica_t1&action=CREATE&numShards=1&collection=tlog_replica_test_kill_leader&shard=shard1&wt=javabin&version=2&replicaType=TLOG
[junit4] 2> 1546262 INFO (qtp911409741-14028) [n:127.0.0.1:39021_solr x:tlog_replica_test_kill_leader_shard1_replica_t2] o.a.s.h.a.CoreAdminOperation core create command qt=/admin/cores&coreNodeName=core_node4&collection.configName=conf&newCollection=true&name=tlog_replica_test_kill_leader_shard1_replica_t2&action=CREATE&numShards=1&collection=tlog_replica_test_kill_leader&shard=shard1&wt=javabin&version=2&replicaType=TLOG
[junit4] 2> 1546262 INFO (qtp883944814-14041) [n:127.0.0.1:42273_solr x:tlog_replica_test_kill_leader_shard1_replica_t1] o.a.s.c.TransientSolrCoreCacheDefault Allocating transient cache for 2147483647 transient cores
[junit4] 2> 1547267 INFO (qtp911409741-14028) [n:127.0.0.1:39021_solr c:tlog_replica_test_kill_leader s:shard1 r:core_node4 x:tlog_replica_test_kill_leader_shard1_replica_t2] o.a.s.c.SolrConfig Using Lucene MatchVersion: 7.6.0
[junit4] 2> 1547267 INFO (qtp883944814-14041) [n:127.0.0.1:42273_solr c:tlog_replica_test_kill_leader s:shard1 r:core_node3 x:tlog_replica_test_kill_leader_shard1_replica_t1] o.a.s.c.SolrConfig Using Lucene MatchVersion: 7.6.0
[junit4] 2> 1547270 INFO (qtp883944814-14041) [n:127.0.0.1:42273_solr c:tlog_replica_test_kill_leader s:shard1 r:core_node3 x:tlog_replica_test_kill_leader_shard1_replica_t1] o.a.s.s.IndexSchema [tlog_replica_test_kill_leader_shard1_replica_t1] Schema name=minimal
[junit4] 2> 1547270 INFO (qtp911409741-14028) [n:127.0.0.1:39021_solr c:tlog_replica_test_kill_leader s:shard1 r:core_node4 x:tlog_replica_test_kill_leader_shard1_replica_t2] o.a.s.s.IndexSchema [tlog_replica_test_kill_leader_shard1_replica_t2] Schema name=minimal
[junit4] 2> 1547277 INFO (qtp883944814-14041) [n:127.0.0.1:42273_solr c:tlog_replica_test_kill_leader s:shard1 r:core_node3 x:tlog_replica_test_kill_leader_shard1_replica_t1] o.a.s.s.IndexSchema Loaded schema minimal/1.1 with uniqueid field id
[junit4] 2> 1547277 INFO (qtp911409741-14028) [n:127.0.0.1:39021_solr c:tlog_replica_test_kill_leader s:shard1 r:core_node4 x:tlog_replica_test_kill_leader_shard1_replica_t2] o.a.s.s.IndexSchema Loaded schema minimal/1.1 with uniqueid field id
[junit4] 2> 1547277 INFO (qtp911409741-14028) [n:127.0.0.1:39021_solr c:tlog_replica_test_kill_leader s:shard1 r:core_node4 x:tlog_replica_test_kill_leader_shard1_replica_t2] o.a.s.c.CoreContainer Creating SolrCore 'tlog_replica_test_kill_leader_shard1_replica_t2' using configuration from collection tlog_replica_test_kill_leader, trusted=true
[junit4] 2> 1547277 INFO (qtp883944814-14041) [n:127.0.0.1:42273_solr c:tlog_replica_test_kill_leader s:shard1 r:core_node3 x:tlog_replica_test_kill_leader_shard1_replica_t1] o.a.s.c.CoreContainer Creating SolrCore 'tlog_replica_test_kill_leader_shard1_replica_t1' using configuration from collection tlog_replica_test_kill_leader, trusted=true
[junit4] 2> 1547278 INFO (qtp911409741-14028) [n:127.0.0.1:39021_solr c:tlog_replica_test_kill_leader s:shard1 r:core_node4 x:tlog_replica_test_kill_leader_shard1_replica_t2] o.a.s.m.r.SolrJmxReporter JMX monitoring for 'solr_39021.solr.core.tlog_replica_test_kill_leader.shard1.replica_t2' (registry 'solr.core.tlog_replica_test_kill_leader.shard1.replica_t2') enabled at server: com.sun.jmx.mbeanserver.JmxMBeanServer@2a19b0ab
[junit4] 2> 1547278 INFO (qtp883944814-14041) [n:127.0.0.1:42273_solr c:tlog_replica_test_kill_leader s:shard1 r:core_node3 x:tlog_replica_test_kill_leader_shard1_replica_t1] o.a.s.m.r.SolrJmxReporter JMX monitoring for 'solr_42273.solr.core.tlog_replica_test_kill_leader.shard1.replica_t1' (registry 'solr.core.tlog_replica_test_kill_leader.shard1.replica_t1') enabled at server: com.sun.jmx.mbeanserver.JmxMBeanServer@2a19b0ab
[junit4] 2> 1547278 INFO (qtp883944814-14041) [n:127.0.0.1:42273_solr c:tlog_replica_test_kill_leader s:shard1 r:core_node3 x:tlog_replica_test_kill_leader_shard1_replica_t1] o.a.s.c.SolrCore [[tlog_replica_test_kill_leader_shard1_replica_t1] ] Opening new SolrCore at [/home/jenkins/workspace/Lucene-Solr-7.6-Linux/solr/build/solr-core/test/J1/temp/solr.cloud.TestTlogReplica_801E4B7502599BD-001/tempDir-001/node1/tlog_replica_test_kill_leader_shard1_replica_t1], dataDir=[/home/jenkins/workspace/Lucene-Solr-7.6-Linux/solr/build/solr-core/test/J1/temp/solr.cloud.TestTlogReplica_801E4B7502599BD-001/tempDir-001/node1/./tlog_replica_test_kill_leader_shard1_replica_t1/data/]
[junit4] 2> 1547278 INFO (qtp911409741-14028) [n:127.0.0.1:39021_solr c:tlog_replica_test_kill_leader s:shard1 r:core_node4 x:tlog_replica_test_kill_leader_shard1_replica_t2] o.a.s.c.SolrCore [[tlog_replica_test_kill_leader_shard1_replica_t2] ] Opening new SolrCore at [/home/jenkins/workspace/Lucene-Solr-7.6-Linux/solr/build/solr-core/test/J1/temp/solr.cloud.TestTlogReplica_801E4B7502599BD-001/tempDir-001/node2/tlog_replica_test_kill_leader_shard1_replica_t2], dataDir=[/home/jenkins/workspace/Lucene-Solr-7.6-Linux/solr/build/solr-core/test/J1/temp/solr.cloud.TestTlogReplica_801E4B7502599BD-001/tempDir-001/node2/./tlog_replica_test_kill_leader_shard1_replica_t2/data/]
[junit4] 2> 1547308 INFO (qtp911409741-14028) [n:127.0.0.1:39021_solr c:tlog_replica_test_kill_leader s:shard1 r:core_node4 x:tlog_replica_test_kill_leader_shard1_replica_t2] o.a.s.u.UpdateHandler Using UpdateLog implementation: org.apache.solr.update.UpdateLog
[junit4] 2> 1547308 INFO (qtp883944814-14041) [n:127.0.0.1:42273_solr c:tlog_replica_test_kill_leader s:shard1 r:core_node3 x:tlog_replica_test_kill_leader_shard1_replica_t1] o.a.s.u.UpdateHandler Using UpdateLog implementation: org.apache.solr.update.UpdateLog
[junit4] 2> 1547308 INFO (qtp911409741-14028) [n:127.0.0.1:39021_solr c:tlog_replica_test_kill_leader s:shard1 r:core_node4 x:tlog_replica_test_kill_leader_shard1_replica_t2] o.a.s.u.UpdateLog Initializing UpdateLog: dataDir=null defaultSyncLevel=FLUSH numRecordsToKeep=100 maxNumLogsToKeep=10 numVersionBuckets=65536
[junit4] 2> 1547308 INFO (qtp883944814-14041) [n:127.0.0.1:42273_solr c:tlog_replica_test_kill_leader s:shard1 r:core_node3 x:tlog_replica_test_kill_leader_shard1_replica_t1] o.a.s.u.UpdateLog Initializing UpdateLog: dataDir=null defaultSyncLevel=FLUSH numRecordsToKeep=100 maxNumLogsToKeep=10 numVersionBuckets=65536
[junit4] 2> 1547309 INFO (qtp883944814-14041) [n:127.0.0.1:42273_solr c:tlog_replica_test_kill_leader s:shard1 r:core_node3 x:tlog_replica_test_kill_leader_shard1_replica_t1] o.a.s.u.CommitTracker Hard AutoCommit: disabled
[junit4] 2> 1547309 INFO (qtp911409741-14028) [n:127.0.0.1:39021_solr c:tlog_replica_test_kill_leader s:shard1 r:core_node4 x:tlog_replica_test_kill_leader_shard1_replica_t2] o.a.s.u.CommitTracker Hard AutoCommit: disabled
[junit4] 2> 1547309 INFO (qtp883944814-14041) [n:127.0.0.1:42273_solr c:tlog_replica_test_kill_leader s:shard1 r:core_node3 x:tlog_replica_test_kill_leader_shard1_replica_t1] o.a.s.u.CommitTracker Soft AutoCommit: disabled
[junit4] 2> 1547309 INFO (qtp911409741-14028) [n:127.0.0.1:39021_solr c:tlog_replica_test_kill_leader s:shard1 r:core_node4 x:tlog_replica_test_kill_leader_shard1_replica_t2] o.a.s.u.CommitTracker Soft AutoCommit: disabled
[junit4] 2> 1547310 INFO (qtp883944814-14041) [n:127.0.0.1:42273_solr c:tlog_replica_test_kill_leader s:shard1 r:core_node3 x:tlog_replica_test_kill_leader_shard1_replica_t1] o.a.s.s.SolrIndexSearcher Opening [Searcher@6a58a9e[tlog_replica_test_kill_leader_shard1_replica_t1] main]
[junit4] 2> 1547310 INFO (qtp911409741-14028) [n:127.0.0.1:39021_solr c:tlog_replica_test_kill_leader s:shard1 r:core_node4 x:tlog_replica_test_kill_leader_shard1_replica_t2] o.a.s.s.SolrIndexSearcher Opening [Searcher@7be403ea[tlog_replica_test_kill_leader_shard1_replica_t2] main]
[junit4] 2> 1547311 INFO (qtp883944814-14041) [n:127.0.0.1:42273_solr c:tlog_replica_test_kill_leader s:shard1 r:core_node3 x:tlog_replica_test_kill_leader_shard1_replica_t1] o.a.s.r.ManagedResourceStorage Configured ZooKeeperStorageIO with znodeBase: /configs/conf
[junit4] 2> 1547311 INFO (qtp911409741-14028) [n:127.0.0.1:39021_solr c:tlog_replica_test_kill_leader s:shard1 r:core_node4 x:tlog_replica_test_kill_leader_shard1_replica_t2] o.a.s.r.ManagedResourceStorage Configured ZooKeeperStorageIO with znodeBase: /configs/conf
[junit4] 2> 1547311 INFO (qtp883944814-14041) [n:127.0.0.1:42273_solr c:tlog_replica_test_kill_leader s:shard1 r:core_node3 x:tlog_replica_test_kill_leader_shard1_replica_t1] o.a.s.r.ManagedResourceStorage Loaded null at path _rest_managed.json using ZooKeeperStorageIO:path=/configs/conf
[junit4] 2> 1547311 INFO (qtp911409741-14028) [n:127.0.0.1:39021_solr c:tlog_replica_test_kill_leader s:shard1 r:core_node4 x:tlog_replica_test_kill_leader_shard1_replica_t2] o.a.s.r.ManagedResourceStorage Loaded null at path _rest_managed.json using ZooKeeperStorageIO:path=/configs/conf
[junit4] 2> 1547311 INFO (qtp883944814-14041) [n:127.0.0.1:42273_solr c:tlog_replica_test_kill_leader s:shard1 r:core_node3 x:tlog_replica_test_kill_leader_shard1_replica_t1] o.a.s.h.ReplicationHandler Commits will be reserved for 10000ms.
[junit4] 2> 1547311 INFO (qtp911409741-14028) [n:127.0.0.1:39021_solr c:tlog_replica_test_kill_leader s:shard1 r:core_node4 x:tlog_replica_test_kill_leader_shard1_replica_t2] o.a.s.h.ReplicationHandler Commits will be reserved for 10000ms.
[junit4] 2> 1547311 INFO (qtp883944814-14041) [n:127.0.0.1:42273_solr c:tlog_replica_test_kill_leader s:shard1 r:core_node3 x:tlog_replica_test_kill_leader_shard1_replica_t1] o.a.s.u.UpdateLog Could not find max version in index or recent updates, using new clock 1619024281237192704
[junit4] 2> 1547311 INFO (qtp911409741-14028) [n:127.0.0.1:39021_solr c:tlog_replica_test_kill_leader s:shard1 r:core_node4 x:tlog_replica_test_kill_leader_shard1_replica_t2] o.a.s.u.UpdateLog Could not find max version in index or recent updates, using new clock 1619024281237192704
[junit4] 2> 1547312 INFO (searcherExecutor-6751-thread-1-processing-n:127.0.0.1:42273_solr x:tlog_replica_test_kill_leader_shard1_replica_t1 c:tlog_replica_test_kill_leader s:shard1 r:core_node3) [n:127.0.0.1:42273_solr c:tlog_replica_test_kill_leader s:shard1 r:core_node3 x:tlog_replica_test_kill_leader_shard1_replica_t1] o.a.s.c.SolrCore [tlog_replica_test_kill_leader_shard1_replica_t1] Registered new searcher Searcher@6a58a9e[tlog_replica_test_kill_leader_shard1_replica_t1] main{ExitableDirectoryReader(UninvertingDirectoryReader())}
[junit4] 2> 1547313 INFO (searcherExecutor-6750-thread-1-processing-n:127.0.0.1:39021_solr x:tlog_replica_test_kill_leader_shard1_replica_t2 c:tlog_replica_test_kill_leader s:shard1 r:core_node4) [n:127.0.0.1:39021_solr c:tlog_replica_test_kill_leader s:shard1 r:core_node4 x:tlog_replica_test_kill_leader_shard1_replica_t2] o.a.s.c.SolrCore [tlog_replica_test_kill_leader_shard1_replica_t2] Registered new searcher Searcher@7be403ea[tlog_replica_test_kill_leader_shard1_replica_t2] main{ExitableDirectoryReader(UninvertingDirectoryReader())}
[junit4] 2> 1547315 INFO (qtp883944814-14041) [n:127.0.0.1:42273_solr c:tlog_replica_test_kill_leader s:shard1 r:core_node3 x:tlog_replica_test_kill_leader_shard1_replica_t1] o.a.s.c.ZkShardTerms Successful update of terms at /collections/tlog_replica_test_kill_leader/terms/shard1 to Terms{values={core_node3=0}, version=0}
[junit4] 2> 1547315 INFO (qtp911409741-14028) [n:127.0.0.1:39021_solr c:tlog_replica_test_kill_leader s:shard1 r:core_node4 x:tlog_replica_test_kill_leader_shard1_replica_t2] o.a.s.c.ZkShardTerms Failed to save terms, version is not a match, retrying
[junit4] 2> 1547315 INFO (qtp911409741-14028) [n:127.0.0.1:39021_solr c:tlog_replica_test_kill_leader s:shard1 r:core_node4 x:tlog_replica_test_kill_leader_shard1_replica_t2] o.a.s.c.ZkShardTerms Successful update of terms at /collections/tlog_replica_test_kill_leader/terms/shard1 to Terms{values={core_node3=0, core_node4=0}, version=1}
[junit4] 2> 1547316 INFO (qtp911409741-14028) [n:127.0.0.1:39021_solr c:tlog_replica_test_kill_leader s:shard1 r:core_node4 x:tlog_replica_test_kill_leader_shard1_replica_t2] o.a.s.c.ShardLeaderElectionContext Enough replicas found to continue.
[junit4] 2> 1547316 INFO (qtp911409741-14028) [n:127.0.0.1:39021_solr c:tlog_replica_test_kill_leader s:shard1 r:core_node4 x:tlog_replica_test_kill_leader_shard1_replica_t2] o.a.s.c.ShardLeaderElectionContext I may be the new leader - try and sync
[junit4] 2> 1547316 INFO (qtp911409741-14028) [n:127.0.0.1:39021_solr c:tlog_replica_test_kill_leader s:shard1 r:core_node4 x:tlog_replica_test_kill_leader_shard1_replica_t2] o.a.s.c.SyncStrategy Sync replicas to https://127.0.0.1:39021/solr/tlog_replica_test_kill_leader_shard1_replica_t2/
[junit4] 2> 1547317 INFO (qtp911409741-14028) [n:127.0.0.1:39021_solr c:tlog_replica_test_kill_leader s:shard1 r:core_node4 x:tlog_replica_test_kill_leader_shard1_replica_t2] o.a.s.u.PeerSync PeerSync: core=tlog_replica_test_kill_leader_shard1_replica_t2 url=https://127.0.0.1:39021/solr START replicas=[https://127.0.0.1:42273/solr/tlog_replica_test_kill_leader_shard1_replica_t1/] nUpdates=100
[junit4] 2> 1547317 INFO (qtp911409741-14028) [n:127.0.0.1:39021_solr c:tlog_replica_test_kill_leader s:shard1 r:core_node4 x:tlog_replica_test_kill_leader_shard1_replica_t2] o.a.s.u.PeerSync PeerSync: core=tlog_replica_test_kill_leader_shard1_replica_t2 url=https://127.0.0.1:39021/solr DONE. We have no versions. sync failed.
[junit4] 2> 1547319 INFO (qtp883944814-14034) [n:127.0.0.1:42273_solr c:tlog_replica_test_kill_leader s:shard1 r:core_node3 x:tlog_replica_test_kill_leader_shard1_replica_t1] o.a.s.c.S.Request [tlog_replica_test_kill_leader_shard1_replica_t1] webapp=/solr path=/get params={distrib=false&qt=/get&fingerprint=false&getVersions=100&wt=javabin&version=2} status=0 QTime=0
[junit4] 2> 1547319 INFO (qtp911409741-14028) [n:127.0.0.1:39021_solr c:tlog_replica_test_kill_leader s:shard1 r:core_node4 x:tlog_replica_test_kill_leader_shard1_replica_t2] o.a.s.c.SyncStrategy Leader's attempt to sync with shard failed, moving to the next candidate
[junit4] 2> 1547319 INFO (qtp911409741-14028) [n:127.0.0.1:39021_solr c:tlog_replica_test_kill_leader s:shard1 r:core_node4 x:tlog_replica_test_kill_leader_shard1_replica_t2] o.a.s.c.ShardLeaderElectionContext We failed sync, but we have no versions - we can't sync in that case - we were active before, so become leader anyway
[junit4] 2> 1547319 INFO (qtp911409741-14028) [n:127.0.0.1:39021_solr c:tlog_replica_test_kill_leader s:shard1 r:core_node4 x:tlog_replica_test_kill_leader_shard1_replica_t2] o.a.s.c.ShardLeaderElectionContext Found all replicas participating in election, clear LIR
[junit4] 2> 1547319 INFO (qtp911409741-14028) [n:127.0.0.1:39021_solr c:tlog_replica_test_kill_leader s:shard1 r:core_node4 x:tlog_replica_test_kill_leader_shard1_replica_t2] o.a.s.c.ZkController tlog_replica_test_kill_leader_shard1_replica_t2 stopping background replication from leader
[junit4] 2> 1547321 INFO (qtp911409741-14028) [n:127.0.0.1:39021_solr c:tlog_replica_test_kill_leader s:shard1 r:core_node4 x:tlog_replica_test_kill_leader_shard1_replica_t2] o.a.s.c.ShardLeaderElectionContext I am the new leader: https://127.0.0.1:39021/solr/tlog_replica_test_kill_leader_shard1_replica_t2/ shard1
[junit4] 2> 1547473 INFO (qtp911409741-14028) [n:127.0.0.1:39021_solr c:tlog_replica_test_kill_leader s:shard1 r:core_node4 x:tlog_replica_test_kill_leader_shard1_replica_t2] o.a.s.c.ZkController I am the leader, no recovery necessary
[junit4] 2> 1547516 INFO (qtp911409741-14028) [n:127.0.0.1:39021_solr c:tlog_replica_test_kill_leader s:shard1 r:core_node4 x:tlog_replica_test_kill_leader_shard1_replica_t2] o.a.s.s.HttpSolrCall [admin] webapp=null path=/admin/cores params={qt=/admin/cores&coreNodeName=core_node4&collection.configName=conf&newCollection=true&name=tlog_replica_test_kill_leader_shard1_replica_t2&action=CREATE&numShards=1&collection=tlog_replica_test_kill_leader&shard=shard1&wt=javabin&version=2&replicaType=TLOG} status=0 QTime=1254
[junit4] 2> 1547574 INFO (zkCallback-3601-thread-1) [ ] o.a.s.c.c.ZkStateReader A cluster state change: [WatchedEvent state:SyncConnected type:NodeDataChanged path:/collections/tlog_replica_test_kill_leader/state.json] for collection [tlog_replica_test_kill_leader] has occurred - updating... (live nodes size: [2])
[junit4] 2> 1548317 INFO (qtp883944814-14041) [n:127.0.0.1:42273_solr c:tlog_replica_test_kill_leader s:shard1 r:core_node3 x:tlog_replica_test_kill_leader_shard1_replica_t1] o.a.s.c.ZkController tlog_replica_test_kill_leader_shard1_replica_t1 starting background replication from leader
[junit4] 2> 1548317 INFO (qtp883944814-14041) [n:127.0.0.1:42273_solr c:tlog_replica_test_kill_leader s:shard1 r:core_node3 x:tlog_replica_test_kill_leader_shard1_replica_t1] o.a.s.c.ReplicateFromLeader Will start replication from leader with poll interval: 00:00:03
[junit4] 2> 1548317 INFO (qtp883944814-14041) [n:127.0.0.1:42273_solr c:tlog_replica_test_kill_leader s:shard1 r:core_node3 x:tlog_replica_test_kill_leader_shard1_replica_t1] o.a.s.h.ReplicationHandler Poll scheduled at an interval of 3000ms
[junit4] 2> 1548317 INFO (qtp883944814-14041) [n:127.0.0.1:42273_solr c:tlog_replica_test_kill_leader s:shard1 r:core_node3 x:tlog_replica_test_kill_leader_shard1_replica_t1] o.a.s.h.ReplicationHandler Commits will be reserved for 10000ms.
[junit4] 2> 1548352 INFO (qtp883944814-14041) [n:127.0.0.1:42273_solr c:tlog_replica_test_kill_leader s:shard1 r:core_node3 x:tlog_replica_test_kill_leader_shard1_replica_t1] o.a.s.s.HttpSolrCall [admin] webapp=null path=/admin/cores params={qt=/admin/cores&coreNodeName=core_node3&collection.configName=conf&newCollection=true&name=tlog_replica_test_kill_leader_shard1_replica_t1&action=CREATE&numShards=1&collection=tlog_replica_test_kill_leader&shard=shard1&wt=javabin&version=2&replicaType=TLOG} status=0 QTime=2090
[junit4] 2> 1548353 INFO (qtp911409741-14037) [n:127.0.0.1:39021_solr ] o.a.s.h.a.CollectionsHandler Wait for new col
[...truncated too long message...]
ZooKeeper... (1) -> (0)
[junit4] 2> 215530 INFO (jetty-closer-134-thread-2) [ ] o.a.s.c.Overseer Overseer (id=72142008442552345-127.0.0.1:43763_solr-n_0000000005) closing
[junit4] 2> 215530 INFO (OverseerStateUpdate-72142008442552345-127.0.0.1:43763_solr-n_0000000005) [n:127.0.0.1:43763_solr ] o.a.s.c.Overseer Overseer Loop exiting : 127.0.0.1:43763_solr
[junit4] 2> 215530 WARN (OverseerAutoScalingTriggerThread-72142008442552345-127.0.0.1:43763_solr-n_0000000005) [ ] o.a.s.c.a.OverseerTriggerThread OverseerTriggerThread woken up but we are closed, exiting.
[junit4] 2> 215531 WARN (NIOServerCxn.Factory:0.0.0.0/0.0.0.0:0) [ ] o.a.z.s.NIOServerCnxn Unable to read additional data from client sessionid 0x1004cc6429a001d, likely client has closed socket
[junit4] 2> 215532 INFO (jetty-closer-134-thread-1) [ ] o.e.j.s.h.ContextHandler Stopped o.e.j.s.ServletContextHandler@6e8ff651{/solr,null,UNAVAILABLE}
[junit4] 2> 215532 INFO (jetty-closer-134-thread-1) [ ] o.e.j.s.session node0 Stopped scavenging
[junit4] 2> 215532 INFO (jetty-closer-134-thread-2) [ ] o.e.j.s.h.ContextHandler Stopped o.e.j.s.ServletContextHandler@4f20074c{/solr,null,UNAVAILABLE}
[junit4] 2> 215532 INFO (jetty-closer-134-thread-2) [ ] o.e.j.s.session node0 Stopped scavenging
[junit4] 2> 215533 ERROR (SUITE-TestTlogReplica-seed#[801E4B7502599BD]-worker) [ ] o.a.z.s.ZooKeeperServer ZKShutdownHandler is not registered, so ZooKeeper server won't take any action on ERROR or SHUTDOWN server state changes
[junit4] 2> 215533 INFO (SUITE-TestTlogReplica-seed#[801E4B7502599BD]-worker) [ ] o.a.s.c.ZkTestServer connecting to 127.0.0.1:35587 35587
[junit4] 2> 215659 INFO (Thread-98) [ ] o.a.s.c.ZkTestServer connecting to 127.0.0.1:35587 35587
[junit4] 2> 215660 WARN (Thread-98) [ ] o.a.s.c.ZkTestServer Watch limit violations:
[junit4] 2> Maximum concurrent create/delete watches above limit:
[junit4] 2>
[junit4] 2> 32 /solr/configs/conf
[junit4] 2> 30 /solr/collections/tlog_replica_test_create_delete/terms/shard2
[junit4] 2> 30 /solr/collections/tlog_replica_test_create_delete/terms/shard1
[junit4] 2> 20 /solr/collections/tlog_replica_test_remove_leader/terms/shard1
[junit4] 2> 19 /solr/collections/tlog_replica_test_recovery/terms/shard1
[junit4] 2> 16 /solr/collections/tlog_replica_test_basic_leader_election/terms/shard1
[junit4] 2> 16 /solr/collections/tlog_replica_test_kill_leader/terms/shard1
[junit4] 2> 16 /solr/collections/tlog_replica_test_kill_tlog_replica/terms/shard1
[junit4] 2> 15 /solr/aliases.json
[junit4] 2> 15 /solr/collections/tlog_replica_test_add_docs/terms/shard1
[junit4] 2> 14 /solr/collections/tlog_replica_test_out_of_order_db_qwith_in_place_updates/terms/shard1
[junit4] 2> 11 /solr/collections/tlog_replica_test_delete_by_id/terms/shard1
[junit4] 2> 11 /solr/collections/tlog_replica_test_real_time_get/terms/shard1
[junit4] 2> 11 /solr/collections/tlog_replica_test_only_leader_indexes/terms/shard1
[junit4] 2> 8 /solr/collections/tlog_replica_test_add_remove_tlog_replica/terms/shard2
[junit4] 2> 7 /solr/security.json
[junit4] 2> 7 /solr/collections/tlog_replica_test_add_remove_tlog_replica/terms/shard1
[junit4] 2>
[junit4] 2> Maximum concurrent data watches above limit:
[junit4] 2>
[junit4] 2> 21 /solr/collections/tlog_replica_test_create_delete/state.json
[junit4] 2> 15 /solr/collections/tlog_replica_test_out_of_order_db_qwith_in_place_updates/state.json
[junit4] 2> 15 /solr/clusterprops.json
[junit4] 2> 15 /solr/clusterstate.json
[junit4] 2> 13 /solr/collections/tlog_replica_test_kill_leader/state.json
[junit4] 2> 13 /solr/collections/tlog_replica_test_kill_tlog_replica/state.json
[junit4] 2> 11 /solr/collections/tlog_replica_test_recovery/state.json
[junit4] 2> 10 /solr/collections/tlog_replica_test_basic_leader_election/state.json
[junit4] 2> 9 /solr/collections/tlog_replica_test_remove_leader/state.json
[junit4] 2> 5 /solr/collections/tlog_replica_test_add_docs/state.json
[junit4] 2> 4 /solr/autoscaling.json
[junit4] 2> 3 /solr/collections/tlog_replica_test_create_delete/leader_elect/shard1/election/72142008442552349-core_node7-n_0000000001
[junit4] 2> 3 /solr/collections/tlog_replica_test_add_remove_tlog_replica/state.json
[junit4] 2> 3 /solr/collections/tlog_replica_test_real_time_get/state.json
[junit4] 2> 3 /solr/collections/tlog_replica_test_only_leader_indexes/state.json
[junit4] 2> 3 /solr/collections/tlog_replica_test_delete_by_id/state.json
[junit4] 2> 2 /solr/collections/tlog_replica_test_kill_tlog_replica/leader_elect/shard1/election/72142008442552337-core_node4-n_0000000000
[junit4] 2> 2 /solr/overseer_elect/election/72142008442552324-127.0.0.1:35939_solr-n_0000000000
[junit4] 2> 2 /solr/collections/tlog_replica_test_recovery/leader_elect/shard1/election/72142008442552337-core_node4-n_0000000000
[junit4] 2> 2 /solr/collections/tlog_replica_test_create_delete/leader_elect/shard2/election/72142008442552349-core_node15-n_0000000000
[junit4] 2> 2 /solr/collections/tlog_replica_test_add_docs/leader_elect/shard1/election/72142008442552324-core_node6-n_0000000000
[junit4] 2> 2 /solr/overseer_elect/election/72142008442552337-127.0.0.1:35939_solr-n_0000000003
[junit4] 2>
[junit4] 2> Maximum concurrent children watches above limit:
[junit4] 2>
[junit4] 2> 15 /solr/live_nodes
[junit4] 2> 15 /solr/collections
[junit4] 2> 4 /solr/overseer/queue
[junit4] 2> 4 /solr/autoscaling/events/.scheduled_maintenance
[junit4] 2> 4 /solr/autoscaling/events/.auto_add_replicas
[junit4] 2> 4 /solr/overseer/collection-queue-work
[junit4] 2> 4 /solr/overseer/queue-work
[junit4] 2>
[junit4] 2> NOTE: leaving temporary files on disk at: /home/jenkins/workspace/Lucene-Solr-7.6-Linux/solr/build/solr-core/test/J1/temp/solr.cloud.TestTlogReplica_801E4B7502599BD-002
[junit4] 2> Dec 05, 2018 3:30:00 PM com.carrotsearch.randomizedtesting.ThreadLeakControl checkThreadLeaks
[junit4] 2> WARNING: Will linger awaiting termination of 1 leaked thread(s).
[junit4] 2> NOTE: test params are: codec=Asserting(Lucene70): {foo=Lucene50(blocksize=128), title_s=Lucene50(blocksize=128), id=PostingsFormat(name=Memory), foo_s=Lucene50(blocksize=128)}, docValues:{_version_=DocValuesFormat(name=Lucene70), id=DocValuesFormat(name=Direct), inplace_updatable_int=DocValuesFormat(name=Memory)}, maxPointsInLeafNode=552, maxMBSortInHeap=5.657876896569103, sim=RandomSimilarity(queryNorm=false): {}, locale=gd, timezone=Africa/Sao_Tome
[junit4] 2> NOTE: Linux 4.15.0-39-generic amd64/Oracle Corporation 9.0.4 (64-bit)/cpus=8,threads=1,free=268847800,total=518979584
[junit4] 2> NOTE: All tests run in this JVM: [TestTlogReplica, TestTlogReplica]
[junit4] Completed [4/5 (3!)] on J1 in 102.55s, 13 tests, 1 failure <<< FAILURES!
[...truncated 1 lines...]
[junit4] JVM J1: stderr was not empty, see: /home/jenkins/workspace/Lucene-Solr-7.6-Linux/solr/build/solr-core/test/temp/junit4-J1-20181205_152624_2614109776291199394707.syserr
[junit4] >>> JVM J1 emitted unexpected output (verbatim) ----
[junit4] Java HotSpot(TM) 64-Bit Server VM warning: Option UseConcMarkSweepGC was deprecated in version 9.0 and will likely be removed in a future release.
[junit4] <<< JVM J1: EOF ----
[...truncated 16 lines...]
[junit4] JVM J0: stderr was not empty, see: /home/jenkins/workspace/Lucene-Solr-7.6-Linux/solr/build/solr-core/test/temp/junit4-J0-20181205_152624_2619194752512334485770.syserr
[junit4] >>> JVM J0 emitted unexpected output (verbatim) ----
[junit4] Java HotSpot(TM) 64-Bit Server VM warning: Option UseConcMarkSweepGC was deprecated in version 9.0 and will likely be removed in a future release.
[junit4] <<< JVM J0: EOF ----
[...truncated 12 lines...]
BUILD FAILED
/home/jenkins/workspace/Lucene-Solr-7.6-Linux/lucene/common-build.xml:1567: The following error occurred while executing this line:
/home/jenkins/workspace/Lucene-Solr-7.6-Linux/lucene/common-build.xml:1092: There were test failures: 5 suites, 65 tests, 3 failures [seed: 801E4B7502599BD]
Total time: 3 minutes 48 seconds
[repro] Setting last failure code to 256
[repro] Failures:
[repro] 3/5 failed: org.apache.solr.cloud.TestTlogReplica
[repro] Exiting with code 256
+ mv lucene/build lucene/build.repro
+ mv solr/build solr/build.repro
+ mv lucene/build.orig lucene/build
+ mv solr/build.orig solr/build
Archiving artifacts
Setting ANT_1_8_2_HOME=/var/lib/jenkins/tools/hudson.tasks.Ant_AntInstallation/ANT_1.8.2
[WARNINGS] Parsing warnings in console log with parser Java Compiler (javac)
Setting ANT_1_8_2_HOME=/var/lib/jenkins/tools/hudson.tasks.Ant_AntInstallation/ANT_1.8.2
Setting ANT_1_8_2_HOME=/var/lib/jenkins/tools/hudson.tasks.Ant_AntInstallation/ANT_1.8.2
<Git Blamer> Using GitBlamer to create author and commit information for all warnings.
<Git Blamer> GIT_COMMIT=d764aa2223b229f6522037b6997d642ba031c79c, workspace=/var/lib/jenkins/workspace/Lucene-Solr-7.6-Linux
[WARNINGS] Computing warning deltas based on reference build #63
Recording test results
Setting ANT_1_8_2_HOME=/var/lib/jenkins/tools/hudson.tasks.Ant_AntInstallation/ANT_1.8.2
Build step 'Publish JUnit test result report' changed build result to UNSTABLE
Email was triggered for: Unstable (Test Failures)
Sending email for trigger: Unstable (Test Failures)
Setting ANT_1_8_2_HOME=/var/lib/jenkins/tools/hudson.tasks.Ant_AntInstallation/ANT_1.8.2
Setting ANT_1_8_2_HOME=/var/lib/jenkins/tools/hudson.tasks.Ant_AntInstallation/ANT_1.8.2
Setting ANT_1_8_2_HOME=/var/lib/jenkins/tools/hudson.tasks.Ant_AntInstallation/ANT_1.8.2
Setting ANT_1_8_2_HOME=/var/lib/jenkins/tools/hudson.tasks.Ant_AntInstallation/ANT_1.8.2