You are viewing a plain text version of this content. The canonical link for it is here.
Posted to dev@calcite.apache.org by Apache Jenkins Server <je...@builds.apache.org> on 2025/06/20 00:55:15 UTC

Build failed in Jenkins: Calcite » Calcite-snapshots #1409

See <https://ci-builds.apache.org/job/Calcite/job/Calcite-snapshots/1409/display/redirect?page=changes>

Changes:

[mbudiu] [CALCITE-7061] RelMdSize does not handle nested ARRAY/MAP constructor calls


------------------------------------------
[...truncated 490.44 KiB...]
    > 	at java.util.stream.ForEachOps$ForEachOp.evaluateSequential(ForEachOps.java:150)
    > 	at java.util.stream.ForEachOps$ForEachOp$OfRef.evaluateSequential(ForEachOps.java:173)
    > 	at java.util.stream.AbstractPipeline.evaluate(AbstractPipeline.java:234)
    > 	at java.util.stream.ReferencePipeline.forEach(ReferencePipeline.java:485)
    > 	at java.util.stream.ReferencePipeline$7$1.accept(ReferencePipeline.java:272)
    > 	at java.util.ArrayList$ArrayListSpliterator.forEachRemaining(ArrayList.java:1384)
    > 	at java.util.stream.AbstractPipeline.copyInto(AbstractPipeline.java:482)
    > 	at java.util.stream.AbstractPipeline.wrapAndCopyInto(AbstractPipeline.java:472)
    > 	at java.util.stream.ForEachOps$ForEachOp.evaluateSequential(ForEachOps.java:150)
    > 	at java.util.stream.ForEachOps$ForEachOp$OfRef.evaluateSequential(ForEachOps.java:173)
    > 	at java.util.stream.AbstractPipeline.evaluate(AbstractPipeline.java:234)
    > 	at java.util.stream.ReferencePipeline.forEach(ReferencePipeline.java:485)
    > 	at org.junit.jupiter.engine.descriptor.TestTemplateTestDescriptor.execute(TestTemplateTestDescriptor.java:110)
    > 	at org.junit.jupiter.engine.descriptor.TestTemplateTestDescriptor.execute(TestTemplateTestDescriptor.java:44)
    > 	at org.junit.platform.engine.support.hierarchical.NodeTestTask.lambda$executeRecursively$6(NodeTestTask.java:151)
    > 	at org.junit.platform.engine.support.hierarchical.ThrowableCollector.execute(ThrowableCollector.java:73)
    > 	at org.junit.platform.engine.support.hierarchical.NodeTestTask.lambda$executeRecursively$8(NodeTestTask.java:141)
    > 	at org.junit.platform.engine.support.hierarchical.Node.around(Node.java:137)
    > 	at org.junit.platform.engine.support.hierarchical.NodeTestTask.lambda$executeRecursively$9(NodeTestTask.java:139)
    > 	at org.junit.platform.engine.support.hierarchical.ThrowableCollector.execute(ThrowableCollector.java:73)
    > 	at org.junit.platform.engine.support.hierarchical.NodeTestTask.executeRecursively(NodeTestTask.java:138)
    > 	at org.junit.platform.engine.support.hierarchical.NodeTestTask.execute(NodeTestTask.java:95)
    > 	at org.junit.platform.engine.support.hierarchical.ForkJoinPoolHierarchicalTestExecutorService$ExclusiveTask.compute(ForkJoinPoolHierarchicalTestExecutorService.java:185)
    > 	at org.junit.platform.engine.support.hierarchical.ForkJoinPoolHierarchicalTestExecutorService.invokeAll(ForkJoinPoolHierarchicalTestExecutorService.java:129)
    > 	at org.junit.platform.engine.support.hierarchical.NodeTestTask.lambda$executeRecursively$6(NodeTestTask.java:155)
    > 	at org.junit.platform.engine.support.hierarchical.ThrowableCollector.execute(ThrowableCollector.java:73)
    > 	at org.junit.platform.engine.support.hierarchical.NodeTestTask.lambda$executeRecursively$8(NodeTestTask.java:141)
    > 	at org.junit.platform.engine.support.hierarchical.Node.around(Node.java:137)
    > 	at org.junit.platform.engine.support.hierarchical.NodeTestTask.lambda$executeRecursively$9(NodeTestTask.java:139)
    > 	at org.junit.platform.engine.support.hierarchical.ThrowableCollector.execute(ThrowableCollector.java:73)
    > 	at org.junit.platform.engine.support.hierarchical.NodeTestTask.executeRecursively(NodeTestTask.java:138)
    > 	at org.junit.platform.engine.support.hierarchical.NodeTestTask.execute(NodeTestTask.java:95)
    > 	at org.junit.platform.engine.support.hierarchical.ForkJoinPoolHierarchicalTestExecutorService$ExclusiveTask.compute(ForkJoinPoolHierarchicalTestExecutorService.java:185)
    > 	at java.util.concurrent.RecursiveAction.exec(RecursiveAction.java:189)
    > 	at java.util.concurrent.ForkJoinTask.doExec(ForkJoinTask.java:289)
    > 	at java.util.concurrent.ForkJoinPool$WorkQueue.runTask(ForkJoinPool.java:1056)
    > 	at java.util.concurrent.ForkJoinPool.runWorker(ForkJoinPool.java:1692)
    > 	at java.util.concurrent.ForkJoinWorkerThread.run(ForkJoinWorkerThread.java:175)
    
        at org.junit.jupiter.api.AssertionUtils.fail(AssertionUtils.java:38)
        at org.junit.jupiter.api.Assertions.fail(Assertions.java:135)
        at org.apache.calcite.test.QuidemTest.checkRun(QuidemTest.java:218)
        at org.apache.calcite.test.QuidemTest.test(QuidemTest.java:370)
        at org.junit.platform.commons.util.ReflectionUtils.invokeMethod(ReflectionUtils.java:727)
        at org.junit.jupiter.engine.execution.MethodInvocation.proceed(MethodInvocation.java:60)
        at org.junit.jupiter.engine.execution.InvocationInterceptorChain$ValidatingInvocation.proceed(InvocationInterceptorChain.java:131)
        at org.junit.jupiter.engine.extension.SameThreadTimeoutInvocation.proceed(SameThreadTimeoutInvocation.java:45)
        at org.junit.jupiter.engine.extension.TimeoutExtension.intercept(TimeoutExtension.java:156)
        at org.junit.jupiter.engine.extension.TimeoutExtension.interceptTestableMethod(TimeoutExtension.java:147)
        at org.junit.jupiter.engine.extension.TimeoutExtension.interceptTestTemplateMethod(TimeoutExtension.java:94)
        at org.junit.jupiter.engine.execution.InterceptingExecutableInvoker$ReflectiveInterceptorCall.lambda$ofVoidMethod$0(InterceptingExecutableInvoker.java:103)
        at org.junit.jupiter.engine.execution.InterceptingExecutableInvoker.lambda$invoke$0(InterceptingExecutableInvoker.java:93)
        at org.junit.jupiter.engine.execution.InvocationInterceptorChain$InterceptedInvocation.proceed(InvocationInterceptorChain.java:106)
        at org.junit.jupiter.engine.execution.InvocationInterceptorChain.proceed(InvocationInterceptorChain.java:64)
        at org.junit.jupiter.engine.execution.InvocationInterceptorChain.chainAndInvoke(InvocationInterceptorChain.java:45)
        at org.junit.jupiter.engine.execution.InvocationInterceptorChain.invoke(InvocationInterceptorChain.java:37)
        at org.junit.jupiter.engine.execution.InterceptingExecutableInvoker.invoke(InterceptingExecutableInvoker.java:92)
        at org.junit.jupiter.engine.execution.InterceptingExecutableInvoker.invoke(InterceptingExecutableInvoker.java:86)
        at org.junit.jupiter.engine.descriptor.TestMethodTestDescriptor.lambda$invokeTestMethod$7(TestMethodTestDescriptor.java:217)
        at org.junit.platform.engine.support.hierarchical.ThrowableCollector.execute(ThrowableCollector.java:73)
        at org.junit.jupiter.engine.descriptor.TestMethodTestDescriptor.invokeTestMethod(TestMethodTestDescriptor.java:213)
        at org.junit.jupiter.engine.descriptor.TestMethodTestDescriptor.execute(TestMethodTestDescriptor.java:138)
        at org.junit.jupiter.engine.descriptor.TestMethodTestDescriptor.execute(TestMethodTestDescriptor.java:68)
        at org.junit.platform.engine.support.hierarchical.NodeTestTask.lambda$executeRecursively$6(NodeTestTask.java:151)
        at org.junit.platform.engine.support.hierarchical.ThrowableCollector.execute(ThrowableCollector.java:73)
        at org.junit.platform.engine.support.hierarchical.NodeTestTask.lambda$executeRecursively$8(NodeTestTask.java:141)
        at org.junit.platform.engine.support.hierarchical.Node.around(Node.java:137)
        at org.junit.platform.engine.support.hierarchical.NodeTestTask.lambda$executeRecursively$9(NodeTestTask.java:139)
        at org.junit.platform.engine.support.hierarchical.ThrowableCollector.execute(ThrowableCollector.java:73)
        at org.junit.platform.engine.support.hierarchical.NodeTestTask.executeRecursively(NodeTestTask.java:138)
        at org.junit.platform.engine.support.hierarchical.NodeTestTask.execute(NodeTestTask.java:95)
        at org.junit.platform.engine.support.hierarchical.ForkJoinPoolHierarchicalTestExecutorService$ExclusiveTask.compute(ForkJoinPoolHierarchicalTestExecutorService.java:185)
        at org.junit.platform.engine.support.hierarchical.ForkJoinPoolHierarchicalTestExecutorService.submit(ForkJoinPoolHierarchicalTestExecutorService.java:118)
        at org.junit.platform.engine.support.hierarchical.NodeTestTask$DefaultDynamicTestExecutor.execute(NodeTestTask.java:226)
        at org.junit.platform.engine.support.hierarchical.NodeTestTask$DefaultDynamicTestExecutor.execute(NodeTestTask.java:204)
        at org.junit.jupiter.engine.descriptor.TestTemplateTestDescriptor.execute(TestTemplateTestDescriptor.java:142)
        at org.junit.jupiter.engine.descriptor.TestTemplateTestDescriptor.lambda$execute$2(TestTemplateTestDescriptor.java:110)
        at java.util.stream.ForEachOps$ForEachOp$OfRef.accept(ForEachOps.java:183)
        at java.util.stream.ReferencePipeline$3$1.accept(ReferencePipeline.java:193)
        at java.util.stream.ReferencePipeline$2$1.accept(ReferencePipeline.java:175)
        at java.util.stream.ReferencePipeline$3$1.accept(ReferencePipeline.java:193)
        at java.util.stream.ForEachOps$ForEachOp$OfRef.accept(ForEachOps.java:183)
        at java.util.stream.ReferencePipeline$3$1.accept(ReferencePipeline.java:193)
        at java.util.stream.ReferencePipeline$3$1.accept(ReferencePipeline.java:193)
        at java.util.stream.ReferencePipeline$3$1.accept(ReferencePipeline.java:193)
        at java.util.stream.ForEachOps$ForEachOp$OfRef.accept(ForEachOps.java:183)
        at java.util.stream.ReferencePipeline$3$1.accept(ReferencePipeline.java:193)
        at java.util.ArrayList$ArrayListSpliterator.forEachRemaining(ArrayList.java:1384)
        at java.util.stream.ReferencePipeline$Head.forEach(ReferencePipeline.java:647)
        at java.util.stream.ReferencePipeline$7$1.accept(ReferencePipeline.java:272)
        at java.util.stream.ReferencePipeline$3$1.accept(ReferencePipeline.java:193)
        at java.util.stream.ReferencePipeline$3$1.accept(ReferencePipeline.java:193)
        at java.util.Spliterators$ArraySpliterator.forEachRemaining(Spliterators.java:948)
        at java.util.stream.AbstractPipeline.copyInto(AbstractPipeline.java:482)
        at java.util.stream.AbstractPipeline.wrapAndCopyInto(AbstractPipeline.java:472)
        at java.util.stream.ForEachOps$ForEachOp.evaluateSequential(ForEachOps.java:150)
        at java.util.stream.ForEachOps$ForEachOp$OfRef.evaluateSequential(ForEachOps.java:173)
        at java.util.stream.AbstractPipeline.evaluate(AbstractPipeline.java:234)
        at java.util.stream.ReferencePipeline.forEach(ReferencePipeline.java:485)
        at java.util.stream.ReferencePipeline$7$1.accept(ReferencePipeline.java:272)
        at java.util.stream.ReferencePipeline$3$1.accept(ReferencePipeline.java:193)
        at java.util.stream.ReferencePipeline$3$1.accept(ReferencePipeline.java:193)
        at java.util.stream.ReferencePipeline$3$1.accept(ReferencePipeline.java:193)
        at java.util.ArrayList$ArrayListSpliterator.forEachRemaining(ArrayList.java:1384)
        at java.util.stream.AbstractPipeline.copyInto(AbstractPipeline.java:482)
        at java.util.stream.AbstractPipeline.wrapAndCopyInto(AbstractPipeline.java:472)
        at java.util.stream.ForEachOps$ForEachOp.evaluateSequential(ForEachOps.java:150)
        at java.util.stream.ForEachOps$ForEachOp$OfRef.evaluateSequential(ForEachOps.java:173)
        at java.util.stream.AbstractPipeline.evaluate(AbstractPipeline.java:234)
        at java.util.stream.ReferencePipeline.forEach(ReferencePipeline.java:485)
        at java.util.stream.ReferencePipeline$7$1.accept(ReferencePipeline.java:272)
        at java.util.ArrayList$ArrayListSpliterator.forEachRemaining(ArrayList.java:1384)
        at java.util.stream.AbstractPipeline.copyInto(AbstractPipeline.java:482)
        at java.util.stream.AbstractPipeline.wrapAndCopyInto(AbstractPipeline.java:472)
        at java.util.stream.ForEachOps$ForEachOp.evaluateSequential(ForEachOps.java:150)
        at java.util.stream.ForEachOps$ForEachOp$OfRef.evaluateSequential(ForEachOps.java:173)
        at java.util.stream.AbstractPipeline.evaluate(AbstractPipeline.java:234)
        at java.util.stream.ReferencePipeline.forEach(ReferencePipeline.java:485)
        at org.junit.jupiter.engine.descriptor.TestTemplateTestDescriptor.execute(TestTemplateTestDescriptor.java:110)
        at org.junit.jupiter.engine.descriptor.TestTemplateTestDescriptor.execute(TestTemplateTestDescriptor.java:44)
        at org.junit.platform.engine.support.hierarchical.NodeTestTask.lambda$executeRecursively$6(NodeTestTask.java:151)
        at org.junit.platform.engine.support.hierarchical.ThrowableCollector.execute(ThrowableCollector.java:73)
        at org.junit.platform.engine.support.hierarchical.NodeTestTask.lambda$executeRecursively$8(NodeTestTask.java:141)
        at org.junit.platform.engine.support.hierarchical.Node.around(Node.java:137)
        at org.junit.platform.engine.support.hierarchical.NodeTestTask.lambda$executeRecursively$9(NodeTestTask.java:139)
        at org.junit.platform.engine.support.hierarchical.ThrowableCollector.execute(ThrowableCollector.java:73)
        at org.junit.platform.engine.support.hierarchical.NodeTestTask.executeRecursively(NodeTestTask.java:138)
        at org.junit.platform.engine.support.hierarchical.NodeTestTask.execute(NodeTestTask.java:95)
        at org.junit.platform.engine.support.hierarchical.ForkJoinPoolHierarchicalTestExecutorService$ExclusiveTask.compute(ForkJoinPoolHierarchicalTestExecutorService.java:185)
        at org.junit.platform.engine.support.hierarchical.ForkJoinPoolHierarchicalTestExecutorService.invokeAll(ForkJoinPoolHierarchicalTestExecutorService.java:129)
        at org.junit.platform.engine.support.hierarchical.NodeTestTask.lambda$executeRecursively$6(NodeTestTask.java:155)
        at org.junit.platform.engine.support.hierarchical.ThrowableCollector.execute(ThrowableCollector.java:73)
        at org.junit.platform.engine.support.hierarchical.NodeTestTask.lambda$executeRecursively$8(NodeTestTask.java:141)
        at org.junit.platform.engine.support.hierarchical.Node.around(Node.java:137)
        at org.junit.platform.engine.support.hierarchical.NodeTestTask.lambda$executeRecursively$9(NodeTestTask.java:139)
        at org.junit.platform.engine.support.hierarchical.ThrowableCollector.execute(ThrowableCollector.java:73)
        at org.junit.platform.engine.support.hierarchical.NodeTestTask.executeRecursively(NodeTestTask.java:138)
        at org.junit.platform.engine.support.hierarchical.NodeTestTask.execute(NodeTestTask.java:95)

          0.0sec,    3 completed,   0 failed,   0 skipped, org.apache.calcite.test.CalciteSqlOperatorTest > testCastFormatClauseNumericToString(CastType, SqlOperatorFixture)
          1.7sec,    2 completed,   0 failed,   0 skipped, org.apache.calcite.test.SqlOperatorUnparseTest > testTimestampDiff(boolean)
          2.8sec, org.apache.calcite.test.CalciteSqlOperatorTest > testQuantifyCollectionOperators()
          0.5sec,    3 completed,   0 failed,   0 skipped, org.apache.calcite.test.SqlOperatorUnparseTest > testCastToInterval(CastType, SqlOperatorFixture)
          2.7sec,    3 completed,   0 failed,   0 skipped, org.apache.calcite.test.CalciteSqlOperatorTest > testCastIntervalToNumeric(CastType, SqlOperatorFixture)
          0.1sec,    3 completed,   0 failed,   0 skipped, org.apache.calcite.test.CalciteSqlOperatorTest > testCast(CastType, SqlOperatorFixture)
          2.3sec, org.apache.calcite.test.SqlOperatorUnparseTest > testCastExactNumericLimits(CastType, SqlOperatorFixture)[2], [2] SAFE_CAST, org.apache.calcite.test.SqlOperatorFixtures$SqlOperatorFixtureInvocationHandler@5b2543f5
         13.8sec, org.apache.calcite.test.CoreQuidemTest > test(String)[36], [36] sql/agg.iq
FAILURE 102.6sec,   37 completed,   1 failed,   0 skipped, org.apache.calcite.test.CoreQuidemTest > test(String)
FAILURE 102.6sec,   37 completed,   1 failed,   0 skipped, org.apache.calcite.test.CoreQuidemTest
          2.2sec, org.apache.calcite.test.SqlOperatorUnparseTest > testCastExactNumericLimits(CastType, SqlOperatorFixture)[3], [3] TRY_CAST, org.apache.calcite.test.SqlOperatorFixtures$SqlOperatorFixtureInvocationHandler@232155bc
          6.2sec,    3 completed,   0 failed,   0 skipped, org.apache.calcite.test.SqlOperatorUnparseTest > testCastExactNumericLimits(CastType, SqlOperatorFixture)
          0.6sec,    3 completed,   0 failed,   0 skipped, org.apache.calcite.test.SqlOperatorUnparseTest > testCastDateTime(CastType, SqlOperatorFixture)
          0.3sec,    3 completed,   0 failed,   0 skipped, org.apache.calcite.test.SqlOperatorUnparseTest > testCastFormatClauseStringToDateTime(CastType, SqlOperatorFixture)
          3.6sec,    3 completed,   0 failed,   0 skipped, org.apache.calcite.test.CalciteSqlOperatorTest > testCastFormatClauseDateTimeToString(CastType, SqlOperatorFixture)

SqlOperatorUnparseTest > testXmlTransform() STANDARD_ERROR
    [Fatal Error] :1:2: XML document structures must start and end within the same entity.
          0.4sec,    3 completed,   0 failed,   0 skipped, org.apache.calcite.test.SqlOperatorUnparseTest > testCastTruncates(CastType, SqlOperatorFixture)

> Task :cassandra:test
    2025-06-20 00:52:38,416 [s3-admin-1] WARN  - [s3|localhost/127.0.0.1:9142]  Error while opening new channel (ConnectionInitException: [s3|connecting...] Protocol initialization request, step 1 (STARTUP {CQL_VERSION=3.0.0, DRIVER_NAME=Apache Cassandra Java Driver, DRIVER_VERSION=4.18.1, CLIENT_ID=ee982cfd-2c3e-4588-a44d-4981480a25a8}): failed to send request (io.netty.channel.StacklessClosedChannelException))
    2025-06-20 00:52:38,651 [s1-admin-1] WARN  - [s1|localhost/127.0.0.1:9142]  Error while opening new channel (ConnectionInitException: [s1|connecting...] Protocol initialization request, step 1 (STARTUP {CQL_VERSION=3.0.0, DRIVER_NAME=Apache Cassandra Java Driver, DRIVER_VERSION=4.18.1, CLIENT_ID=966c9193-68ed-4c7f-9e83-ac898ec100d9}): failed to send request (io.netty.channel.StacklessClosedChannelException))
        229.5sec,   23 completed,   0 failed,   0 skipped, Gradle Test Run :cassandra:test

> Task :cassandra:check
> Task :cassandra:build
> Task :cassandra:generateMetadataFileForCassandraPublication SKIPPED

> Task :core:test
          2.5sec,    3 completed,   0 failed,   0 skipped, org.apache.calcite.test.CalciteSqlOperatorTest > testCastWithRoundingToScalar(CastType, SqlOperatorFixture)
          0.4sec,    3 completed,   0 failed,   0 skipped, org.apache.calcite.test.SqlOperatorUnparseTest > testCastDecimalToDoubleToInteger(CastType, SqlOperatorFixture)

> Task :cassandra:publishCassandraPublicationToNexusRepository
> Task :cassandra:publish

> Task :core:test
          2.7sec, org.apache.calcite.test.CalciteSqlOperatorTest > testRandomFunc()
          2.2sec, org.apache.calcite.test.SqlOperatorUnparseTest > testCastToString(CastType, SqlOperatorFixture)[2], [2] SAFE_CAST, org.apache.calcite.test.SqlOperatorFixtures$SqlOperatorFixtureInvocationHandler@63f36290
          2.1sec, org.apache.calcite.test.SqlOperatorUnparseTest > testCastToString(CastType, SqlOperatorFixture)[3], [3] TRY_CAST, org.apache.calcite.test.SqlOperatorFixtures$SqlOperatorFixtureInvocationHandler@4699b48a
          5.5sec,    3 completed,   0 failed,   0 skipped, org.apache.calcite.test.SqlOperatorUnparseTest > testCastToString(CastType, SqlOperatorFixture)
          0.3sec,    3 completed,   0 failed,   0 skipped, org.apache.calcite.test.SqlOperatorUnparseTest > testCastNull(CastType, SqlOperatorFixture)
          2.7sec,    2 completed,   0 failed,   0 skipped, org.apache.calcite.test.CalciteSqlOperatorTest > testTimestampDiff(boolean)
          0.2sec,    3 completed,   0 failed,   0 skipped, org.apache.calcite.test.SqlOperatorUnparseTest > testCastToApproxNumeric(CastType, SqlOperatorFixture)
          0.1sec,    3 completed,   0 failed,   0 skipped, org.apache.calcite.test.SqlOperatorUnparseTest > testCastIntervalToInterval(CastType, SqlOperatorFixture)
          0.3sec,    3 completed,   0 failed,   0 skipped, org.apache.calcite.test.SqlOperatorUnparseTest > testCastToBoolean(CastType, SqlOperatorFixture)
          0.7sec,    3 completed,   0 failed,   0 skipped, org.apache.calcite.test.CalciteSqlOperatorTest > testCastToInterval(CastType, SqlOperatorFixture)
          1.7sec,    3 completed,   0 failed,   0 skipped, org.apache.calcite.test.SqlOperatorUnparseTest > testCastStringToDateTime(CastType, SqlOperatorFixture)
          3.5sec, org.apache.calcite.test.CalciteSqlOperatorTest > testCastExactNumericLimits(CastType, SqlOperatorFixture)[2], [2] SAFE_CAST, org.apache.calcite.test.SqlOperatorFixtures$SqlOperatorFixtureInvocationHandler@7cb8781a

SqlOperatorUnparseTest > testExtractValue() STANDARD_ERROR
    [Fatal Error] :1:14: The markup in the document following the root element must be well-formed.
          3.5sec, org.apache.calcite.test.CalciteSqlOperatorTest > testCastExactNumericLimits(CastType, SqlOperatorFixture)[3], [3] TRY_CAST, org.apache.calcite.test.SqlOperatorFixtures$SqlOperatorFixtureInvocationHandler@72ce190b
          9.0sec,    3 completed,   0 failed,   0 skipped, org.apache.calcite.test.CalciteSqlOperatorTest > testCastExactNumericLimits(CastType, SqlOperatorFixture)
          1.1sec,    3 completed,   0 failed,   0 skipped, org.apache.calcite.test.CalciteSqlOperatorTest > testCastDateTime(CastType, SqlOperatorFixture)
          0.5sec,    3 completed,   0 failed,   0 skipped, org.apache.calcite.test.CalciteSqlOperatorTest > testCastFormatClauseStringToDateTime(CastType, SqlOperatorFixture)

CalciteSqlOperatorTest > testXmlTransform() STANDARD_ERROR
    [Fatal Error] :1:2: XML document structures must start and end within the same entity.
          0.5sec,    3 completed,   0 failed,   0 skipped, org.apache.calcite.test.CalciteSqlOperatorTest > testCastTruncates(CastType, SqlOperatorFixture)
          2.9sec, org.apache.calcite.test.SqlOperatorUnparseTest > testRlikeOperator()
          0.0sec,    3 completed,   0 failed,   0 skipped, org.apache.calcite.test.SqlOperatorUnparseTest > testCastFormatClauseByteToString(CastType, SqlOperatorFixture)
WARNING 139.1sec,  567 completed,   0 failed,   1 skipped, org.apache.calcite.test.SqlOperatorUnparseTest
          0.5sec,    3 completed,   0 failed,   0 skipped, org.apache.calcite.test.CalciteSqlOperatorTest > testCastDecimalToDoubleToInteger(CastType, SqlOperatorFixture)
          3.0sec, org.apache.calcite.test.CalciteSqlOperatorTest > testCastToString(CastType, SqlOperatorFixture)[1], [1] CAST, org.apache.calcite.test.SqlOperatorFixtureImpl@7baec83e
          4.7sec, org.apache.calcite.test.CalciteSqlOperatorTest > testCastToString(CastType, SqlOperatorFixture)[2], [2] SAFE_CAST, org.apache.calcite.test.SqlOperatorFixtures$SqlOperatorFixtureInvocationHandler@25a645c0
          4.8sec, org.apache.calcite.test.CalciteSqlOperatorTest > testCastToString(CastType, SqlOperatorFixture)[3], [3] TRY_CAST, org.apache.calcite.test.SqlOperatorFixtures$SqlOperatorFixtureInvocationHandler@4e0b0f21
         12.6sec,    3 completed,   0 failed,   0 skipped, org.apache.calcite.test.CalciteSqlOperatorTest > testCastToString(CastType, SqlOperatorFixture)
          0.7sec,    3 completed,   0 failed,   0 skipped, org.apache.calcite.test.CalciteSqlOperatorTest > testCastNull(CastType, SqlOperatorFixture)
          2.0sec, org.apache.calcite.test.CalciteSqlOperatorTest > testRandFunc()
          0.5sec,    3 completed,   0 failed,   0 skipped, org.apache.calcite.test.CalciteSqlOperatorTest > testCastToApproxNumeric(CastType, SqlOperatorFixture)
          0.4sec,    3 completed,   0 failed,   0 skipped, org.apache.calcite.test.CalciteSqlOperatorTest > testCastIntervalToInterval(CastType, SqlOperatorFixture)
          0.7sec,    3 completed,   0 failed,   0 skipped, org.apache.calcite.test.CalciteSqlOperatorTest > testCastToBoolean(CastType, SqlOperatorFixture)
          2.1sec, org.apache.calcite.test.CalciteSqlOperatorTest > testSimilarToOperator()
          2.4sec, org.apache.calcite.test.CalciteSqlOperatorTest > testJdbcFn()
          4.1sec,    3 completed,   0 failed,   0 skipped, org.apache.calcite.test.CalciteSqlOperatorTest > testCastStringToDateTime(CastType, SqlOperatorFixture)

CalciteSqlOperatorTest > testExtractValue() STANDARD_ERROR
    [Fatal Error] :1:14: The markup in the document following the root element must be well-formed.
          2.3sec, org.apache.calcite.test.CalciteSqlOperatorTest > testToChar()
          6.0sec, org.apache.calcite.test.CalciteSqlOperatorTest > testRlikeOperator()
          0.0sec,    3 completed,   0 failed,   0 skipped, org.apache.calcite.test.CalciteSqlOperatorTest > testCastFormatClauseByteToString(CastType, SqlOperatorFixture)
WARNING 257.3sec,  569 completed,   0 failed,   1 skipped, org.apache.calcite.test.CalciteSqlOperatorTest
FAILURE 278.4sec, 14890 completed,   1 failed, 106 skipped, Gradle Test Run :core:test

14890 tests completed, 1 failed, 106 skipped

> Task :core:test FAILED

FAILURE: Build failed with an exception.

* What went wrong:
Execution failed for task ':core:test'.
> There were failing tests. See the report at: file://<https://ci-builds.apache.org/job/Calcite/job/Calcite-snapshots/ws/core/build/reports/tests/test/index.html>

Deprecated Gradle features were used in this build, making it incompatible with Gradle 9.0.

You can use '--warning-mode all' to show the individual deprecation warnings and determine if they come from your own scripts or plugins.

For more on this, please refer to https://docs.gradle.org/8.7/userguide/command_line_interface.html#sec:command_line_warnings in the Gradle documentation.

BUILD FAILED in 9m 58s
497 actionable tasks: 497 executed

See the profiling report at: file://<https://ci-builds.apache.org/job/Calcite/job/Calcite-snapshots/ws/build/reports/profile/profile-2025-06-20-00-45-17.html>
A fine-grained performance profile is available: use the --scan option.
Build step 'Invoke Gradle script' changed build result to FAILURE
Build step 'Invoke Gradle script' marked build as failure
Recording test results
[Checks API] No suitable checks publisher found.

Jenkins build is back to normal : Calcite » Calcite-snapshots #1411

Posted by Apache Jenkins Server <je...@builds.apache.org>.
See <https://ci-builds.apache.org/job/Calcite/job/Calcite-snapshots/1411/display/redirect?page=changes>


Build failed in Jenkins: Calcite » Calcite-snapshots #1410

Posted by Apache Jenkins Server <je...@builds.apache.org>.
See <https://ci-builds.apache.org/job/Calcite/job/Calcite-snapshots/1410/display/redirect>

Changes:


------------------------------------------
[...truncated 489.49 KiB...]
    > 	at java.util.stream.ForEachOps$ForEachOp.evaluateSequential(ForEachOps.java:150)
    > 	at java.util.stream.ForEachOps$ForEachOp$OfRef.evaluateSequential(ForEachOps.java:173)
    > 	at java.util.stream.AbstractPipeline.evaluate(AbstractPipeline.java:234)
    > 	at java.util.stream.ReferencePipeline.forEach(ReferencePipeline.java:485)
    > 	at java.util.stream.ReferencePipeline$7$1.accept(ReferencePipeline.java:272)
    > 	at java.util.ArrayList$ArrayListSpliterator.forEachRemaining(ArrayList.java:1384)
    > 	at java.util.stream.AbstractPipeline.copyInto(AbstractPipeline.java:482)
    > 	at java.util.stream.AbstractPipeline.wrapAndCopyInto(AbstractPipeline.java:472)
    > 	at java.util.stream.ForEachOps$ForEachOp.evaluateSequential(ForEachOps.java:150)
    > 	at java.util.stream.ForEachOps$ForEachOp$OfRef.evaluateSequential(ForEachOps.java:173)
    > 	at java.util.stream.AbstractPipeline.evaluate(AbstractPipeline.java:234)
    > 	at java.util.stream.ReferencePipeline.forEach(ReferencePipeline.java:485)
    > 	at org.junit.jupiter.engine.descriptor.TestTemplateTestDescriptor.execute(TestTemplateTestDescriptor.java:110)
    > 	at org.junit.jupiter.engine.descriptor.TestTemplateTestDescriptor.execute(TestTemplateTestDescriptor.java:44)
    > 	at org.junit.platform.engine.support.hierarchical.NodeTestTask.lambda$executeRecursively$6(NodeTestTask.java:151)
    > 	at org.junit.platform.engine.support.hierarchical.ThrowableCollector.execute(ThrowableCollector.java:73)
    > 	at org.junit.platform.engine.support.hierarchical.NodeTestTask.lambda$executeRecursively$8(NodeTestTask.java:141)
    > 	at org.junit.platform.engine.support.hierarchical.Node.around(Node.java:137)
    > 	at org.junit.platform.engine.support.hierarchical.NodeTestTask.lambda$executeRecursively$9(NodeTestTask.java:139)
    > 	at org.junit.platform.engine.support.hierarchical.ThrowableCollector.execute(ThrowableCollector.java:73)
    > 	at org.junit.platform.engine.support.hierarchical.NodeTestTask.executeRecursively(NodeTestTask.java:138)
    > 	at org.junit.platform.engine.support.hierarchical.NodeTestTask.execute(NodeTestTask.java:95)
    > 	at org.junit.platform.engine.support.hierarchical.ForkJoinPoolHierarchicalTestExecutorService$ExclusiveTask.compute(ForkJoinPoolHierarchicalTestExecutorService.java:185)
    > 	at org.junit.platform.engine.support.hierarchical.ForkJoinPoolHierarchicalTestExecutorService.invokeAll(ForkJoinPoolHierarchicalTestExecutorService.java:129)
    > 	at org.junit.platform.engine.support.hierarchical.NodeTestTask.lambda$executeRecursively$6(NodeTestTask.java:155)
    > 	at org.junit.platform.engine.support.hierarchical.ThrowableCollector.execute(ThrowableCollector.java:73)
    > 	at org.junit.platform.engine.support.hierarchical.NodeTestTask.lambda$executeRecursively$8(NodeTestTask.java:141)
    > 	at org.junit.platform.engine.support.hierarchical.Node.around(Node.java:137)
    > 	at org.junit.platform.engine.support.hierarchical.NodeTestTask.lambda$executeRecursively$9(NodeTestTask.java:139)
    > 	at org.junit.platform.engine.support.hierarchical.ThrowableCollector.execute(ThrowableCollector.java:73)
    > 	at org.junit.platform.engine.support.hierarchical.NodeTestTask.executeRecursively(NodeTestTask.java:138)
    > 	at org.junit.platform.engine.support.hierarchical.NodeTestTask.execute(NodeTestTask.java:95)
    > 	at org.junit.platform.engine.support.hierarchical.ForkJoinPoolHierarchicalTestExecutorService$ExclusiveTask.compute(ForkJoinPoolHierarchicalTestExecutorService.java:185)
    > 	at java.util.concurrent.RecursiveAction.exec(RecursiveAction.java:189)
    > 	at java.util.concurrent.ForkJoinTask.doExec(ForkJoinTask.java:289)
    > 	at java.util.concurrent.ForkJoinPool$WorkQueue.runTask(ForkJoinPool.java:1056)
    > 	at java.util.concurrent.ForkJoinPool.runWorker(ForkJoinPool.java:1692)
    > 	at java.util.concurrent.ForkJoinWorkerThread.run(ForkJoinWorkerThread.java:175)
    
        at org.junit.jupiter.api.AssertionUtils.fail(AssertionUtils.java:38)
        at org.junit.jupiter.api.Assertions.fail(Assertions.java:135)
        at org.apache.calcite.test.QuidemTest.checkRun(QuidemTest.java:218)
        at org.apache.calcite.test.QuidemTest.test(QuidemTest.java:370)
        at org.junit.platform.commons.util.ReflectionUtils.invokeMethod(ReflectionUtils.java:727)
        at org.junit.jupiter.engine.execution.MethodInvocation.proceed(MethodInvocation.java:60)
        at org.junit.jupiter.engine.execution.InvocationInterceptorChain$ValidatingInvocation.proceed(InvocationInterceptorChain.java:131)
        at org.junit.jupiter.engine.extension.SameThreadTimeoutInvocation.proceed(SameThreadTimeoutInvocation.java:45)
        at org.junit.jupiter.engine.extension.TimeoutExtension.intercept(TimeoutExtension.java:156)
        at org.junit.jupiter.engine.extension.TimeoutExtension.interceptTestableMethod(TimeoutExtension.java:147)
        at org.junit.jupiter.engine.extension.TimeoutExtension.interceptTestTemplateMethod(TimeoutExtension.java:94)
        at org.junit.jupiter.engine.execution.InterceptingExecutableInvoker$ReflectiveInterceptorCall.lambda$ofVoidMethod$0(InterceptingExecutableInvoker.java:103)
        at org.junit.jupiter.engine.execution.InterceptingExecutableInvoker.lambda$invoke$0(InterceptingExecutableInvoker.java:93)
        at org.junit.jupiter.engine.execution.InvocationInterceptorChain$InterceptedInvocation.proceed(InvocationInterceptorChain.java:106)
        at org.junit.jupiter.engine.execution.InvocationInterceptorChain.proceed(InvocationInterceptorChain.java:64)
        at org.junit.jupiter.engine.execution.InvocationInterceptorChain.chainAndInvoke(InvocationInterceptorChain.java:45)
        at org.junit.jupiter.engine.execution.InvocationInterceptorChain.invoke(InvocationInterceptorChain.java:37)
        at org.junit.jupiter.engine.execution.InterceptingExecutableInvoker.invoke(InterceptingExecutableInvoker.java:92)
        at org.junit.jupiter.engine.execution.InterceptingExecutableInvoker.invoke(InterceptingExecutableInvoker.java:86)
        at org.junit.jupiter.engine.descriptor.TestMethodTestDescriptor.lambda$invokeTestMethod$7(TestMethodTestDescriptor.java:217)
        at org.junit.platform.engine.support.hierarchical.ThrowableCollector.execute(ThrowableCollector.java:73)
        at org.junit.jupiter.engine.descriptor.TestMethodTestDescriptor.invokeTestMethod(TestMethodTestDescriptor.java:213)
        at org.junit.jupiter.engine.descriptor.TestMethodTestDescriptor.execute(TestMethodTestDescriptor.java:138)
        at org.junit.jupiter.engine.descriptor.TestMethodTestDescriptor.execute(TestMethodTestDescriptor.java:68)
        at org.junit.platform.engine.support.hierarchical.NodeTestTask.lambda$executeRecursively$6(NodeTestTask.java:151)
        at org.junit.platform.engine.support.hierarchical.ThrowableCollector.execute(ThrowableCollector.java:73)
        at org.junit.platform.engine.support.hierarchical.NodeTestTask.lambda$executeRecursively$8(NodeTestTask.java:141)
        at org.junit.platform.engine.support.hierarchical.Node.around(Node.java:137)
        at org.junit.platform.engine.support.hierarchical.NodeTestTask.lambda$executeRecursively$9(NodeTestTask.java:139)
        at org.junit.platform.engine.support.hierarchical.ThrowableCollector.execute(ThrowableCollector.java:73)
        at org.junit.platform.engine.support.hierarchical.NodeTestTask.executeRecursively(NodeTestTask.java:138)
        at org.junit.platform.engine.support.hierarchical.NodeTestTask.execute(NodeTestTask.java:95)
        at org.junit.platform.engine.support.hierarchical.ForkJoinPoolHierarchicalTestExecutorService$ExclusiveTask.compute(ForkJoinPoolHierarchicalTestExecutorService.java:185)
        at org.junit.platform.engine.support.hierarchical.ForkJoinPoolHierarchicalTestExecutorService.submit(ForkJoinPoolHierarchicalTestExecutorService.java:118)
        at org.junit.platform.engine.support.hierarchical.NodeTestTask$DefaultDynamicTestExecutor.execute(NodeTestTask.java:226)
        at org.junit.platform.engine.support.hierarchical.NodeTestTask$DefaultDynamicTestExecutor.execute(NodeTestTask.java:204)
        at org.junit.jupiter.engine.descriptor.TestTemplateTestDescriptor.execute(TestTemplateTestDescriptor.java:142)
        at org.junit.jupiter.engine.descriptor.TestTemplateTestDescriptor.lambda$execute$2(TestTemplateTestDescriptor.java:110)
        at java.util.stream.ForEachOps$ForEachOp$OfRef.accept(ForEachOps.java:183)
        at java.util.stream.ReferencePipeline$3$1.accept(ReferencePipeline.java:193)
        at java.util.stream.ReferencePipeline$2$1.accept(ReferencePipeline.java:175)
        at java.util.stream.ReferencePipeline$3$1.accept(ReferencePipeline.java:193)
        at java.util.stream.ForEachOps$ForEachOp$OfRef.accept(ForEachOps.java:183)
        at java.util.stream.ReferencePipeline$3$1.accept(ReferencePipeline.java:193)
        at java.util.stream.ReferencePipeline$3$1.accept(ReferencePipeline.java:193)
        at java.util.stream.ReferencePipeline$3$1.accept(ReferencePipeline.java:193)
        at java.util.stream.ForEachOps$ForEachOp$OfRef.accept(ForEachOps.java:183)
        at java.util.stream.ReferencePipeline$3$1.accept(ReferencePipeline.java:193)
        at java.util.ArrayList$ArrayListSpliterator.forEachRemaining(ArrayList.java:1384)
        at java.util.stream.ReferencePipeline$Head.forEach(ReferencePipeline.java:647)
        at java.util.stream.ReferencePipeline$7$1.accept(ReferencePipeline.java:272)
        at java.util.stream.ReferencePipeline$3$1.accept(ReferencePipeline.java:193)
        at java.util.stream.ReferencePipeline$3$1.accept(ReferencePipeline.java:193)
        at java.util.Spliterators$ArraySpliterator.forEachRemaining(Spliterators.java:948)
        at java.util.stream.AbstractPipeline.copyInto(AbstractPipeline.java:482)
        at java.util.stream.AbstractPipeline.wrapAndCopyInto(AbstractPipeline.java:472)
        at java.util.stream.ForEachOps$ForEachOp.evaluateSequential(ForEachOps.java:150)
        at java.util.stream.ForEachOps$ForEachOp$OfRef.evaluateSequential(ForEachOps.java:173)
        at java.util.stream.AbstractPipeline.evaluate(AbstractPipeline.java:234)
        at java.util.stream.ReferencePipeline.forEach(ReferencePipeline.java:485)
        at java.util.stream.ReferencePipeline$7$1.accept(ReferencePipeline.java:272)
        at java.util.stream.ReferencePipeline$3$1.accept(ReferencePipeline.java:193)
        at java.util.stream.ReferencePipeline$3$1.accept(ReferencePipeline.java:193)
        at java.util.stream.ReferencePipeline$3$1.accept(ReferencePipeline.java:193)
        at java.util.ArrayList$ArrayListSpliterator.forEachRemaining(ArrayList.java:1384)
        at java.util.stream.AbstractPipeline.copyInto(AbstractPipeline.java:482)
        at java.util.stream.AbstractPipeline.wrapAndCopyInto(AbstractPipeline.java:472)
        at java.util.stream.ForEachOps$ForEachOp.evaluateSequential(ForEachOps.java:150)
        at java.util.stream.ForEachOps$ForEachOp$OfRef.evaluateSequential(ForEachOps.java:173)
        at java.util.stream.AbstractPipeline.evaluate(AbstractPipeline.java:234)
        at java.util.stream.ReferencePipeline.forEach(ReferencePipeline.java:485)
        at java.util.stream.ReferencePipeline$7$1.accept(ReferencePipeline.java:272)
        at java.util.ArrayList$ArrayListSpliterator.forEachRemaining(ArrayList.java:1384)
        at java.util.stream.AbstractPipeline.copyInto(AbstractPipeline.java:482)
        at java.util.stream.AbstractPipeline.wrapAndCopyInto(AbstractPipeline.java:472)
        at java.util.stream.ForEachOps$ForEachOp.evaluateSequential(ForEachOps.java:150)
        at java.util.stream.ForEachOps$ForEachOp$OfRef.evaluateSequential(ForEachOps.java:173)
        at java.util.stream.AbstractPipeline.evaluate(AbstractPipeline.java:234)
        at java.util.stream.ReferencePipeline.forEach(ReferencePipeline.java:485)
        at org.junit.jupiter.engine.descriptor.TestTemplateTestDescriptor.execute(TestTemplateTestDescriptor.java:110)
        at org.junit.jupiter.engine.descriptor.TestTemplateTestDescriptor.execute(TestTemplateTestDescriptor.java:44)
        at org.junit.platform.engine.support.hierarchical.NodeTestTask.lambda$executeRecursively$6(NodeTestTask.java:151)
        at org.junit.platform.engine.support.hierarchical.ThrowableCollector.execute(ThrowableCollector.java:73)
        at org.junit.platform.engine.support.hierarchical.NodeTestTask.lambda$executeRecursively$8(NodeTestTask.java:141)
        at org.junit.platform.engine.support.hierarchical.Node.around(Node.java:137)
        at org.junit.platform.engine.support.hierarchical.NodeTestTask.lambda$executeRecursively$9(NodeTestTask.java:139)
        at org.junit.platform.engine.support.hierarchical.ThrowableCollector.execute(ThrowableCollector.java:73)
        at org.junit.platform.engine.support.hierarchical.NodeTestTask.executeRecursively(NodeTestTask.java:138)
        at org.junit.platform.engine.support.hierarchical.NodeTestTask.execute(NodeTestTask.java:95)
        at org.junit.platform.engine.support.hierarchical.ForkJoinPoolHierarchicalTestExecutorService$ExclusiveTask.compute(ForkJoinPoolHierarchicalTestExecutorService.java:185)
        at org.junit.platform.engine.support.hierarchical.ForkJoinPoolHierarchicalTestExecutorService.invokeAll(ForkJoinPoolHierarchicalTestExecutorService.java:129)
        at org.junit.platform.engine.support.hierarchical.NodeTestTask.lambda$executeRecursively$6(NodeTestTask.java:155)
        at org.junit.platform.engine.support.hierarchical.ThrowableCollector.execute(ThrowableCollector.java:73)
        at org.junit.platform.engine.support.hierarchical.NodeTestTask.lambda$executeRecursively$8(NodeTestTask.java:141)
        at org.junit.platform.engine.support.hierarchical.Node.around(Node.java:137)
        at org.junit.platform.engine.support.hierarchical.NodeTestTask.lambda$executeRecursively$9(NodeTestTask.java:139)
        at org.junit.platform.engine.support.hierarchical.ThrowableCollector.execute(ThrowableCollector.java:73)
        at org.junit.platform.engine.support.hierarchical.NodeTestTask.executeRecursively(NodeTestTask.java:138)
        at org.junit.platform.engine.support.hierarchical.NodeTestTask.execute(NodeTestTask.java:95)

          0.1sec,    3 completed,   0 failed,   0 skipped, org.apache.calcite.test.CalciteSqlOperatorTest > testCastBooleanToNumeric(CastType, SqlOperatorFixture)
          0.0sec,    3 completed,   0 failed,   0 skipped, org.apache.calcite.test.CalciteSqlOperatorTest > testCastFormatClauseNumericToString(CastType, SqlOperatorFixture)
          1.4sec,    2 completed,   0 failed,   0 skipped, org.apache.calcite.test.SqlOperatorUnparseTest > testTimestampDiff(boolean)
          2.4sec, org.apache.calcite.test.CalciteSqlOperatorTest > testQuantifyCollectionOperators()
          0.4sec,    3 completed,   0 failed,   0 skipped, org.apache.calcite.test.SqlOperatorUnparseTest > testCastToInterval(CastType, SqlOperatorFixture)
          2.9sec,    3 completed,   0 failed,   0 skipped, org.apache.calcite.test.CalciteSqlOperatorTest > testCastIntervalToNumeric(CastType, SqlOperatorFixture)
          0.1sec,    3 completed,   0 failed,   0 skipped, org.apache.calcite.test.CalciteSqlOperatorTest > testCast(CastType, SqlOperatorFixture)

> Task :cassandra:test
    2025-06-20 01:02:57,187 [s2-admin-1] WARN  - [s2|localhost/127.0.0.1:9142]  Error while opening new channel (ConnectionInitException: [s2|connecting...] Protocol initialization request, step 1 (STARTUP {CQL_VERSION=3.0.0, DRIVER_NAME=Apache Cassandra Java Driver, DRIVER_VERSION=4.18.1, CLIENT_ID=ece8779d-fe61-47d9-b3ad-b9010ebb1206}): failed to send request (io.netty.channel.StacklessClosedChannelException))
    2025-06-20 01:02:57,203 [s1-admin-1] WARN  - [s1|localhost/127.0.0.1:9142]  Error while opening new channel (ConnectionInitException: [s1|connecting...] Protocol initialization request, step 1 (STARTUP {CQL_VERSION=3.0.0, DRIVER_NAME=Apache Cassandra Java Driver, DRIVER_VERSION=4.18.1, CLIENT_ID=135d7eb1-2741-443e-ab69-1f6138e5e9dd}): failed to send request (io.netty.channel.StacklessClosedChannelException))
        228.4sec,   23 completed,   0 failed,   0 skipped, Gradle Test Run :cassandra:test

> Task :cassandra:check
> Task :cassandra:build
> Task :cassandra:generateMetadataFileForCassandraPublication SKIPPED

> Task :core:test
          2.1sec, org.apache.calcite.test.SqlOperatorUnparseTest > testCastExactNumericLimits(CastType, SqlOperatorFixture)[2], [2] SAFE_CAST, org.apache.calcite.test.SqlOperatorFixtures$SqlOperatorFixtureInvocationHandler@7a55337d
         12.4sec, org.apache.calcite.test.CoreQuidemTest > test(String)[36], [36] sql/agg.iq
FAILURE 113.8sec,   37 completed,   1 failed,   0 skipped, org.apache.calcite.test.CoreQuidemTest > test(String)
FAILURE 113.8sec,   37 completed,   1 failed,   0 skipped, org.apache.calcite.test.CoreQuidemTest
          5.7sec,    3 completed,   0 failed,   0 skipped, org.apache.calcite.test.SqlOperatorUnparseTest > testCastExactNumericLimits(CastType, SqlOperatorFixture)

> Task :cassandra:publishCassandraPublicationToNexusRepository
> Task :cassandra:publish

> Task :core:test
          0.6sec,    3 completed,   0 failed,   0 skipped, org.apache.calcite.test.SqlOperatorUnparseTest > testCastDateTime(CastType, SqlOperatorFixture)
          0.2sec,    3 completed,   0 failed,   0 skipped, org.apache.calcite.test.SqlOperatorUnparseTest > testCastFormatClauseStringToDateTime(CastType, SqlOperatorFixture)
          3.8sec,    3 completed,   0 failed,   0 skipped, org.apache.calcite.test.CalciteSqlOperatorTest > testCastFormatClauseDateTimeToString(CastType, SqlOperatorFixture)

SqlOperatorUnparseTest > testXmlTransform() STANDARD_ERROR
    [Fatal Error] :1:2: XML document structures must start and end within the same entity.
          0.3sec,    3 completed,   0 failed,   0 skipped, org.apache.calcite.test.SqlOperatorUnparseTest > testCastTruncates(CastType, SqlOperatorFixture)
          2.1sec, org.apache.calcite.test.CalciteSqlOperatorTest > testRightFunc()
          1.6sec,    3 completed,   0 failed,   0 skipped, org.apache.calcite.test.CalciteSqlOperatorTest > testCastWithRoundingToScalar(CastType, SqlOperatorFixture)
          0.3sec,    3 completed,   0 failed,   0 skipped, org.apache.calcite.test.SqlOperatorUnparseTest > testCastDecimalToDoubleToInteger(CastType, SqlOperatorFixture)
          2.8sec, org.apache.calcite.test.CalciteSqlOperatorTest > testRandomFunc()
          4.7sec,    3 completed,   0 failed,   0 skipped, org.apache.calcite.test.SqlOperatorUnparseTest > testCastToString(CastType, SqlOperatorFixture)
          0.3sec,    3 completed,   0 failed,   0 skipped, org.apache.calcite.test.SqlOperatorUnparseTest > testCastNull(CastType, SqlOperatorFixture)
          0.2sec,    3 completed,   0 failed,   0 skipped, org.apache.calcite.test.SqlOperatorUnparseTest > testCastToApproxNumeric(CastType, SqlOperatorFixture)
          0.1sec,    3 completed,   0 failed,   0 skipped, org.apache.calcite.test.SqlOperatorUnparseTest > testCastIntervalToInterval(CastType, SqlOperatorFixture)
          2.7sec,    2 completed,   0 failed,   0 skipped, org.apache.calcite.test.CalciteSqlOperatorTest > testTimestampDiff(boolean)
          0.3sec,    3 completed,   0 failed,   0 skipped, org.apache.calcite.test.SqlOperatorUnparseTest > testCastToBoolean(CastType, SqlOperatorFixture)
          0.7sec,    3 completed,   0 failed,   0 skipped, org.apache.calcite.test.CalciteSqlOperatorTest > testCastToInterval(CastType, SqlOperatorFixture)
          1.5sec,    3 completed,   0 failed,   0 skipped, org.apache.calcite.test.SqlOperatorUnparseTest > testCastStringToDateTime(CastType, SqlOperatorFixture)

SqlOperatorUnparseTest > testExtractValue() STANDARD_ERROR
    [Fatal Error] :1:14: The markup in the document following the root element must be well-formed.
          3.2sec, org.apache.calcite.test.CalciteSqlOperatorTest > testCastExactNumericLimits(CastType, SqlOperatorFixture)[2], [2] SAFE_CAST, org.apache.calcite.test.SqlOperatorFixtures$SqlOperatorFixtureInvocationHandler@641eb6b9
          3.8sec, org.apache.calcite.test.CalciteSqlOperatorTest > testCastExactNumericLimits(CastType, SqlOperatorFixture)[3], [3] TRY_CAST, org.apache.calcite.test.SqlOperatorFixtures$SqlOperatorFixtureInvocationHandler@6cea094d
          8.8sec,    3 completed,   0 failed,   0 skipped, org.apache.calcite.test.CalciteSqlOperatorTest > testCastExactNumericLimits(CastType, SqlOperatorFixture)
          1.1sec,    3 completed,   0 failed,   0 skipped, org.apache.calcite.test.CalciteSqlOperatorTest > testCastDateTime(CastType, SqlOperatorFixture)
          0.4sec,    3 completed,   0 failed,   0 skipped, org.apache.calcite.test.CalciteSqlOperatorTest > testCastFormatClauseStringToDateTime(CastType, SqlOperatorFixture)

CalciteSqlOperatorTest > testXmlTransform() STANDARD_ERROR
    [Fatal Error] :1:2: XML document structures must start and end within the same entity.
          2.5sec, org.apache.calcite.test.SqlOperatorUnparseTest > testRlikeOperator()
          0.7sec,    3 completed,   0 failed,   0 skipped, org.apache.calcite.test.CalciteSqlOperatorTest > testCastTruncates(CastType, SqlOperatorFixture)
          0.0sec,    3 completed,   0 failed,   0 skipped, org.apache.calcite.test.SqlOperatorUnparseTest > testCastFormatClauseByteToString(CastType, SqlOperatorFixture)
WARNING 127.1sec,  567 completed,   0 failed,   1 skipped, org.apache.calcite.test.SqlOperatorUnparseTest
          0.9sec,    3 completed,   0 failed,   0 skipped, org.apache.calcite.test.CalciteSqlOperatorTest > testCastDecimalToDoubleToInteger(CastType, SqlOperatorFixture)
          2.7sec, org.apache.calcite.test.CalciteSqlOperatorTest > testCastToString(CastType, SqlOperatorFixture)[1], [1] CAST, org.apache.calcite.test.SqlOperatorFixtureImpl@1c826f40
          4.6sec, org.apache.calcite.test.CalciteSqlOperatorTest > testCastToString(CastType, SqlOperatorFixture)[2], [2] SAFE_CAST, org.apache.calcite.test.SqlOperatorFixtures$SqlOperatorFixtureInvocationHandler@6493eba6
          5.0sec, org.apache.calcite.test.CalciteSqlOperatorTest > testCastToString(CastType, SqlOperatorFixture)[3], [3] TRY_CAST, org.apache.calcite.test.SqlOperatorFixtures$SqlOperatorFixtureInvocationHandler@877532a
         12.2sec,    3 completed,   0 failed,   0 skipped, org.apache.calcite.test.CalciteSqlOperatorTest > testCastToString(CastType, SqlOperatorFixture)
          0.7sec,    3 completed,   0 failed,   0 skipped, org.apache.calcite.test.CalciteSqlOperatorTest > testCastNull(CastType, SqlOperatorFixture)
          2.1sec, org.apache.calcite.test.CalciteSqlOperatorTest > testRandFunc()
          0.6sec,    3 completed,   0 failed,   0 skipped, org.apache.calcite.test.CalciteSqlOperatorTest > testCastToApproxNumeric(CastType, SqlOperatorFixture)
          0.3sec,    3 completed,   0 failed,   0 skipped, org.apache.calcite.test.CalciteSqlOperatorTest > testCastIntervalToInterval(CastType, SqlOperatorFixture)
          0.6sec,    3 completed,   0 failed,   0 skipped, org.apache.calcite.test.CalciteSqlOperatorTest > testCastToBoolean(CastType, SqlOperatorFixture)
          2.3sec, org.apache.calcite.test.CalciteSqlOperatorTest > testSimilarToOperator()
          2.7sec, org.apache.calcite.test.CalciteSqlOperatorTest > testJdbcFn()
          4.5sec,    3 completed,   0 failed,   0 skipped, org.apache.calcite.test.CalciteSqlOperatorTest > testCastStringToDateTime(CastType, SqlOperatorFixture)

CalciteSqlOperatorTest > testExtractValue() STANDARD_ERROR
    [Fatal Error] :1:14: The markup in the document following the root element must be well-formed.
          2.0sec, org.apache.calcite.test.CalciteSqlOperatorTest > testToChar()
          2.2sec, org.apache.calcite.test.CalciteSqlOperatorTest > testBigQuerySubstringFunction()
          5.5sec, org.apache.calcite.test.CalciteSqlOperatorTest > testRlikeOperator()
          0.0sec,    3 completed,   0 failed,   0 skipped, org.apache.calcite.test.CalciteSqlOperatorTest > testCastFormatClauseByteToString(CastType, SqlOperatorFixture)
WARNING 270.2sec,  569 completed,   0 failed,   1 skipped, org.apache.calcite.test.CalciteSqlOperatorTest
FAILURE 294.7sec, 14890 completed,   1 failed, 106 skipped, Gradle Test Run :core:test

14890 tests completed, 1 failed, 106 skipped

> Task :core:test FAILED

FAILURE: Build failed with an exception.

* What went wrong:
Execution failed for task ':core:test'.
> There were failing tests. See the report at: file://<https://ci-builds.apache.org/job/Calcite/job/Calcite-snapshots/ws/core/build/reports/tests/test/index.html>

Deprecated Gradle features were used in this build, making it incompatible with Gradle 9.0.

You can use '--warning-mode all' to show the individual deprecation warnings and determine if they come from your own scripts or plugins.

For more on this, please refer to https://docs.gradle.org/8.7/userguide/command_line_interface.html#sec:command_line_warnings in the Gradle documentation.

BUILD FAILED in 10m 13s
497 actionable tasks: 497 executed

See the profiling report at: file://<https://ci-builds.apache.org/job/Calcite/job/Calcite-snapshots/ws/build/reports/profile/profile-2025-06-20-00-55-33.html>
A fine-grained performance profile is available: use the --scan option.
Build step 'Invoke Gradle script' changed build result to FAILURE
Build step 'Invoke Gradle script' marked build as failure
Recording test results
[Checks API] No suitable checks publisher found.