You are viewing a plain text version of this content. The canonical link for it is here.
Posted to builds@solr.apache.org by Policeman Jenkins Server <je...@thetaphi.de> on 2021/10/14 07:07:06 UTC

[JENKINS] Solr-main-Windows (64bit/jdk-17) - Build # 373 - Unstable!

Build: https://jenkins.thetaphi.de/job/Solr-main-Windows/373/
Java: 64bit/jdk-17 -XX:+UseCompressedOops -XX:+UseParallelGC

4 tests failed.
FAILED:  org.apache.solr.handler.component.DistributedQueryComponentCustomSortTest.test

Error Message:
org.apache.solr.client.solrj.impl.BaseHttpSolrClient$RemoteSolrException: Error from server at http://127.0.0.1:60701/collection1: org.apache.solr.client.solrj.SolrServerException: Connection refused: no further information

Stack Trace:
org.apache.solr.client.solrj.impl.BaseHttpSolrClient$RemoteSolrException: Error from server at http://127.0.0.1:60701/collection1: org.apache.solr.client.solrj.SolrServerException: Connection refused: no further information
	at __randomizedtesting.SeedInfo.seed([4E4E9BC4820414C3:C61AA41E2CF8793B]:0)
	at app//org.apache.solr.client.solrj.impl.HttpSolrClient.executeMethod(HttpSolrClient.java:696)
	at app//org.apache.solr.client.solrj.impl.HttpSolrClient.request(HttpSolrClient.java:268)
	at app//org.apache.solr.client.solrj.impl.HttpSolrClient.request(HttpSolrClient.java:251)
	at app//org.apache.solr.client.solrj.SolrRequest.process(SolrRequest.java:226)
	at app//org.apache.solr.client.solrj.SolrClient.query(SolrClient.java:1004)
	at app//org.apache.solr.client.solrj.SolrClient.query(SolrClient.java:1019)
	at app//org.apache.solr.BaseDistributedSearchTestCase.queryServer(BaseDistributedSearchTestCase.java:623)
	at app//org.apache.solr.handler.component.DistributedQueryComponentCustomSortTest.queryAllowPartialResults(DistributedQueryComponentCustomSortTest.java:139)
	at app//org.apache.solr.handler.component.DistributedQueryComponentCustomSortTest.test(DistributedQueryComponentCustomSortTest.java:129)
	at java.base@17/jdk.internal.reflect.NativeMethodAccessorImpl.invoke0(Native Method)
	at java.base@17/jdk.internal.reflect.NativeMethodAccessorImpl.invoke(NativeMethodAccessorImpl.java:77)
	at java.base@17/jdk.internal.reflect.DelegatingMethodAccessorImpl.invoke(DelegatingMethodAccessorImpl.java:43)
	at java.base@17/java.lang.reflect.Method.invoke(Method.java:568)
	at app//com.carrotsearch.randomizedtesting.RandomizedRunner.invoke(RandomizedRunner.java:1754)
	at app//com.carrotsearch.randomizedtesting.RandomizedRunner$8.evaluate(RandomizedRunner.java:942)
	at app//com.carrotsearch.randomizedtesting.RandomizedRunner$9.evaluate(RandomizedRunner.java:978)
	at app//com.carrotsearch.randomizedtesting.RandomizedRunner$10.evaluate(RandomizedRunner.java:992)
	at app//org.apache.solr.BaseDistributedSearchTestCase$ShardsRepeatRule$ShardsFixedStatement.callStatement(BaseDistributedSearchTestCase.java:1081)
	at app//org.apache.solr.BaseDistributedSearchTestCase$ShardsRepeatRule$ShardsStatement.evaluate(BaseDistributedSearchTestCase.java:1052)
	at app//com.carrotsearch.randomizedtesting.rules.SystemPropertiesRestoreRule$1.evaluate(SystemPropertiesRestoreRule.java:57)
	at app//org.junit.rules.RunRules.evaluate(RunRules.java:20)
	at app//org.apache.lucene.util.TestRuleSetupTeardownChained$1.evaluate(TestRuleSetupTeardownChained.java:44)
	at app//org.apache.lucene.util.AbstractBeforeAfterRule$1.evaluate(AbstractBeforeAfterRule.java:43)
	at app//org.apache.lucene.util.TestRuleThreadAndTestName$1.evaluate(TestRuleThreadAndTestName.java:45)
	at app//org.apache.lucene.util.TestRuleIgnoreAfterMaxFailures$1.evaluate(TestRuleIgnoreAfterMaxFailures.java:60)
	at app//org.apache.lucene.util.TestRuleMarkFailure$1.evaluate(TestRuleMarkFailure.java:44)
	at app//org.junit.rules.RunRules.evaluate(RunRules.java:20)
	at app//com.carrotsearch.randomizedtesting.rules.StatementAdapter.evaluate(StatementAdapter.java:36)
	at app//com.carrotsearch.randomizedtesting.ThreadLeakControl$StatementRunner.run(ThreadLeakControl.java:370)
	at app//com.carrotsearch.randomizedtesting.ThreadLeakControl.forkTimeoutingTask(ThreadLeakControl.java:819)
	at app//com.carrotsearch.randomizedtesting.ThreadLeakControl$3.evaluate(ThreadLeakControl.java:470)
	at app//com.carrotsearch.randomizedtesting.RandomizedRunner.runSingleTest(RandomizedRunner.java:951)
	at app//com.carrotsearch.randomizedtesting.RandomizedRunner$5.evaluate(RandomizedRunner.java:836)
	at app//com.carrotsearch.randomizedtesting.RandomizedRunner$6.evaluate(RandomizedRunner.java:887)
	at app//com.carrotsearch.randomizedtesting.RandomizedRunner$7.evaluate(RandomizedRunner.java:898)
	at app//com.carrotsearch.randomizedtesting.rules.StatementAdapter.evaluate(StatementAdapter.java:36)
	at app//org.apache.lucene.util.AbstractBeforeAfterRule$1.evaluate(AbstractBeforeAfterRule.java:43)
	at app//org.apache.lucene.util.AbstractBeforeAfterRule$1.evaluate(AbstractBeforeAfterRule.java:43)
	at app//com.carrotsearch.randomizedtesting.rules.SystemPropertiesRestoreRule$1.evaluate(SystemPropertiesRestoreRule.java:57)
	at app//org.junit.rules.RunRules.evaluate(RunRules.java:20)
	at app//org.apache.lucene.util.AbstractBeforeAfterRule$1.evaluate(AbstractBeforeAfterRule.java:43)
	at app//com.carrotsearch.randomizedtesting.rules.StatementAdapter.evaluate(StatementAdapter.java:36)
	at app//org.apache.lucene.util.TestRuleStoreClassName$1.evaluate(TestRuleStoreClassName.java:38)
	at app//com.carrotsearch.randomizedtesting.rules.NoShadowingOrOverridesOnMethodsRule$1.evaluate(NoShadowingOrOverridesOnMethodsRule.java:40)
	at app//com.carrotsearch.randomizedtesting.rules.NoShadowingOrOverridesOnMethodsRule$1.evaluate(NoShadowingOrOverridesOnMethodsRule.java:40)
	at app//com.carrotsearch.randomizedtesting.rules.StatementAdapter.evaluate(StatementAdapter.java:36)
	at app//com.carrotsearch.randomizedtesting.rules.StatementAdapter.evaluate(StatementAdapter.java:36)
	at app//org.apache.lucene.util.TestRuleAssertionsRequired$1.evaluate(TestRuleAssertionsRequired.java:53)
	at app//org.apache.lucene.util.AbstractBeforeAfterRule$1.evaluate(AbstractBeforeAfterRule.java:43)
	at app//org.apache.lucene.util.TestRuleMarkFailure$1.evaluate(TestRuleMarkFailure.java:44)
	at app//org.apache.lucene.util.TestRuleIgnoreAfterMaxFailures$1.evaluate(TestRuleIgnoreAfterMaxFailures.java:60)
	at app//org.apache.lucene.util.TestRuleIgnoreTestSuites$1.evaluate(TestRuleIgnoreTestSuites.java:47)
	at app//org.junit.rules.RunRules.evaluate(RunRules.java:20)
	at app//com.carrotsearch.randomizedtesting.rules.StatementAdapter.evaluate(StatementAdapter.java:36)
	at app//com.carrotsearch.randomizedtesting.ThreadLeakControl$StatementRunner.run(ThreadLeakControl.java:370)
	at app//com.carrotsearch.randomizedtesting.ThreadLeakControl.lambda$forkTimeoutingTask$0(ThreadLeakControl.java:826)
	at java.base@17/java.lang.Thread.run(Thread.java:833)


FAILED:  org.apache.solr.schema.SchemaApiFailureTest.classMethod

Error Message:
com.carrotsearch.randomizedtesting.ResourceDisposalError: Resource in scope SUITE failed to close. Resource was registered from thread Thread[id=18809, name=qtp2013704626-18809, state=RUNNABLE, group=TGRP-SchemaApiFailureTest], registration stack trace below.

Stack Trace:
com.carrotsearch.randomizedtesting.ResourceDisposalError: Resource in scope SUITE failed to close. Resource was registered from thread Thread[id=18809, name=qtp2013704626-18809, state=RUNNABLE, group=TGRP-SchemaApiFailureTest], registration stack trace below.
	at java.base@17/java.lang.Thread.getStackTrace(Thread.java:1610)
	at app//com.carrotsearch.randomizedtesting.RandomizedContext.closeAtEnd(RandomizedContext.java:157)
	at app//org.apache.lucene.util.LuceneTestCase.closeAfterSuite(LuceneTestCase.java:798)
	at app//org.apache.lucene.util.LuceneTestCase.wrapDirectory(LuceneTestCase.java:1504)
	at app//org.apache.lucene.util.LuceneTestCase.newDirectory(LuceneTestCase.java:1368)
	at app//org.apache.lucene.util.LuceneTestCase.newDirectory(LuceneTestCase.java:1350)
	at app//org.apache.solr.core.MockDirectoryFactory.create(MockDirectoryFactory.java:49)
	at app//org.apache.solr.core.CachingDirectoryFactory.get(CachingDirectoryFactory.java:360)
	at app//org.apache.solr.core.SolrCore.initSnapshotMetaDataManager(SolrCore.java:584)
	at app//org.apache.solr.core.SolrCore.<init>(SolrCore.java:1033)
	at app//org.apache.solr.core.SolrCore.<init>(SolrCore.java:959)
	at app//org.apache.solr.core.CoreContainer.createFromDescriptor(CoreContainer.java:1439)
	at app//org.apache.solr.core.CoreContainer.create(CoreContainer.java:1313)
	at app//org.apache.solr.handler.admin.CoreAdminOperation.lambda$static$0(CoreAdminOperation.java:91)
	at app//org.apache.solr.handler.admin.CoreAdminOperation.execute(CoreAdminOperation.java:344)
	at app//org.apache.solr.handler.admin.CoreAdminHandler$CallInfo.call(CoreAdminHandler.java:398)
	at app//org.apache.solr.handler.admin.CoreAdminHandler.handleRequestBody(CoreAdminHandler.java:182)
	at app//org.apache.solr.handler.RequestHandlerBase.handleRequest(RequestHandlerBase.java:212)
	at app//org.apache.solr.servlet.HttpSolrCall.handleAdmin(HttpSolrCall.java:871)
	at app//org.apache.solr.servlet.HttpSolrCall.handleAdminRequest(HttpSolrCall.java:835)
	at app//org.apache.solr.servlet.HttpSolrCall.call(HttpSolrCall.java:547)
	at app//org.apache.solr.servlet.SolrDispatchFilter.doFilter(SolrDispatchFilter.java:506)
	at app//org.apache.solr.servlet.SolrDispatchFilter.doFilter(SolrDispatchFilter.java:433)
	at app//org.eclipse.jetty.servlet.FilterHolder.doFilter(FilterHolder.java:193)
	at app//org.eclipse.jetty.servlet.ServletHandler$Chain.doFilter(ServletHandler.java:1601)
	at app//org.apache.solr.client.solrj.embedded.JettySolrRunner$DebugFilter.doFilter(JettySolrRunner.java:184)
	at app//org.eclipse.jetty.servlet.FilterHolder.doFilter(FilterHolder.java:193)
	at app//org.eclipse.jetty.servlet.ServletHandler$Chain.doFilter(ServletHandler.java:1601)
	at app//org.eclipse.jetty.servlet.ServletHandler.doHandle(ServletHandler.java:548)
	at app//org.eclipse.jetty.server.handler.ScopedHandler.nextHandle(ScopedHandler.java:233)
	at app//org.eclipse.jetty.server.session.SessionHandler.doHandle(SessionHandler.java:1624)
	at app//org.eclipse.jetty.server.handler.ScopedHandler.nextHandle(ScopedHandler.java:233)
	at app//org.eclipse.jetty.server.handler.ContextHandler.doHandle(ContextHandler.java:1434)
	at app//org.eclipse.jetty.server.handler.ScopedHandler.nextScope(ScopedHandler.java:188)
	at app//org.eclipse.jetty.servlet.ServletHandler.doScope(ServletHandler.java:501)
	at app//org.eclipse.jetty.server.session.SessionHandler.doScope(SessionHandler.java:1594)
	at app//org.eclipse.jetty.server.handler.ScopedHandler.nextScope(ScopedHandler.java:186)
	at app//org.eclipse.jetty.server.handler.ContextHandler.doScope(ContextHandler.java:1349)
	at app//org.eclipse.jetty.server.handler.ScopedHandler.handle(ScopedHandler.java:141)
	at app//org.eclipse.jetty.server.handler.HandlerWrapper.handle(HandlerWrapper.java:127)
	at app//org.eclipse.jetty.rewrite.handler.RewriteHandler.handle(RewriteHandler.java:322)
	at app//org.eclipse.jetty.server.handler.gzip.GzipHandler.handle(GzipHandler.java:713)
	at app//org.eclipse.jetty.server.handler.HandlerWrapper.handle(HandlerWrapper.java:127)
	at app//org.eclipse.jetty.server.Server.handle(Server.java:516)
	at app//org.eclipse.jetty.server.HttpChannel.lambda$handle$1(HttpChannel.java:400)
	at app//org.eclipse.jetty.server.HttpChannel.dispatch(HttpChannel.java:645)
	at app//org.eclipse.jetty.server.HttpChannel.handle(HttpChannel.java:392)
	at app//org.eclipse.jetty.server.HttpChannel.run(HttpChannel.java:352)
	at app//org.eclipse.jetty.util.thread.QueuedThreadPool.runJob(QueuedThreadPool.java:883)
	at app//org.eclipse.jetty.util.thread.QueuedThreadPool$Runner.run(QueuedThreadPool.java:1034)
	at java.base@17/java.lang.Thread.run(Thread.java:833)
Caused by: java.lang.AssertionError: Directory not closed: MockDirectoryWrapper(ByteBuffersDirectory@80ee627 lockFactory=org.apache.lucene.store.SingleInstanceLockFactory@5519e240)
	at org.junit.Assert.fail(Assert.java:89)
	at org.apache.lucene.util.CloseableDirectory.close(CloseableDirectory.java:43)
	at com.carrotsearch.randomizedtesting.RandomizedRunner$4$1.apply(RandomizedRunner.java:788)
	at com.carrotsearch.randomizedtesting.RandomizedRunner$4$1.apply(RandomizedRunner.java:785)
	at com.carrotsearch.randomizedtesting.RandomizedContext.closeResources(RandomizedContext.java:225)
	at com.carrotsearch.randomizedtesting.RandomizedRunner$4.afterAlways(RandomizedRunner.java:801)
	at com.carrotsearch.randomizedtesting.rules.StatementAdapter.evaluate(StatementAdapter.java:43)
	at com.carrotsearch.randomizedtesting.ThreadLeakControl$StatementRunner.run(ThreadLeakControl.java:370)
	at com.carrotsearch.randomizedtesting.ThreadLeakControl.lambda$forkTimeoutingTask$0(ThreadLeakControl.java:826)
	... 1 more


FAILED:  org.apache.solr.schema.SchemaApiFailureTest.classMethod

Error Message:
com.carrotsearch.randomizedtesting.ResourceDisposalError: Resource in scope SUITE failed to close. Resource was registered from thread Thread[id=18809, name=qtp2013704626-18809, state=RUNNABLE, group=TGRP-SchemaApiFailureTest], registration stack trace below.

Stack Trace:
com.carrotsearch.randomizedtesting.ResourceDisposalError: Resource in scope SUITE failed to close. Resource was registered from thread Thread[id=18809, name=qtp2013704626-18809, state=RUNNABLE, group=TGRP-SchemaApiFailureTest], registration stack trace below.
	at java.base@17/java.lang.Thread.getStackTrace(Thread.java:1610)
	at app//com.carrotsearch.randomizedtesting.RandomizedContext.closeAtEnd(RandomizedContext.java:157)
	at app//org.apache.lucene.util.LuceneTestCase.closeAfterSuite(LuceneTestCase.java:798)
	at app//org.apache.lucene.util.LuceneTestCase.wrapDirectory(LuceneTestCase.java:1504)
	at app//org.apache.lucene.util.LuceneTestCase.newDirectory(LuceneTestCase.java:1368)
	at app//org.apache.lucene.util.LuceneTestCase.newDirectory(LuceneTestCase.java:1350)
	at app//org.apache.solr.core.MockDirectoryFactory.create(MockDirectoryFactory.java:49)
	at app//org.apache.solr.core.CachingDirectoryFactory.get(CachingDirectoryFactory.java:360)
	at app//org.apache.solr.core.SolrCore.getNewIndexDir(SolrCore.java:404)
	at app//org.apache.solr.core.SolrCore.initIndex(SolrCore.java:819)
	at app//org.apache.solr.core.SolrCore.<init>(SolrCore.java:1037)
	at app//org.apache.solr.core.SolrCore.<init>(SolrCore.java:959)
	at app//org.apache.solr.core.CoreContainer.createFromDescriptor(CoreContainer.java:1439)
	at app//org.apache.solr.core.CoreContainer.create(CoreContainer.java:1313)
	at app//org.apache.solr.handler.admin.CoreAdminOperation.lambda$static$0(CoreAdminOperation.java:91)
	at app//org.apache.solr.handler.admin.CoreAdminOperation.execute(CoreAdminOperation.java:344)
	at app//org.apache.solr.handler.admin.CoreAdminHandler$CallInfo.call(CoreAdminHandler.java:398)
	at app//org.apache.solr.handler.admin.CoreAdminHandler.handleRequestBody(CoreAdminHandler.java:182)
	at app//org.apache.solr.handler.RequestHandlerBase.handleRequest(RequestHandlerBase.java:212)
	at app//org.apache.solr.servlet.HttpSolrCall.handleAdmin(HttpSolrCall.java:871)
	at app//org.apache.solr.servlet.HttpSolrCall.handleAdminRequest(HttpSolrCall.java:835)
	at app//org.apache.solr.servlet.HttpSolrCall.call(HttpSolrCall.java:547)
	at app//org.apache.solr.servlet.SolrDispatchFilter.doFilter(SolrDispatchFilter.java:506)
	at app//org.apache.solr.servlet.SolrDispatchFilter.doFilter(SolrDispatchFilter.java:433)
	at app//org.eclipse.jetty.servlet.FilterHolder.doFilter(FilterHolder.java:193)
	at app//org.eclipse.jetty.servlet.ServletHandler$Chain.doFilter(ServletHandler.java:1601)
	at app//org.apache.solr.client.solrj.embedded.JettySolrRunner$DebugFilter.doFilter(JettySolrRunner.java:184)
	at app//org.eclipse.jetty.servlet.FilterHolder.doFilter(FilterHolder.java:193)
	at app//org.eclipse.jetty.servlet.ServletHandler$Chain.doFilter(ServletHandler.java:1601)
	at app//org.eclipse.jetty.servlet.ServletHandler.doHandle(ServletHandler.java:548)
	at app//org.eclipse.jetty.server.handler.ScopedHandler.nextHandle(ScopedHandler.java:233)
	at app//org.eclipse.jetty.server.session.SessionHandler.doHandle(SessionHandler.java:1624)
	at app//org.eclipse.jetty.server.handler.ScopedHandler.nextHandle(ScopedHandler.java:233)
	at app//org.eclipse.jetty.server.handler.ContextHandler.doHandle(ContextHandler.java:1434)
	at app//org.eclipse.jetty.server.handler.ScopedHandler.nextScope(ScopedHandler.java:188)
	at app//org.eclipse.jetty.servlet.ServletHandler.doScope(ServletHandler.java:501)
	at app//org.eclipse.jetty.server.session.SessionHandler.doScope(SessionHandler.java:1594)
	at app//org.eclipse.jetty.server.handler.ScopedHandler.nextScope(ScopedHandler.java:186)
	at app//org.eclipse.jetty.server.handler.ContextHandler.doScope(ContextHandler.java:1349)
	at app//org.eclipse.jetty.server.handler.ScopedHandler.handle(ScopedHandler.java:141)
	at app//org.eclipse.jetty.server.handler.HandlerWrapper.handle(HandlerWrapper.java:127)
	at app//org.eclipse.jetty.rewrite.handler.RewriteHandler.handle(RewriteHandler.java:322)
	at app//org.eclipse.jetty.server.handler.gzip.GzipHandler.handle(GzipHandler.java:713)
	at app//org.eclipse.jetty.server.handler.HandlerWrapper.handle(HandlerWrapper.java:127)
	at app//org.eclipse.jetty.server.Server.handle(Server.java:516)
	at app//org.eclipse.jetty.server.HttpChannel.lambda$handle$1(HttpChannel.java:400)
	at app//org.eclipse.jetty.server.HttpChannel.dispatch(HttpChannel.java:645)
	at app//org.eclipse.jetty.server.HttpChannel.handle(HttpChannel.java:392)
	at app//org.eclipse.jetty.server.HttpChannel.run(HttpChannel.java:352)
	at app//org.eclipse.jetty.util.thread.QueuedThreadPool.runJob(QueuedThreadPool.java:883)
	at app//org.eclipse.jetty.util.thread.QueuedThreadPool$Runner.run(QueuedThreadPool.java:1034)
	at java.base@17/java.lang.Thread.run(Thread.java:833)
Caused by: java.lang.AssertionError: Directory not closed: MockDirectoryWrapper(ByteBuffersDirectory@68a8d374 lockFactory=org.apache.lucene.store.SingleInstanceLockFactory@75c93aec)
	at org.junit.Assert.fail(Assert.java:89)
	at org.apache.lucene.util.CloseableDirectory.close(CloseableDirectory.java:43)
	at com.carrotsearch.randomizedtesting.RandomizedRunner$4$1.apply(RandomizedRunner.java:788)
	at com.carrotsearch.randomizedtesting.RandomizedRunner$4$1.apply(RandomizedRunner.java:785)
	at com.carrotsearch.randomizedtesting.RandomizedContext.closeResources(RandomizedContext.java:225)
	at com.carrotsearch.randomizedtesting.RandomizedRunner$4.afterAlways(RandomizedRunner.java:801)
	at com.carrotsearch.randomizedtesting.rules.StatementAdapter.evaluate(StatementAdapter.java:43)
	at com.carrotsearch.randomizedtesting.ThreadLeakControl$StatementRunner.run(ThreadLeakControl.java:370)
	at com.carrotsearch.randomizedtesting.ThreadLeakControl.lambda$forkTimeoutingTask$0(ThreadLeakControl.java:826)
	... 1 more


FAILED:  org.apache.solr.schema.SchemaApiFailureTest.classMethod

Error Message:
com.carrotsearch.randomizedtesting.ResourceDisposalError: Resource in scope SUITE failed to close. Resource was registered from thread Thread[id=18809, name=qtp2013704626-18809, state=RUNNABLE, group=TGRP-SchemaApiFailureTest], registration stack trace below.

Stack Trace:
com.carrotsearch.randomizedtesting.ResourceDisposalError: Resource in scope SUITE failed to close. Resource was registered from thread Thread[id=18809, name=qtp2013704626-18809, state=RUNNABLE, group=TGRP-SchemaApiFailureTest], registration stack trace below.
	at java.base@17/java.lang.Thread.getStackTrace(Thread.java:1610)
	at app//com.carrotsearch.randomizedtesting.RandomizedContext.closeAtEnd(RandomizedContext.java:157)
	at app//org.apache.lucene.util.LuceneTestCase.closeAfterSuite(LuceneTestCase.java:798)
	at app//org.apache.lucene.util.LuceneTestCase.wrapDirectory(LuceneTestCase.java:1504)
	at app//org.apache.lucene.util.LuceneTestCase.newDirectory(LuceneTestCase.java:1368)
	at app//org.apache.lucene.util.LuceneTestCase.newDirectory(LuceneTestCase.java:1350)
	at app//org.apache.solr.core.MockDirectoryFactory.create(MockDirectoryFactory.java:49)
	at app//org.apache.solr.core.CachingDirectoryFactory.get(CachingDirectoryFactory.java:360)
	at app//org.apache.solr.update.SolrIndexWriter.create(SolrIndexWriter.java:98)
	at app//org.apache.solr.core.SolrCore.initIndex(SolrCore.java:851)
	at app//org.apache.solr.core.SolrCore.<init>(SolrCore.java:1037)
	at app//org.apache.solr.core.SolrCore.<init>(SolrCore.java:959)
	at app//org.apache.solr.core.CoreContainer.createFromDescriptor(CoreContainer.java:1439)
	at app//org.apache.solr.core.CoreContainer.create(CoreContainer.java:1313)
	at app//org.apache.solr.handler.admin.CoreAdminOperation.lambda$static$0(CoreAdminOperation.java:91)
	at app//org.apache.solr.handler.admin.CoreAdminOperation.execute(CoreAdminOperation.java:344)
	at app//org.apache.solr.handler.admin.CoreAdminHandler$CallInfo.call(CoreAdminHandler.java:398)
	at app//org.apache.solr.handler.admin.CoreAdminHandler.handleRequestBody(CoreAdminHandler.java:182)
	at app//org.apache.solr.handler.RequestHandlerBase.handleRequest(RequestHandlerBase.java:212)
	at app//org.apache.solr.servlet.HttpSolrCall.handleAdmin(HttpSolrCall.java:871)
	at app//org.apache.solr.servlet.HttpSolrCall.handleAdminRequest(HttpSolrCall.java:835)
	at app//org.apache.solr.servlet.HttpSolrCall.call(HttpSolrCall.java:547)
	at app//org.apache.solr.servlet.SolrDispatchFilter.doFilter(SolrDispatchFilter.java:506)
	at app//org.apache.solr.servlet.SolrDispatchFilter.doFilter(SolrDispatchFilter.java:433)
	at app//org.eclipse.jetty.servlet.FilterHolder.doFilter(FilterHolder.java:193)
	at app//org.eclipse.jetty.servlet.ServletHandler$Chain.doFilter(ServletHandler.java:1601)
	at app//org.apache.solr.client.solrj.embedded.JettySolrRunner$DebugFilter.doFilter(JettySolrRunner.java:184)
	at app//org.eclipse.jetty.servlet.FilterHolder.doFilter(FilterHolder.java:193)
	at app//org.eclipse.jetty.servlet.ServletHandler$Chain.doFilter(ServletHandler.java:1601)
	at app//org.eclipse.jetty.servlet.ServletHandler.doHandle(ServletHandler.java:548)
	at app//org.eclipse.jetty.server.handler.ScopedHandler.nextHandle(ScopedHandler.java:233)
	at app//org.eclipse.jetty.server.session.SessionHandler.doHandle(SessionHandler.java:1624)
	at app//org.eclipse.jetty.server.handler.ScopedHandler.nextHandle(ScopedHandler.java:233)
	at app//org.eclipse.jetty.server.handler.ContextHandler.doHandle(ContextHandler.java:1434)
	at app//org.eclipse.jetty.server.handler.ScopedHandler.nextScope(ScopedHandler.java:188)
	at app//org.eclipse.jetty.servlet.ServletHandler.doScope(ServletHandler.java:501)
	at app//org.eclipse.jetty.server.session.SessionHandler.doScope(SessionHandler.java:1594)
	at app//org.eclipse.jetty.server.handler.ScopedHandler.nextScope(ScopedHandler.java:186)
	at app//org.eclipse.jetty.server.handler.ContextHandler.doScope(ContextHandler.java:1349)
	at app//org.eclipse.jetty.server.handler.ScopedHandler.handle(ScopedHandler.java:141)
	at app//org.eclipse.jetty.server.handler.HandlerWrapper.handle(HandlerWrapper.java:127)
	at app//org.eclipse.jetty.rewrite.handler.RewriteHandler.handle(RewriteHandler.java:322)
	at app//org.eclipse.jetty.server.handler.gzip.GzipHandler.handle(GzipHandler.java:713)
	at app//org.eclipse.jetty.server.handler.HandlerWrapper.handle(HandlerWrapper.java:127)
	at app//org.eclipse.jetty.server.Server.handle(Server.java:516)
	at app//org.eclipse.jetty.server.HttpChannel.lambda$handle$1(HttpChannel.java:400)
	at app//org.eclipse.jetty.server.HttpChannel.dispatch(HttpChannel.java:645)
	at app//org.eclipse.jetty.server.HttpChannel.handle(HttpChannel.java:392)
	at app//org.eclipse.jetty.server.HttpChannel.run(HttpChannel.java:352)
	at app//org.eclipse.jetty.util.thread.QueuedThreadPool.runJob(QueuedThreadPool.java:883)
	at app//org.eclipse.jetty.util.thread.QueuedThreadPool$Runner.run(QueuedThreadPool.java:1034)
	at java.base@17/java.lang.Thread.run(Thread.java:833)
Caused by: java.lang.AssertionError: Directory not closed: MockDirectoryWrapper(ByteBuffersDirectory@106c19e9 lockFactory=org.apache.lucene.store.SingleInstanceLockFactory@22afa7ba)
	at org.junit.Assert.fail(Assert.java:89)
	at org.apache.lucene.util.CloseableDirectory.close(CloseableDirectory.java:43)
	at com.carrotsearch.randomizedtesting.RandomizedRunner$4$1.apply(RandomizedRunner.java:788)
	at com.carrotsearch.randomizedtesting.RandomizedRunner$4$1.apply(RandomizedRunner.java:785)
	at com.carrotsearch.randomizedtesting.RandomizedContext.closeResources(RandomizedContext.java:225)
	at com.carrotsearch.randomizedtesting.RandomizedRunner$4.afterAlways(RandomizedRunner.java:801)
	at com.carrotsearch.randomizedtesting.rules.StatementAdapter.evaluate(StatementAdapter.java:43)
	at com.carrotsearch.randomizedtesting.ThreadLeakControl$StatementRunner.run(ThreadLeakControl.java:370)
	at com.carrotsearch.randomizedtesting.ThreadLeakControl.lambda$forkTimeoutingTask$0(ThreadLeakControl.java:826)
	... 1 more

[JENKINS] Solr-main-Windows (64bit/jdk-11.0.6) - Build # 375 - Still Unstable!

Posted by Policeman Jenkins Server <je...@thetaphi.de>.
Build: https://jenkins.thetaphi.de/job/Solr-main-Windows/375/
Java: 64bit/jdk-11.0.6 -XX:+UseCompressedOops -XX:+UseConcMarkSweepGC

2 tests failed.
FAILED:  org.apache.solr.cluster.events.ClusterEventProducerTest.testListenerPlugins

Error Message:
java.lang.AssertionError: timestamp of the event is in the future

Stack Trace:
java.lang.AssertionError: timestamp of the event is in the future
	at __randomizedtesting.SeedInfo.seed([E74F8E2F5401007F:6B90CD2EF26D758D]:0)
	at org.junit.Assert.fail(Assert.java:89)
	at org.junit.Assert.assertTrue(Assert.java:42)
	at org.apache.solr.cluster.events.ClusterEventProducerTest.testListenerPlugins(ClusterEventProducerTest.java:344)
	at java.base/jdk.internal.reflect.NativeMethodAccessorImpl.invoke0(Native Method)
	at java.base/jdk.internal.reflect.NativeMethodAccessorImpl.invoke(NativeMethodAccessorImpl.java:62)
	at java.base/jdk.internal.reflect.DelegatingMethodAccessorImpl.invoke(DelegatingMethodAccessorImpl.java:43)
	at java.base/java.lang.reflect.Method.invoke(Method.java:566)
	at com.carrotsearch.randomizedtesting.RandomizedRunner.invoke(RandomizedRunner.java:1754)
	at com.carrotsearch.randomizedtesting.RandomizedRunner$8.evaluate(RandomizedRunner.java:942)
	at com.carrotsearch.randomizedtesting.RandomizedRunner$9.evaluate(RandomizedRunner.java:978)
	at com.carrotsearch.randomizedtesting.RandomizedRunner$10.evaluate(RandomizedRunner.java:992)
	at com.carrotsearch.randomizedtesting.rules.SystemPropertiesRestoreRule$1.evaluate(SystemPropertiesRestoreRule.java:57)
	at org.junit.rules.RunRules.evaluate(RunRules.java:20)
	at org.apache.lucene.util.TestRuleSetupTeardownChained$1.evaluate(TestRuleSetupTeardownChained.java:44)
	at org.apache.lucene.util.AbstractBeforeAfterRule$1.evaluate(AbstractBeforeAfterRule.java:43)
	at org.apache.lucene.util.TestRuleThreadAndTestName$1.evaluate(TestRuleThreadAndTestName.java:45)
	at org.apache.lucene.util.TestRuleIgnoreAfterMaxFailures$1.evaluate(TestRuleIgnoreAfterMaxFailures.java:60)
	at org.apache.lucene.util.TestRuleMarkFailure$1.evaluate(TestRuleMarkFailure.java:44)
	at org.junit.rules.RunRules.evaluate(RunRules.java:20)
	at com.carrotsearch.randomizedtesting.rules.StatementAdapter.evaluate(StatementAdapter.java:36)
	at com.carrotsearch.randomizedtesting.ThreadLeakControl$StatementRunner.run(ThreadLeakControl.java:370)
	at com.carrotsearch.randomizedtesting.ThreadLeakControl.forkTimeoutingTask(ThreadLeakControl.java:819)
	at com.carrotsearch.randomizedtesting.ThreadLeakControl$3.evaluate(ThreadLeakControl.java:470)
	at com.carrotsearch.randomizedtesting.RandomizedRunner.runSingleTest(RandomizedRunner.java:951)
	at com.carrotsearch.randomizedtesting.RandomizedRunner$5.evaluate(RandomizedRunner.java:836)
	at com.carrotsearch.randomizedtesting.RandomizedRunner$6.evaluate(RandomizedRunner.java:887)
	at com.carrotsearch.randomizedtesting.RandomizedRunner$7.evaluate(RandomizedRunner.java:898)
	at com.carrotsearch.randomizedtesting.rules.StatementAdapter.evaluate(StatementAdapter.java:36)
	at org.apache.lucene.util.AbstractBeforeAfterRule$1.evaluate(AbstractBeforeAfterRule.java:43)
	at org.apache.lucene.util.AbstractBeforeAfterRule$1.evaluate(AbstractBeforeAfterRule.java:43)
	at com.carrotsearch.randomizedtesting.rules.SystemPropertiesRestoreRule$1.evaluate(SystemPropertiesRestoreRule.java:57)
	at org.junit.rules.RunRules.evaluate(RunRules.java:20)
	at org.apache.lucene.util.AbstractBeforeAfterRule$1.evaluate(AbstractBeforeAfterRule.java:43)
	at com.carrotsearch.randomizedtesting.rules.StatementAdapter.evaluate(StatementAdapter.java:36)
	at org.apache.lucene.util.TestRuleStoreClassName$1.evaluate(TestRuleStoreClassName.java:38)
	at com.carrotsearch.randomizedtesting.rules.NoShadowingOrOverridesOnMethodsRule$1.evaluate(NoShadowingOrOverridesOnMethodsRule.java:40)
	at com.carrotsearch.randomizedtesting.rules.NoShadowingOrOverridesOnMethodsRule$1.evaluate(NoShadowingOrOverridesOnMethodsRule.java:40)
	at com.carrotsearch.randomizedtesting.rules.StatementAdapter.evaluate(StatementAdapter.java:36)
	at com.carrotsearch.randomizedtesting.rules.StatementAdapter.evaluate(StatementAdapter.java:36)
	at org.apache.lucene.util.TestRuleAssertionsRequired$1.evaluate(TestRuleAssertionsRequired.java:53)
	at org.apache.lucene.util.AbstractBeforeAfterRule$1.evaluate(AbstractBeforeAfterRule.java:43)
	at org.apache.lucene.util.TestRuleMarkFailure$1.evaluate(TestRuleMarkFailure.java:44)
	at org.apache.lucene.util.TestRuleIgnoreAfterMaxFailures$1.evaluate(TestRuleIgnoreAfterMaxFailures.java:60)
	at org.apache.lucene.util.TestRuleIgnoreTestSuites$1.evaluate(TestRuleIgnoreTestSuites.java:47)
	at org.junit.rules.RunRules.evaluate(RunRules.java:20)
	at com.carrotsearch.randomizedtesting.rules.StatementAdapter.evaluate(StatementAdapter.java:36)
	at com.carrotsearch.randomizedtesting.ThreadLeakControl$StatementRunner.run(ThreadLeakControl.java:370)
	at com.carrotsearch.randomizedtesting.ThreadLeakControl.lambda$forkTimeoutingTask$0(ThreadLeakControl.java:826)
	at java.base/java.lang.Thread.run(Thread.java:834)


FAILED:  org.apache.solr.handler.component.DistributedFacetPivotLargeTest.test

Error Message:
org.apache.solr.client.solrj.impl.BaseHttpSolrClient$RemoteSolrException: Error from server at http://127.0.0.1:54062/collection1: org.apache.solr.client.solrj.SolrServerException: Total timeout 15000 ms elapsed

Stack Trace:
org.apache.solr.client.solrj.impl.BaseHttpSolrClient$RemoteSolrException: Error from server at http://127.0.0.1:54062/collection1: org.apache.solr.client.solrj.SolrServerException: Total timeout 15000 ms elapsed
	at __randomizedtesting.SeedInfo.seed([E74F8E2F5401007F:6F1BB1F5FAFD6D87]:0)
	at app//org.apache.solr.client.solrj.impl.HttpSolrClient.executeMethod(HttpSolrClient.java:696)
	at app//org.apache.solr.client.solrj.impl.HttpSolrClient.request(HttpSolrClient.java:268)
	at app//org.apache.solr.client.solrj.impl.HttpSolrClient.request(HttpSolrClient.java:251)
	at app//org.apache.solr.client.solrj.SolrRequest.process(SolrRequest.java:226)
	at app//org.apache.solr.client.solrj.SolrClient.query(SolrClient.java:1004)
	at app//org.apache.solr.client.solrj.SolrClient.query(SolrClient.java:1019)
	at app//org.apache.solr.BaseDistributedSearchTestCase.queryServer(BaseDistributedSearchTestCase.java:623)
	at app//org.apache.solr.BaseDistributedSearchTestCase.query(BaseDistributedSearchTestCase.java:671)
	at app//org.apache.solr.BaseDistributedSearchTestCase.query(BaseDistributedSearchTestCase.java:640)
	at app//org.apache.solr.handler.component.DistributedFacetPivotLargeTest.test(DistributedFacetPivotLargeTest.java:146)
	at java.base@11.0.6/jdk.internal.reflect.NativeMethodAccessorImpl.invoke0(Native Method)
	at java.base@11.0.6/jdk.internal.reflect.NativeMethodAccessorImpl.invoke(NativeMethodAccessorImpl.java:62)
	at java.base@11.0.6/jdk.internal.reflect.DelegatingMethodAccessorImpl.invoke(DelegatingMethodAccessorImpl.java:43)
	at java.base@11.0.6/java.lang.reflect.Method.invoke(Method.java:566)
	at app//com.carrotsearch.randomizedtesting.RandomizedRunner.invoke(RandomizedRunner.java:1754)
	at app//com.carrotsearch.randomizedtesting.RandomizedRunner$8.evaluate(RandomizedRunner.java:942)
	at app//com.carrotsearch.randomizedtesting.RandomizedRunner$9.evaluate(RandomizedRunner.java:978)
	at app//com.carrotsearch.randomizedtesting.RandomizedRunner$10.evaluate(RandomizedRunner.java:992)
	at app//org.apache.solr.BaseDistributedSearchTestCase$ShardsRepeatRule$ShardsFixedStatement.callStatement(BaseDistributedSearchTestCase.java:1081)
	at app//org.apache.solr.BaseDistributedSearchTestCase$ShardsRepeatRule$ShardsStatement.evaluate(BaseDistributedSearchTestCase.java:1052)
	at app//com.carrotsearch.randomizedtesting.rules.SystemPropertiesRestoreRule$1.evaluate(SystemPropertiesRestoreRule.java:57)
	at app//org.junit.rules.RunRules.evaluate(RunRules.java:20)
	at app//org.apache.lucene.util.TestRuleSetupTeardownChained$1.evaluate(TestRuleSetupTeardownChained.java:44)
	at app//org.apache.lucene.util.AbstractBeforeAfterRule$1.evaluate(AbstractBeforeAfterRule.java:43)
	at app//org.apache.lucene.util.TestRuleThreadAndTestName$1.evaluate(TestRuleThreadAndTestName.java:45)
	at app//org.apache.lucene.util.TestRuleIgnoreAfterMaxFailures$1.evaluate(TestRuleIgnoreAfterMaxFailures.java:60)
	at app//org.apache.lucene.util.TestRuleMarkFailure$1.evaluate(TestRuleMarkFailure.java:44)
	at app//org.junit.rules.RunRules.evaluate(RunRules.java:20)
	at app//com.carrotsearch.randomizedtesting.rules.StatementAdapter.evaluate(StatementAdapter.java:36)
	at app//com.carrotsearch.randomizedtesting.ThreadLeakControl$StatementRunner.run(ThreadLeakControl.java:370)
	at app//com.carrotsearch.randomizedtesting.ThreadLeakControl.forkTimeoutingTask(ThreadLeakControl.java:819)
	at app//com.carrotsearch.randomizedtesting.ThreadLeakControl$3.evaluate(ThreadLeakControl.java:470)
	at app//com.carrotsearch.randomizedtesting.RandomizedRunner.runSingleTest(RandomizedRunner.java:951)
	at app//com.carrotsearch.randomizedtesting.RandomizedRunner$5.evaluate(RandomizedRunner.java:836)
	at app//com.carrotsearch.randomizedtesting.RandomizedRunner$6.evaluate(RandomizedRunner.java:887)
	at app//com.carrotsearch.randomizedtesting.RandomizedRunner$7.evaluate(RandomizedRunner.java:898)
	at app//com.carrotsearch.randomizedtesting.rules.StatementAdapter.evaluate(StatementAdapter.java:36)
	at app//org.apache.lucene.util.AbstractBeforeAfterRule$1.evaluate(AbstractBeforeAfterRule.java:43)
	at app//org.apache.lucene.util.AbstractBeforeAfterRule$1.evaluate(AbstractBeforeAfterRule.java:43)
	at app//com.carrotsearch.randomizedtesting.rules.SystemPropertiesRestoreRule$1.evaluate(SystemPropertiesRestoreRule.java:57)
	at app//org.junit.rules.RunRules.evaluate(RunRules.java:20)
	at app//org.apache.lucene.util.AbstractBeforeAfterRule$1.evaluate(AbstractBeforeAfterRule.java:43)
	at app//com.carrotsearch.randomizedtesting.rules.StatementAdapter.evaluate(StatementAdapter.java:36)
	at app//org.apache.lucene.util.TestRuleStoreClassName$1.evaluate(TestRuleStoreClassName.java:38)
	at app//com.carrotsearch.randomizedtesting.rules.NoShadowingOrOverridesOnMethodsRule$1.evaluate(NoShadowingOrOverridesOnMethodsRule.java:40)
	at app//com.carrotsearch.randomizedtesting.rules.NoShadowingOrOverridesOnMethodsRule$1.evaluate(NoShadowingOrOverridesOnMethodsRule.java:40)
	at app//com.carrotsearch.randomizedtesting.rules.StatementAdapter.evaluate(StatementAdapter.java:36)
	at app//com.carrotsearch.randomizedtesting.rules.StatementAdapter.evaluate(StatementAdapter.java:36)
	at app//org.apache.lucene.util.TestRuleAssertionsRequired$1.evaluate(TestRuleAssertionsRequired.java:53)
	at app//org.apache.lucene.util.AbstractBeforeAfterRule$1.evaluate(AbstractBeforeAfterRule.java:43)
	at app//org.apache.lucene.util.TestRuleMarkFailure$1.evaluate(TestRuleMarkFailure.java:44)
	at app//org.apache.lucene.util.TestRuleIgnoreAfterMaxFailures$1.evaluate(TestRuleIgnoreAfterMaxFailures.java:60)
	at app//org.apache.lucene.util.TestRuleIgnoreTestSuites$1.evaluate(TestRuleIgnoreTestSuites.java:47)
	at app//org.junit.rules.RunRules.evaluate(RunRules.java:20)
	at app//com.carrotsearch.randomizedtesting.rules.StatementAdapter.evaluate(StatementAdapter.java:36)
	at app//com.carrotsearch.randomizedtesting.ThreadLeakControl$StatementRunner.run(ThreadLeakControl.java:370)
	at app//com.carrotsearch.randomizedtesting.ThreadLeakControl.lambda$forkTimeoutingTask$0(ThreadLeakControl.java:826)
	at java.base@11.0.6/java.lang.Thread.run(Thread.java:834)

[JENKINS] Solr-main-Windows (64bit/jdk-11.0.6) - Build # 374 - Still Unstable!

Posted by Policeman Jenkins Server <je...@thetaphi.de>.
Build: https://jenkins.thetaphi.de/job/Solr-main-Windows/374/
Java: 64bit/jdk-11.0.6 -XX:+UseCompressedOops -XX:+UseG1GC

1 tests failed.
FAILED:  org.apache.solr.handler.component.TestDistributedStatsComponentCardinality.test

Error Message:
org.apache.solr.client.solrj.impl.BaseHttpSolrClient$RemoteSolrException: Error from server at http://127.0.0.1:65052/collection1: org.apache.solr.client.solrj.SolrServerException: Total timeout 15000 ms elapsed

Stack Trace:
org.apache.solr.client.solrj.impl.BaseHttpSolrClient$RemoteSolrException: Error from server at http://127.0.0.1:65052/collection1: org.apache.solr.client.solrj.SolrServerException: Total timeout 15000 ms elapsed
	at __randomizedtesting.SeedInfo.seed([3DA988317EF7E10D:B5FDB7EBD00B8CF5]:0)
	at app//org.apache.solr.client.solrj.impl.HttpSolrClient.executeMethod(HttpSolrClient.java:696)
	at app//org.apache.solr.client.solrj.impl.HttpSolrClient.request(HttpSolrClient.java:268)
	at app//org.apache.solr.client.solrj.impl.HttpSolrClient.request(HttpSolrClient.java:251)
	at app//org.apache.solr.client.solrj.SolrRequest.process(SolrRequest.java:226)
	at app//org.apache.solr.client.solrj.SolrClient.query(SolrClient.java:1004)
	at app//org.apache.solr.client.solrj.SolrClient.query(SolrClient.java:1019)
	at app//org.apache.solr.BaseDistributedSearchTestCase.queryServer(BaseDistributedSearchTestCase.java:623)
	at app//org.apache.solr.BaseDistributedSearchTestCase.query(BaseDistributedSearchTestCase.java:671)
	at app//org.apache.solr.BaseDistributedSearchTestCase.query(BaseDistributedSearchTestCase.java:640)
	at app//org.apache.solr.handler.component.TestDistributedStatsComponentCardinality.test(TestDistributedStatsComponentCardinality.java:144)
	at java.base@11.0.6/jdk.internal.reflect.NativeMethodAccessorImpl.invoke0(Native Method)
	at java.base@11.0.6/jdk.internal.reflect.NativeMethodAccessorImpl.invoke(NativeMethodAccessorImpl.java:62)
	at java.base@11.0.6/jdk.internal.reflect.DelegatingMethodAccessorImpl.invoke(DelegatingMethodAccessorImpl.java:43)
	at java.base@11.0.6/java.lang.reflect.Method.invoke(Method.java:566)
	at app//com.carrotsearch.randomizedtesting.RandomizedRunner.invoke(RandomizedRunner.java:1754)
	at app//com.carrotsearch.randomizedtesting.RandomizedRunner$8.evaluate(RandomizedRunner.java:942)
	at app//com.carrotsearch.randomizedtesting.RandomizedRunner$9.evaluate(RandomizedRunner.java:978)
	at app//com.carrotsearch.randomizedtesting.RandomizedRunner$10.evaluate(RandomizedRunner.java:992)
	at app//org.apache.solr.BaseDistributedSearchTestCase$ShardsRepeatRule$ShardsFixedStatement.callStatement(BaseDistributedSearchTestCase.java:1081)
	at app//org.apache.solr.BaseDistributedSearchTestCase$ShardsRepeatRule$ShardsStatement.evaluate(BaseDistributedSearchTestCase.java:1052)
	at app//com.carrotsearch.randomizedtesting.rules.SystemPropertiesRestoreRule$1.evaluate(SystemPropertiesRestoreRule.java:57)
	at app//org.junit.rules.RunRules.evaluate(RunRules.java:20)
	at app//org.apache.lucene.util.TestRuleSetupTeardownChained$1.evaluate(TestRuleSetupTeardownChained.java:44)
	at app//org.apache.lucene.util.AbstractBeforeAfterRule$1.evaluate(AbstractBeforeAfterRule.java:43)
	at app//org.apache.lucene.util.TestRuleThreadAndTestName$1.evaluate(TestRuleThreadAndTestName.java:45)
	at app//org.apache.lucene.util.TestRuleIgnoreAfterMaxFailures$1.evaluate(TestRuleIgnoreAfterMaxFailures.java:60)
	at app//org.apache.lucene.util.TestRuleMarkFailure$1.evaluate(TestRuleMarkFailure.java:44)
	at app//org.junit.rules.RunRules.evaluate(RunRules.java:20)
	at app//com.carrotsearch.randomizedtesting.rules.StatementAdapter.evaluate(StatementAdapter.java:36)
	at app//com.carrotsearch.randomizedtesting.ThreadLeakControl$StatementRunner.run(ThreadLeakControl.java:370)
	at app//com.carrotsearch.randomizedtesting.ThreadLeakControl.forkTimeoutingTask(ThreadLeakControl.java:819)
	at app//com.carrotsearch.randomizedtesting.ThreadLeakControl$3.evaluate(ThreadLeakControl.java:470)
	at app//com.carrotsearch.randomizedtesting.RandomizedRunner.runSingleTest(RandomizedRunner.java:951)
	at app//com.carrotsearch.randomizedtesting.RandomizedRunner$5.evaluate(RandomizedRunner.java:836)
	at app//com.carrotsearch.randomizedtesting.RandomizedRunner$6.evaluate(RandomizedRunner.java:887)
	at app//com.carrotsearch.randomizedtesting.RandomizedRunner$7.evaluate(RandomizedRunner.java:898)
	at app//com.carrotsearch.randomizedtesting.rules.StatementAdapter.evaluate(StatementAdapter.java:36)
	at app//org.apache.lucene.util.AbstractBeforeAfterRule$1.evaluate(AbstractBeforeAfterRule.java:43)
	at app//org.apache.lucene.util.AbstractBeforeAfterRule$1.evaluate(AbstractBeforeAfterRule.java:43)
	at app//com.carrotsearch.randomizedtesting.rules.SystemPropertiesRestoreRule$1.evaluate(SystemPropertiesRestoreRule.java:57)
	at app//org.junit.rules.RunRules.evaluate(RunRules.java:20)
	at app//org.apache.lucene.util.AbstractBeforeAfterRule$1.evaluate(AbstractBeforeAfterRule.java:43)
	at app//com.carrotsearch.randomizedtesting.rules.StatementAdapter.evaluate(StatementAdapter.java:36)
	at app//org.apache.lucene.util.TestRuleStoreClassName$1.evaluate(TestRuleStoreClassName.java:38)
	at app//com.carrotsearch.randomizedtesting.rules.NoShadowingOrOverridesOnMethodsRule$1.evaluate(NoShadowingOrOverridesOnMethodsRule.java:40)
	at app//com.carrotsearch.randomizedtesting.rules.NoShadowingOrOverridesOnMethodsRule$1.evaluate(NoShadowingOrOverridesOnMethodsRule.java:40)
	at app//com.carrotsearch.randomizedtesting.rules.StatementAdapter.evaluate(StatementAdapter.java:36)
	at app//com.carrotsearch.randomizedtesting.rules.StatementAdapter.evaluate(StatementAdapter.java:36)
	at app//org.apache.lucene.util.TestRuleAssertionsRequired$1.evaluate(TestRuleAssertionsRequired.java:53)
	at app//org.apache.lucene.util.AbstractBeforeAfterRule$1.evaluate(AbstractBeforeAfterRule.java:43)
	at app//org.apache.lucene.util.TestRuleMarkFailure$1.evaluate(TestRuleMarkFailure.java:44)
	at app//org.apache.lucene.util.TestRuleIgnoreAfterMaxFailures$1.evaluate(TestRuleIgnoreAfterMaxFailures.java:60)
	at app//org.apache.lucene.util.TestRuleIgnoreTestSuites$1.evaluate(TestRuleIgnoreTestSuites.java:47)
	at app//org.junit.rules.RunRules.evaluate(RunRules.java:20)
	at app//com.carrotsearch.randomizedtesting.rules.StatementAdapter.evaluate(StatementAdapter.java:36)
	at app//com.carrotsearch.randomizedtesting.ThreadLeakControl$StatementRunner.run(ThreadLeakControl.java:370)
	at app//com.carrotsearch.randomizedtesting.ThreadLeakControl.lambda$forkTimeoutingTask$0(ThreadLeakControl.java:826)
	at java.base@11.0.6/java.lang.Thread.run(Thread.java:834)