You are viewing a plain text version of this content. The canonical link for it is here.
Posted to dev@lucene.apache.org by Apache Jenkins Server <je...@builds.apache.org> on 2017/07/12 13:15:28 UTC
[JENKINS] Lucene-Solr-Tests-master - Build # 1974 - Still Failing
Build: https://builds.apache.org/job/Lucene-Solr-Tests-master/1974/
No tests ran.
Build Log:
[...truncated 6 lines...]
ERROR: Error fetching remote repo 'origin'
hudson.plugins.git.GitException: Failed to fetch from git://git.apache.org/lucene-solr.git
at hudson.plugins.git.GitSCM.fetchFrom(GitSCM.java:809)
at hudson.plugins.git.GitSCM.retrieveChanges(GitSCM.java:1076)
at hudson.plugins.git.GitSCM.checkout(GitSCM.java:1107)
at hudson.scm.SCM.checkout(SCM.java:496)
at hudson.model.AbstractProject.checkout(AbstractProject.java:1281)
at hudson.model.AbstractBuild$AbstractBuildExecution.defaultCheckout(AbstractBuild.java:604)
at jenkins.scm.SCMCheckoutStrategy.checkout(SCMCheckoutStrategy.java:86)
at hudson.model.AbstractBuild$AbstractBuildExecution.run(AbstractBuild.java:529)
at hudson.model.Run.execute(Run.java:1728)
at hudson.model.FreeStyleBuild.run(FreeStyleBuild.java:43)
at hudson.model.ResourceController.execute(ResourceController.java:98)
at hudson.model.Executor.run(Executor.java:405)
Caused by: hudson.plugins.git.GitException: Command "git config remote.origin.url git://git.apache.org/lucene-solr.git" returned status code 4:
stdout:
stderr: error: failed to write new configuration file /home/jenkins/jenkins-slave/workspace/Lucene-Solr-Tests-master/.git/config.lock
at org.jenkinsci.plugins.gitclient.CliGitAPIImpl.launchCommandIn(CliGitAPIImpl.java:1903)
at org.jenkinsci.plugins.gitclient.CliGitAPIImpl.launchCommandIn(CliGitAPIImpl.java:1871)
at org.jenkinsci.plugins.gitclient.CliGitAPIImpl.launchCommandIn(CliGitAPIImpl.java:1867)
at org.jenkinsci.plugins.gitclient.CliGitAPIImpl.launchCommand(CliGitAPIImpl.java:1512)
at org.jenkinsci.plugins.gitclient.CliGitAPIImpl.launchCommand(CliGitAPIImpl.java:1524)
at org.jenkinsci.plugins.gitclient.CliGitAPIImpl.setRemoteUrl(CliGitAPIImpl.java:1158)
at hudson.plugins.git.GitAPI.setRemoteUrl(GitAPI.java:160)
at sun.reflect.GeneratedMethodAccessor79.invoke(Unknown Source)
at sun.reflect.DelegatingMethodAccessorImpl.invoke(DelegatingMethodAccessorImpl.java:43)
at java.lang.reflect.Method.invoke(Method.java:498)
at hudson.remoting.RemoteInvocationHandler$RPCRequest.perform(RemoteInvocationHandler.java:895)
at hudson.remoting.RemoteInvocationHandler$RPCRequest.call(RemoteInvocationHandler.java:870)
at hudson.remoting.RemoteInvocationHandler$RPCRequest.call(RemoteInvocationHandler.java:829)
at hudson.remoting.UserRequest.perform(UserRequest.java:153)
at hudson.remoting.UserRequest.perform(UserRequest.java:50)
at hudson.remoting.Request$2.run(Request.java:336)
at hudson.remoting.InterceptingExecutorService$1.call(InterceptingExecutorService.java:68)
at java.util.concurrent.FutureTask.run(FutureTask.java:266)
at java.util.concurrent.ThreadPoolExecutor.runWorker(ThreadPoolExecutor.java:1142)
at java.util.concurrent.ThreadPoolExecutor$Worker.run(ThreadPoolExecutor.java:617)
at java.lang.Thread.run(Thread.java:748)
at ......remote call to lucene2(Native Method)
at hudson.remoting.Channel.attachCallSiteStackTrace(Channel.java:1545)
at hudson.remoting.UserResponse.retrieve(UserRequest.java:253)
at hudson.remoting.Channel.call(Channel.java:830)
at hudson.remoting.RemoteInvocationHandler.invoke(RemoteInvocationHandler.java:257)
at com.sun.proxy.$Proxy103.setRemoteUrl(Unknown Source)
at org.jenkinsci.plugins.gitclient.RemoteGitImpl.setRemoteUrl(RemoteGitImpl.java:295)
at hudson.plugins.git.GitSCM.fetchFrom(GitSCM.java:797)
... 11 more
ERROR: null
Retrying after 10 seconds
> git rev-parse --is-inside-work-tree # timeout=10
Fetching changes from the remote Git repository
> git config remote.origin.url git://git.apache.org/lucene-solr.git # timeout=10
ERROR: Error fetching remote repo 'origin'
hudson.plugins.git.GitException: Failed to fetch from git://git.apache.org/lucene-solr.git
at hudson.plugins.git.GitSCM.fetchFrom(GitSCM.java:809)
at hudson.plugins.git.GitSCM.retrieveChanges(GitSCM.java:1076)
at hudson.plugins.git.GitSCM.checkout(GitSCM.java:1107)
at hudson.scm.SCM.checkout(SCM.java:496)
at hudson.model.AbstractProject.checkout(AbstractProject.java:1281)
at hudson.model.AbstractBuild$AbstractBuildExecution.defaultCheckout(AbstractBuild.java:604)
at jenkins.scm.SCMCheckoutStrategy.checkout(SCMCheckoutStrategy.java:86)
at hudson.model.AbstractBuild$AbstractBuildExecution.run(AbstractBuild.java:529)
at hudson.model.Run.execute(Run.java:1728)
at hudson.model.FreeStyleBuild.run(FreeStyleBuild.java:43)
at hudson.model.ResourceController.execute(ResourceController.java:98)
at hudson.model.Executor.run(Executor.java:405)
Caused by: hudson.plugins.git.GitException: Command "git config remote.origin.url git://git.apache.org/lucene-solr.git" returned status code 4:
stdout:
stderr: error: failed to write new configuration file /home/jenkins/jenkins-slave/workspace/Lucene-Solr-Tests-master/.git/config.lock
at org.jenkinsci.plugins.gitclient.CliGitAPIImpl.launchCommandIn(CliGitAPIImpl.java:1903)
at org.jenkinsci.plugins.gitclient.CliGitAPIImpl.launchCommandIn(CliGitAPIImpl.java:1871)
at org.jenkinsci.plugins.gitclient.CliGitAPIImpl.launchCommandIn(CliGitAPIImpl.java:1867)
at org.jenkinsci.plugins.gitclient.CliGitAPIImpl.launchCommand(CliGitAPIImpl.java:1512)
at org.jenkinsci.plugins.gitclient.CliGitAPIImpl.launchCommand(CliGitAPIImpl.java:1524)
at org.jenkinsci.plugins.gitclient.CliGitAPIImpl.setRemoteUrl(CliGitAPIImpl.java:1158)
at hudson.plugins.git.GitAPI.setRemoteUrl(GitAPI.java:160)
at sun.reflect.GeneratedMethodAccessor79.invoke(Unknown Source)
at sun.reflect.DelegatingMethodAccessorImpl.invoke(DelegatingMethodAccessorImpl.java:43)
at java.lang.reflect.Method.invoke(Method.java:498)
at hudson.remoting.RemoteInvocationHandler$RPCRequest.perform(RemoteInvocationHandler.java:895)
at hudson.remoting.RemoteInvocationHandler$RPCRequest.call(RemoteInvocationHandler.java:870)
at hudson.remoting.RemoteInvocationHandler$RPCRequest.call(RemoteInvocationHandler.java:829)
at hudson.remoting.UserRequest.perform(UserRequest.java:153)
at hudson.remoting.UserRequest.perform(UserRequest.java:50)
at hudson.remoting.Request$2.run(Request.java:336)
at hudson.remoting.InterceptingExecutorService$1.call(InterceptingExecutorService.java:68)
at java.util.concurrent.FutureTask.run(FutureTask.java:266)
at java.util.concurrent.ThreadPoolExecutor.runWorker(ThreadPoolExecutor.java:1142)
at java.util.concurrent.ThreadPoolExecutor$Worker.run(ThreadPoolExecutor.java:617)
at java.lang.Thread.run(Thread.java:748)
at ......remote call to lucene2(Native Method)
at hudson.remoting.Channel.attachCallSiteStackTrace(Channel.java:1545)
at hudson.remoting.UserResponse.retrieve(UserRequest.java:253)
at hudson.remoting.Channel.call(Channel.java:830)
at hudson.remoting.RemoteInvocationHandler.invoke(RemoteInvocationHandler.java:257)
at com.sun.proxy.$Proxy103.setRemoteUrl(Unknown Source)
at org.jenkinsci.plugins.gitclient.RemoteGitImpl.setRemoteUrl(RemoteGitImpl.java:295)
at hudson.plugins.git.GitSCM.fetchFrom(GitSCM.java:797)
... 11 more
ERROR: null
Retrying after 10 seconds
> git rev-parse --is-inside-work-tree # timeout=10
Fetching changes from the remote Git repository
> git config remote.origin.url git://git.apache.org/lucene-solr.git # timeout=10
ERROR: Error fetching remote repo 'origin'
hudson.plugins.git.GitException: Failed to fetch from git://git.apache.org/lucene-solr.git
at hudson.plugins.git.GitSCM.fetchFrom(GitSCM.java:809)
at hudson.plugins.git.GitSCM.retrieveChanges(GitSCM.java:1076)
at hudson.plugins.git.GitSCM.checkout(GitSCM.java:1107)
at hudson.scm.SCM.checkout(SCM.java:496)
at hudson.model.AbstractProject.checkout(AbstractProject.java:1281)
at hudson.model.AbstractBuild$AbstractBuildExecution.defaultCheckout(AbstractBuild.java:604)
at jenkins.scm.SCMCheckoutStrategy.checkout(SCMCheckoutStrategy.java:86)
at hudson.model.AbstractBuild$AbstractBuildExecution.run(AbstractBuild.java:529)
at hudson.model.Run.execute(Run.java:1728)
at hudson.model.FreeStyleBuild.run(FreeStyleBuild.java:43)
at hudson.model.ResourceController.execute(ResourceController.java:98)
at hudson.model.Executor.run(Executor.java:405)
Caused by: hudson.plugins.git.GitException: Command "git config remote.origin.url git://git.apache.org/lucene-solr.git" returned status code 4:
stdout:
stderr: error: failed to write new configuration file /home/jenkins/jenkins-slave/workspace/Lucene-Solr-Tests-master/.git/config.lock
at org.jenkinsci.plugins.gitclient.CliGitAPIImpl.launchCommandIn(CliGitAPIImpl.java:1903)
at org.jenkinsci.plugins.gitclient.CliGitAPIImpl.launchCommandIn(CliGitAPIImpl.java:1871)
at org.jenkinsci.plugins.gitclient.CliGitAPIImpl.launchCommandIn(CliGitAPIImpl.java:1867)
at org.jenkinsci.plugins.gitclient.CliGitAPIImpl.launchCommand(CliGitAPIImpl.java:1512)
at org.jenkinsci.plugins.gitclient.CliGitAPIImpl.launchCommand(CliGitAPIImpl.java:1524)
at org.jenkinsci.plugins.gitclient.CliGitAPIImpl.setRemoteUrl(CliGitAPIImpl.java:1158)
at hudson.plugins.git.GitAPI.setRemoteUrl(GitAPI.java:160)
at sun.reflect.GeneratedMethodAccessor79.invoke(Unknown Source)
at sun.reflect.DelegatingMethodAccessorImpl.invoke(DelegatingMethodAccessorImpl.java:43)
at java.lang.reflect.Method.invoke(Method.java:498)
at hudson.remoting.RemoteInvocationHandler$RPCRequest.perform(RemoteInvocationHandler.java:895)
at hudson.remoting.RemoteInvocationHandler$RPCRequest.call(RemoteInvocationHandler.java:870)
at hudson.remoting.RemoteInvocationHandler$RPCRequest.call(RemoteInvocationHandler.java:829)
at hudson.remoting.UserRequest.perform(UserRequest.java:153)
at hudson.remoting.UserRequest.perform(UserRequest.java:50)
at hudson.remoting.Request$2.run(Request.java:336)
at hudson.remoting.InterceptingExecutorService$1.call(InterceptingExecutorService.java:68)
at java.util.concurrent.FutureTask.run(FutureTask.java:266)
at java.util.concurrent.ThreadPoolExecutor.runWorker(ThreadPoolExecutor.java:1142)
at java.util.concurrent.ThreadPoolExecutor$Worker.run(ThreadPoolExecutor.java:617)
at java.lang.Thread.run(Thread.java:748)
at ......remote call to lucene2(Native Method)
at hudson.remoting.Channel.attachCallSiteStackTrace(Channel.java:1545)
at hudson.remoting.UserResponse.retrieve(UserRequest.java:253)
at hudson.remoting.Channel.call(Channel.java:830)
at hudson.remoting.RemoteInvocationHandler.invoke(RemoteInvocationHandler.java:257)
at com.sun.proxy.$Proxy103.setRemoteUrl(Unknown Source)
at org.jenkinsci.plugins.gitclient.RemoteGitImpl.setRemoteUrl(RemoteGitImpl.java:295)
at hudson.plugins.git.GitSCM.fetchFrom(GitSCM.java:797)
... 11 more
ERROR: null
Archiving artifacts
Recording test results
ERROR: Step ‘Publish JUnit test result report’ failed: Test reports were found but none of them are new. Did tests run?
For example, /home/jenkins/jenkins-slave/workspace/Lucene-Solr-Tests-master/lucene/build/analysis/common/test/TEST-org.apache.lucene.analysis.ar.TestArabicAnalyzer.xml is 22 hr old
Email was triggered for: Failure - Any
Sending email for trigger: Failure - Any
[JENKINS] Lucene-Solr-Tests-master - Build # 1975 - Unstable
Posted by Apache Jenkins Server <je...@builds.apache.org>.
Build: https://builds.apache.org/job/Lucene-Solr-Tests-master/1975/
1 tests failed.
FAILED: junit.framework.TestSuite.org.apache.solr.analytics.NoFacetCloudTest
Error Message:
Error from server at https://127.0.0.1:40201/solr/collection1: Async exception during distributed update: Broken pipe (Write failed)
Stack Trace:
org.apache.solr.client.solrj.impl.HttpSolrClient$RemoteSolrException: Error from server at https://127.0.0.1:40201/solr/collection1: Async exception during distributed update: Broken pipe (Write failed)
at __randomizedtesting.SeedInfo.seed([88158922EFDF39A8]:0)
at org.apache.solr.client.solrj.impl.HttpSolrClient.executeMethod(HttpSolrClient.java:626)
at org.apache.solr.client.solrj.impl.HttpSolrClient.request(HttpSolrClient.java:252)
at org.apache.solr.client.solrj.impl.HttpSolrClient.request(HttpSolrClient.java:241)
at org.apache.solr.client.solrj.impl.LBHttpSolrClient.doRequest(LBHttpSolrClient.java:483)
at org.apache.solr.client.solrj.impl.LBHttpSolrClient.request(LBHttpSolrClient.java:413)
at org.apache.solr.client.solrj.impl.CloudSolrClient.sendRequest(CloudSolrClient.java:1121)
at org.apache.solr.client.solrj.impl.CloudSolrClient.requestWithRetryOnStaleState(CloudSolrClient.java:862)
at org.apache.solr.client.solrj.impl.CloudSolrClient.request(CloudSolrClient.java:793)
at org.apache.solr.client.solrj.SolrRequest.process(SolrRequest.java:178)
at org.apache.solr.client.solrj.request.UpdateRequest.commit(UpdateRequest.java:233)
at org.apache.solr.analytics.AbstractAnalyticsStatsCloudTest.cleanIndex(AbstractAnalyticsStatsCloudTest.java:84)
at org.apache.solr.analytics.AbstractAnalyticsStatsCloudTest.setupCluster(AbstractAnalyticsStatsCloudTest.java:78)
at org.apache.solr.analytics.NoFacetCloudTest.populate(NoFacetCloudTest.java:62)
at sun.reflect.NativeMethodAccessorImpl.invoke0(Native Method)
at sun.reflect.NativeMethodAccessorImpl.invoke(NativeMethodAccessorImpl.java:62)
at sun.reflect.DelegatingMethodAccessorImpl.invoke(DelegatingMethodAccessorImpl.java:43)
at java.lang.reflect.Method.invoke(Method.java:498)
at com.carrotsearch.randomizedtesting.RandomizedRunner.invoke(RandomizedRunner.java:1713)
at com.carrotsearch.randomizedtesting.RandomizedRunner$6.evaluate(RandomizedRunner.java:847)
at com.carrotsearch.randomizedtesting.RandomizedRunner$7.evaluate(RandomizedRunner.java:863)
at com.carrotsearch.randomizedtesting.rules.StatementAdapter.evaluate(StatementAdapter.java:36)
at com.carrotsearch.randomizedtesting.rules.SystemPropertiesRestoreRule$1.evaluate(SystemPropertiesRestoreRule.java:57)
at org.apache.lucene.util.AbstractBeforeAfterRule$1.evaluate(AbstractBeforeAfterRule.java:45)
at com.carrotsearch.randomizedtesting.rules.StatementAdapter.evaluate(StatementAdapter.java:36)
at org.apache.lucene.util.TestRuleStoreClassName$1.evaluate(TestRuleStoreClassName.java:41)
at com.carrotsearch.randomizedtesting.rules.NoShadowingOrOverridesOnMethodsRule$1.evaluate(NoShadowingOrOverridesOnMethodsRule.java:40)
at com.carrotsearch.randomizedtesting.rules.NoShadowingOrOverridesOnMethodsRule$1.evaluate(NoShadowingOrOverridesOnMethodsRule.java:40)
at com.carrotsearch.randomizedtesting.rules.StatementAdapter.evaluate(StatementAdapter.java:36)
at com.carrotsearch.randomizedtesting.rules.StatementAdapter.evaluate(StatementAdapter.java:36)
at com.carrotsearch.randomizedtesting.rules.StatementAdapter.evaluate(StatementAdapter.java:36)
at org.apache.lucene.util.TestRuleAssertionsRequired$1.evaluate(TestRuleAssertionsRequired.java:53)
at org.apache.lucene.util.TestRuleMarkFailure$1.evaluate(TestRuleMarkFailure.java:47)
at org.apache.lucene.util.TestRuleIgnoreAfterMaxFailures$1.evaluate(TestRuleIgnoreAfterMaxFailures.java:64)
at org.apache.lucene.util.TestRuleIgnoreTestSuites$1.evaluate(TestRuleIgnoreTestSuites.java:54)
at com.carrotsearch.randomizedtesting.rules.StatementAdapter.evaluate(StatementAdapter.java:36)
at com.carrotsearch.randomizedtesting.ThreadLeakControl$StatementRunner.run(ThreadLeakControl.java:368)
at java.lang.Thread.run(Thread.java:748)
Build Log:
[...truncated 15777 lines...]
[junit4] Suite: org.apache.solr.analytics.NoFacetCloudTest
[junit4] 2> Creating dataDir: /x1/jenkins/jenkins-slave/workspace/Lucene-Solr-Tests-master/solr/build/contrib/solr-analytics/test/J2/temp/solr.analytics.NoFacetCloudTest_88158922EFDF39A8-001/init-core-data-001
[junit4] 2> Jul 12, 2017 4:18:42 PM com.carrotsearch.randomizedtesting.ThreadLeakControl checkThreadLeaks
[junit4] 2> WARNING: Will linger awaiting termination of 1 leaked thread(s).
[junit4] 2> NOTE: test params are: codec=FastCompressingStoredFields(storedFieldsFormat=CompressingStoredFieldsFormat(compressionMode=FAST, chunkSize=8, maxDocsPerChunk=5, blockSize=9), termVectorsFormat=CompressingTermVectorsFormat(compressionMode=FAST, chunkSize=8, blockSize=9)), sim=RandomSimilarity(queryNorm=true): {}, locale=ar-SA, timezone=Africa/Ceuta
[junit4] 2> NOTE: Linux 3.13.0-88-generic amd64/Oracle Corporation 1.8.0_131 (64-bit)/cpus=4,threads=1,free=221141168,total=322961408
[junit4] 2> NOTE: All tests run in this JVM: [FunctionTest, NoFacetCloudTest]
[junit4] 2> NOTE: reproduce with: ant test -Dtestcase=NoFacetCloudTest -Dtests.seed=88158922EFDF39A8 -Dtests.multiplier=2 -Dtests.slow=true -Dtests.locale=ar-SA -Dtests.timezone=Africa/Ceuta -Dtests.asserts=true -Dtests.file.encoding=ISO-8859-1
[junit4] ERROR 0.00s J2 | NoFacetCloudTest (suite) <<<
[junit4] > Throwable #1: org.apache.solr.client.solrj.impl.HttpSolrClient$RemoteSolrException: Error from server at https://127.0.0.1:40201/solr/collection1: Async exception during distributed update: Broken pipe (Write failed)
[junit4] > at __randomizedtesting.SeedInfo.seed([88158922EFDF39A8]:0)
[junit4] > at org.apache.solr.client.solrj.impl.HttpSolrClient.executeMethod(HttpSolrClient.java:626)
[junit4] > at org.apache.solr.client.solrj.impl.HttpSolrClient.request(HttpSolrClient.java:252)
[junit4] > at org.apache.solr.client.solrj.impl.HttpSolrClient.request(HttpSolrClient.java:241)
[junit4] > at org.apache.solr.client.solrj.impl.LBHttpSolrClient.doRequest(LBHttpSolrClient.java:483)
[junit4] > at org.apache.solr.client.solrj.impl.LBHttpSolrClient.request(LBHttpSolrClient.java:413)
[junit4] > at org.apache.solr.client.solrj.impl.CloudSolrClient.sendRequest(CloudSolrClient.java:1121)
[junit4] > at org.apache.solr.client.solrj.impl.CloudSolrClient.requestWithRetryOnStaleState(CloudSolrClient.java:862)
[junit4] > at org.apache.solr.client.solrj.impl.CloudSolrClient.request(CloudSolrClient.java:793)
[junit4] > at org.apache.solr.client.solrj.SolrRequest.process(SolrRequest.java:178)
[junit4] > at org.apache.solr.client.solrj.request.UpdateRequest.commit(UpdateRequest.java:233)
[junit4] > at org.apache.solr.analytics.AbstractAnalyticsStatsCloudTest.cleanIndex(AbstractAnalyticsStatsCloudTest.java:84)
[junit4] > at org.apache.solr.analytics.AbstractAnalyticsStatsCloudTest.setupCluster(AbstractAnalyticsStatsCloudTest.java:78)
[junit4] > at org.apache.solr.analytics.NoFacetCloudTest.populate(NoFacetCloudTest.java:62)
[junit4] > at java.lang.Thread.run(Thread.java:748)
[junit4] Completed [6/17 (1!)] on J2 in 11.22s, 0 tests, 1 error <<< FAILURES!
[...truncated 40637 lines...]