You are viewing a plain text version of this content. The canonical link for it is here.
Posted to notifications@maven.apache.org by Apache Hudson Server <hu...@hudson.zones.apache.org> on 2009/01/07 07:21:01 UTC
Build failed in Hudson: Maven-2.1.x-with-bootstrap #257
See http://hudson.zones.apache.org/hudson/job/Maven-2.1.x-with-bootstrap/257/changes
Changes:
[sisbell] Build broken. Disabled mercury unit test, until issue is fixed.
------------------------------------------
[...truncated 1357 lines...]
[java] [INFO] Scanning for projects...
[java] [INFO] ------------------------------------------------------------------------
[java] [INFO] Building Maven Quick Start Archetype
[java] [INFO]
[java] [INFO] Id: org.apache.maven:embedder-test-project:jar:1.0-SNAPSHOT
[java] [INFO] task-segment: [package]
[java] [INFO] ------------------------------------------------------------------------
[java] [INFO] [resources:resources]
[java] [INFO] Using default encoding to copy filtered resources.
[java] [INFO] [compiler:compile]
[java] [INFO] Compiling 1 source file to /zonestorage/hudson/home/hudson/hudson/jobs/Maven-2.1.x-with-bootstrap/workspace/trunk/maven-embedder/target/embedder-test-project1/target/classes
[java] [INFO] [resources:testResources]
[java] [INFO] Using default encoding to copy filtered resources.
[java] [INFO] [compiler:testCompile]
[java] [INFO] Compiling 1 source file to /zonestorage/hudson/home/hudson/hudson/jobs/Maven-2.1.x-with-bootstrap/workspace/trunk/maven-embedder/target/embedder-test-project1/target/test-classes
[java] [INFO] [surefire:test]
[java] [INFO] Surefire report directory: /zonestorage/hudson/home/hudson/hudson/jobs/Maven-2.1.x-with-bootstrap/workspace/trunk/maven-embedder/target/embedder-test-project1/target/surefire-reports
[java]
[java] -------------------------------------------------------
[java] T E S T S
[java] -------------------------------------------------------
[java] Running org.apache.maven.AppTest
[java] Tests run: 1, Failures: 0, Errors: 0, Skipped: 0, Time elapsed: 0.034 sec
[java]
[java] Results :
[java]
[java] Tests run: 1, Failures: 0, Errors: 0, Skipped: 0
[java]
[java] [INFO] [jar:jar]
[java] [INFO] Building jar: /zonestorage/hudson/home/hudson/hudson/jobs/Maven-2.1.x-with-bootstrap/workspace/trunk/maven-embedder/target/embedder-test-project1/target/embedder-test-project-1.0-SNAPSHOT.jar
[java] [INFO] Scanning for projects...
[java] [INFO] ------------------------------------------------------------------------
[java] [INFO] Building Maven Quick Start Archetype
[java] [INFO]
[java] [INFO] Id: org.apache.maven:embedder-test-project:jar:1.0-SNAPSHOT
[java] [INFO] task-segment: [validate]
[java] [INFO] ------------------------------------------------------------------------
[java] [INFO] Scanning for projects...
[java] [INFO] ------------------------------------------------------------------------
[java] [INFO] Building Maven Quick Start Archetype
[java] [INFO]
[java] [INFO] Id: org.apache.maven:embedder-test-project:jar:1.0-SNAPSHOT
[java] [INFO] task-segment: [validate]
[java] [INFO] ------------------------------------------------------------------------
[java] [INFO] Scanning for projects...
[java] [INFO] ------------------------------------------------------------------------
[java] [INFO] Building Maven Quick Start Archetype
[java] [INFO]
[java] [INFO] Id: org.apache.maven:embedder-test-project:jar:1.0-SNAPSHOT
[java] [INFO] task-segment: [package]
[java] [INFO] ------------------------------------------------------------------------
[java] [INFO] [resources:resources]
[java] [INFO] Using default encoding to copy filtered resources.
[java] [INFO] [compiler:compile]
[java] [INFO] Compiling 1 source file to /zonestorage/hudson/home/hudson/hudson/jobs/Maven-2.1.x-with-bootstrap/workspace/trunk/maven-embedder/target/embedder-test-project-caching/target/classes
[java] [INFO] [resources:testResources]
[java] [INFO] Using default encoding to copy filtered resources.
[java] [INFO] [compiler:testCompile]
[java] [INFO] Compiling 1 source file to /zonestorage/hudson/home/hudson/hudson/jobs/Maven-2.1.x-with-bootstrap/workspace/trunk/maven-embedder/target/embedder-test-project-caching/target/test-classes
[java] [INFO] [surefire:test]
[java] [INFO] Surefire report directory: /zonestorage/hudson/home/hudson/hudson/jobs/Maven-2.1.x-with-bootstrap/workspace/trunk/maven-embedder/target/embedder-test-project-caching/target/surefire-reports
[java]
[java] -------------------------------------------------------
[java] T E S T S
[java] -------------------------------------------------------
[java] Running org.apache.maven.AppTest
[java] Tests run: 1, Failures: 0, Errors: 0, Skipped: 0, Time elapsed: 0.026 sec
[java]
[java] Results :
[java] Tests run: 1, Failures: 0, Errors: 0, Skipped: 0
[java]
[java] [INFO] [jar:jar]
[java] [INFO] Building jar: /zonestorage/hudson/home/hudson/hudson/jobs/Maven-2.1.x-with-bootstrap/workspace/trunk/maven-embedder/target/embedder-test-project-caching/target/embedder-test-project-1.0-SNAPSHOT.jar
[java] [INFO] Scanning for projects...
[java] [INFO] ------------------------------------------------------------------------
[java] [INFO] Building Maven Quick Start Archetype
[java] [INFO]
[java] [INFO] Id: org.apache.maven:embedder-test-project:jar:1.0-SNAPSHOT
[java] [INFO] task-segment: [package]
[java] [INFO] ------------------------------------------------------------------------
[java] [INFO] [resources:resources]
[java] [INFO] Using default encoding to copy filtered resources.
[java] [INFO] [compiler:compile]
[java] [INFO] Nothing to compile - all classes are up to date
[java] [INFO] [resources:testResources]
[java] [INFO] Using default encoding to copy filtered resources.
[java] [INFO] [compiler:testCompile]
[java] [INFO] Nothing to compile - all classes are up to date
[java] [INFO] [surefire:test]
[java] [INFO] Surefire report directory: /zonestorage/hudson/home/hudson/hudson/jobs/Maven-2.1.x-with-bootstrap/workspace/trunk/maven-embedder/target/embedder-test-project-caching/target/surefire-reports
[java]
[java] -------------------------------------------------------
[java] T E S T S
[java] -------------------------------------------------------
[java] Running org.apache.maven.AppTest
[java] Tests run: 1, Failures: 0, Errors: 0, Skipped: 0, Time elapsed: 0.039 sec
[java]
[java] Results :
[java]
[java] Tests run: 1, Failures: 0, Errors: 0, Skipped: 0
[java]
[java] [INFO] [jar:jar]
[java] Tests run: 16, Failures: 0, Errors: 0, Skipped: 0, Time elapsed: 10.71 sec
[java] Running org.apache.maven.cli.CLIRequestUtilsTest
[java] key=value
[java] []
[java] Tests run: 2, Failures: 0, Errors: 0, Skipped: 0, Time elapsed: 0.108 sec
[java]
[java] Results :
[java]
[java] Tests run: 56, Failures: 0, Errors: 0, Skipped: 0
[java]
[java] [INFO] [jar:jar]
[java] [INFO] Building jar: /zonestorage/hudson/home/hudson/hudson/jobs/Maven-2.1.x-with-bootstrap/workspace/trunk/maven-embedder/target/maven-embedder-3.0-SNAPSHOT.jar
[java] [INFO] [install:install]
[java] [INFO] Installing /zonestorage/hudson/home/hudson/hudson/jobs/Maven-2.1.x-with-bootstrap/workspace/trunk/maven-embedder/target/maven-embedder-3.0-SNAPSHOT.jar to /export/home/hudson/.m2/repository/org/apache/maven/maven-embedder/3.0-SNAPSHOT/maven-embedder-3.0-SNAPSHOT.jar
[java] [INFO] ------------------------------------------------------------------------
[java] [INFO] Building Maven Distribution
[java] [INFO]
[java] [INFO] Id: org.apache.maven:maven-distribution:jar:3.0-SNAPSHOT
[java] [INFO] task-segment: [clean, install]
[java] [INFO] ------------------------------------------------------------------------
[java] [INFO] [clean:clean]
[java] [INFO] Deleting directory /zonestorage/hudson/home/hudson/hudson/jobs/Maven-2.1.x-with-bootstrap/workspace/trunk/maven-distribution/target
[java] [INFO] snapshot org.apache.maven:maven-embedder:3.0-SNAPSHOT: checking for updates from apache.snapshots
[java] [INFO] [remote-resources:process]
[java] [INFO] [resources:resources]
[java] [INFO] Using 'UTF-8' encoding to copy filtered resources.
[java] [INFO] skip non existing resourceDirectory /zonestorage/hudson/home/hudson/hudson/jobs/Maven-2.1.x-with-bootstrap/workspace/trunk/maven-distribution/src/main/resources
[java] [INFO] Copying 3 resources
[java] [INFO] [compiler:compile]
[java] [INFO] No sources to compile
[java] [INFO] [resources:testResources]
[java] [INFO] Using 'UTF-8' encoding to copy filtered resources.
[java] [INFO] skip non existing resourceDirectory /zonestorage/hudson/home/hudson/hudson/jobs/Maven-2.1.x-with-bootstrap/workspace/trunk/maven-distribution/src/test/resources
[java] [INFO] Copying 3 resources
[java] [INFO] [compiler:testCompile]
[java] [INFO] Compiling 1 source file to /zonestorage/hudson/home/hudson/hudson/jobs/Maven-2.1.x-with-bootstrap/workspace/trunk/maven-distribution/target/test-classes
[java] [INFO] [surefire:test]
[java] [INFO] Surefire report directory: /zonestorage/hudson/home/hudson/hudson/jobs/Maven-2.1.x-with-bootstrap/workspace/trunk/maven-distribution/target/surefire-reports
[java]
[java] -------------------------------------------------------
[java] T E S T S
[java] -------------------------------------------------------
[java] Running org.apache.maven.settings.GlobalSettingsTest
[java] Tests run: 1, Failures: 0, Errors: 0, Skipped: 0, Time elapsed: 0.162 sec
[java]
[java] Results :
[java]
[java] Tests run: 1, Failures: 0, Errors: 0, Skipped: 0
[java]
[java] [INFO] [jar:jar]
[java] [INFO] Building jar: /zonestorage/hudson/home/hudson/hudson/jobs/Maven-2.1.x-with-bootstrap/workspace/trunk/maven-distribution/target/maven-distribution-3.0-SNAPSHOT.jar
[java] [INFO] [assembly:single]
[java] [INFO] Reading assembly descriptor: src/main/assembly/bin.xml
[java] [INFO] Processing DependencySet (output=boot)
[java] [INFO] Processing DependencySet (output=lib)
[java] [WARNING] The following patterns were never triggered in this artifact exclusion filter:
[java] o 'org.codehaus.plexus:plexus-component-api'
[java] o 'classworlds:classworlds'
[java] o 'jmock:jmock'
[java] o 'xml-apis:xml-apis'
[java] o 'org.apache.maven:maven-artifact'
[java] o 'org.apache.maven:maven-monitor'
[java] o 'org.apache.maven:maven-plugin-descriptor'
[java] o 'jdom:jdom'
[java]
[java] [INFO] snapshot org.apache.maven:maven-distribution:3.0-SNAPSHOT: checking for updates from apache.snapshots
[java] [INFO] No files selected for line-ending conversion. Skipping: src/bin
[java] [INFO] No files selected for line-ending conversion. Skipping: src/bin
[java] [INFO] Building tar : /zonestorage/hudson/home/hudson/hudson/jobs/Maven-2.1.x-with-bootstrap/workspace/trunk/maven-distribution/target/apache-maven-3.0-SNAPSHOT-bin.tar.gz
[java] [INFO] Processing DependencySet (output=boot)
[java] [INFO] Processing DependencySet (output=lib)
[java] [WARNING] The following patterns were never triggered in this artifact exclusion filter:
[java] o 'org.codehaus.plexus:plexus-component-api'
[java] o 'classworlds:classworlds'
[java] o 'jmock:jmock'
[java] o 'xml-apis:xml-apis'
[java] o 'org.apache.maven:maven-artifact'
[java] o 'org.apache.maven:maven-monitor'
[java] o 'org.apache.maven:maven-plugin-descriptor'
[java] o 'jdom:jdom'
[java]
[java] [INFO] No files selected for line-ending conversion. Skipping: src/bin
[java] [INFO] No files selected for line-ending conversion. Skipping: src/bin
[java] [INFO] Building tar : /zonestorage/hudson/home/hudson/hudson/jobs/Maven-2.1.x-with-bootstrap/workspace/trunk/maven-distribution/target/apache-maven-3.0-SNAPSHOT-bin.tar.bz2
[java] [INFO] Processing DependencySet (output=boot)
[java] [INFO] Processing DependencySet (output=lib)
[java] [WARNING] The following patterns were never triggered in this artifact exclusion filter:
[java] o 'org.codehaus.plexus:plexus-component-api'
[java] o 'classworlds:classworlds'
[java] o 'jmock:jmock'
[java] o 'xml-apis:xml-apis'
[java] o 'org.apache.maven:maven-artifact'
[java] o 'org.apache.maven:maven-monitor'
[java] o 'org.apache.maven:maven-plugin-descriptor'
[java] o 'jdom:jdom'
[java]
[java] [INFO] No files selected for line-ending conversion. Skipping: src/bin
[java] [INFO] No files selected for line-ending conversion. Skipping: src/bin
[java] [INFO] Building zip: /zonestorage/hudson/home/hudson/hudson/jobs/Maven-2.1.x-with-bootstrap/workspace/trunk/maven-distribution/target/apache-maven-3.0-SNAPSHOT-bin.zip
[java] [INFO] [install:install]
[java] [INFO] Installing /zonestorage/hudson/home/hudson/hudson/jobs/Maven-2.1.x-with-bootstrap/workspace/trunk/maven-distribution/target/maven-distribution-3.0-SNAPSHOT.jar to /export/home/hudson/.m2/repository/org/apache/maven/maven-distribution/3.0-SNAPSHOT/maven-distribution-3.0-SNAPSHOT.jar
[java] [INFO] Installing /zonestorage/hudson/home/hudson/hudson/jobs/Maven-2.1.x-with-bootstrap/workspace/trunk/maven-distribution/target/apache-maven-3.0-SNAPSHOT-bin.tar.gz to /export/home/hudson/.m2/repository/org/apache/maven/maven-distribution/3.0-SNAPSHOT/maven-distribution-3.0-SNAPSHOT-bin.tar.gz
[java] [INFO] Installing /zonestorage/hudson/home/hudson/hudson/jobs/Maven-2.1.x-with-bootstrap/workspace/trunk/maven-distribution/target/apache-maven-3.0-SNAPSHOT-bin.tar.bz2 to /export/home/hudson/.m2/repository/org/apache/maven/maven-distribution/3.0-SNAPSHOT/maven-distribution-3.0-SNAPSHOT-bin.tar.bz2
[java] [INFO] Installing /zonestorage/hudson/home/hudson/hudson/jobs/Maven-2.1.x-with-bootstrap/workspace/trunk/maven-distribution/target/apache-maven-3.0-SNAPSHOT-bin.zip to /export/home/hudson/.m2/repository/org/apache/maven/maven-distribution/3.0-SNAPSHOT/maven-distribution-3.0-SNAPSHOT-bin.zip
[java] [INFO]
[java] [INFO]
[java] [INFO] ------------------------------------------------------------------------
[java] [INFO] Reactor Summary:
[java] [INFO] ------------------------------------------------------------------------
[java] [INFO] Apache Maven .......................................... SUCCESS [3.886s]
[java] [INFO] Maven Lifecycle Model ................................. SUCCESS [7.781s]
[java] [INFO] Maven Reporting API ................................... SUCCESS [2.216s]
[java] [INFO] Maven Model ........................................... SUCCESS [6.799s]
[java] [INFO] Maven Compat .......................................... SUCCESS [24.805s]
[java] [INFO] Maven Plugin API ...................................... SUCCESS [3.837s]
[java] [INFO] Maven Project Builder ................................. SUCCESS [4.706s]
[java] [INFO] Maven Project Builder ................................. SUCCESS [19.052s]
[java] [INFO] Maven Mercury ......................................... SUCCESS [5.282s]
[java] [INFO] Maven Core ............................................ SUCCESS [24.822s]
[java] [INFO] Maven Toolchains ...................................... SUCCESS [4.101s]
[java] [INFO] Maven Embedder ........................................ SUCCESS [48.371s]
[java] [INFO] Maven Distribution .................................... SUCCESS [40.607s]
[java] [INFO] ------------------------------------------------------------------------
[java] [INFO] ------------------------------------------------------------------------
[java] [INFO] BUILD SUCCESSFUL
[java] [INFO] ------------------------------------------------------------------------
[java] [INFO] Total time: 3 minutes 31 seconds
[java] [INFO] Finished at: Wed Jan 07 06:20:59 UTC 2009
[java] [INFO] Final Memory: 53M/199M
[java] [INFO] ------------------------------------------------------------------------
maven-assembly:
[echo]
[echo] The new Maven distribution was created as part of the MAVEN-COMPILE step, above.
[echo] This goal just validates the presence of that distribution.
[echo]
extract-assembly:
[echo] Extracting assembly to /home/hudson ...
[delete] Deleting directory /home/hudson/apache-maven-2.1-SNAPSHOT
[mkdir] Created dir: /home/hudson/apache-maven-2.1-SNAPSHOT
[unzip] Expanding: /zonestorage/hudson/home/hudson/hudson/jobs/Maven-2.1.x-with-bootstrap/workspace/trunk/maven-distribution/target/apache-maven-3.0-SNAPSHOT-bin.zip into /home/hudson
BUILD FAILED
/zonestorage/hudson/home/hudson/hudson/jobs/Maven-2.1.x-with-bootstrap/workspace/trunk/build.xml:224: /home/hudson/apache-maven-2.1-SNAPSHOT/bin not found.
Total time: 4 minutes 15 seconds
Hudson build is back to normal: Maven-2.1.x-with-bootstrap #263
Posted by Apache Hudson Server <hu...@hudson.zones.apache.org>.
See http://hudson.zones.apache.org/hudson/job/Maven-2.1.x-with-bootstrap/263/changes
Build failed in Hudson: Maven-2.1.x-with-bootstrap #262
Posted by Apache Hudson Server <hu...@hudson.zones.apache.org>.
See http://hudson.zones.apache.org/hudson/job/Maven-2.1.x-with-bootstrap/262/changes
Changes:
[bentmann] o Deleted empty directory
[bentmann] [MNG-3988] [regression] Profiles.xml is not processed
------------------------------------------
[...truncated 1795 lines...]
[java] [INFO] Scanning for projects...
[java] [INFO] ------------------------------------------------------------------------
[java] [INFO] Building Maven Quick Start Archetype
[java] [INFO]
[java] [INFO] Id: org.apache.maven:embedder-test-project:jar:1.0-SNAPSHOT
[java] [INFO] task-segment: [package]
[java] [INFO] ------------------------------------------------------------------------
[java] [INFO] [resources:resources]
[java] [INFO] Using default encoding to copy filtered resources.
[java] [INFO] [compiler:compile]
[java] [INFO] Compiling 1 source file to /zonestorage/hudson/home/hudson/hudson/jobs/Maven-2.1.x-with-bootstrap/workspace/trunk/maven-embedder/target/embedder-test-project1/target/classes
[java] [INFO] [resources:testResources]
[java] [INFO] Using default encoding to copy filtered resources.
[java] [INFO] [compiler:testCompile]
[java] [INFO] Compiling 1 source file to /zonestorage/hudson/home/hudson/hudson/jobs/Maven-2.1.x-with-bootstrap/workspace/trunk/maven-embedder/target/embedder-test-project1/target/test-classes
[java] [INFO] [surefire:test]
[java] [INFO] Surefire report directory: /zonestorage/hudson/home/hudson/hudson/jobs/Maven-2.1.x-with-bootstrap/workspace/trunk/maven-embedder/target/embedder-test-project1/target/surefire-reports
[java]
[java] -------------------------------------------------------
[java] T E S T S
[java] -------------------------------------------------------
[java] Running org.apache.maven.AppTest
[java] Tests run: 1, Failures: 0, Errors: 0, Skipped: 0, Time elapsed: 0.034 sec
[java]
[java] Results :
[java]
[java] Tests run: 1, Failures: 0, Errors: 0, Skipped: 0
[java]
[java] [INFO] [jar:jar]
[java] [INFO] Building jar: /zonestorage/hudson/home/hudson/hudson/jobs/Maven-2.1.x-with-bootstrap/workspace/trunk/maven-embedder/target/embedder-test-project1/target/embedder-test-project-1.0-SNAPSHOT.jar
[java] [INFO] Scanning for projects...
[java] [INFO] ------------------------------------------------------------------------
[java] [INFO] Building Maven Quick Start Archetype
[java] [INFO]
[java] [INFO] Id: org.apache.maven:embedder-test-project:jar:1.0-SNAPSHOT
[java] [INFO] task-segment: [validate]
[java] [INFO] ------------------------------------------------------------------------
[java] [INFO] Scanning for projects...
[java] [INFO] ------------------------------------------------------------------------
[java] [INFO] Building Maven Quick Start Archetype
[java] [INFO]
[java] [INFO] Id: org.apache.maven:embedder-test-project:jar:1.0-SNAPSHOT
[java] [INFO] task-segment: [validate]
[java] [INFO] ------------------------------------------------------------------------
[java] [INFO] Scanning for projects...
[java] [INFO] ------------------------------------------------------------------------
[java] [INFO] Building Maven Quick Start Archetype
[java] [INFO]
[java] [INFO] Id: org.apache.maven:embedder-test-project:jar:1.0-SNAPSHOT
[java] [INFO] task-segment: [package]
[java] [INFO] ------------------------------------------------------------------------
[java] [INFO] [resources:resources]
[java] [INFO] Using default encoding to copy filtered resources.
[java] [INFO] [compiler:compile]
[java] [INFO] Compiling 1 source file to /zonestorage/hudson/home/hudson/hudson/jobs/Maven-2.1.x-with-bootstrap/workspace/trunk/maven-embedder/target/embedder-test-project-caching/target/classes
[java] [INFO] [resources:testResources]
[java] [INFO] Using default encoding to copy filtered resources.
[java] [INFO] [compiler:testCompile]
[java] [INFO] Compiling 1 source file to /zonestorage/hudson/home/hudson/hudson/jobs/Maven-2.1.x-with-bootstrap/workspace/trunk/maven-embedder/target/embedder-test-project-caching/target/test-classes
[java] [INFO] [surefire:test]
[java] [INFO] Surefire report directory: /zonestorage/hudson/home/hudson/hudson/jobs/Maven-2.1.x-with-bootstrap/workspace/trunk/maven-embedder/target/embedder-test-project-caching/target/surefire-reports
[java]
[java] -------------------------------------------------------
[java] T E S T S
[java] -------------------------------------------------------
[java] Running org.apache.maven.AppTest
[java] Tests run: 1, Failures: 0, Errors: 0, Skipped: 0, Time elapsed: 0.056 sec
[java]
[java] Results :
[java] Tests run: 1, Failures: 0, Errors: 0, Skipped: 0
[java]
[java] [INFO] [jar:jar]
[java] [INFO] Building jar: /zonestorage/hudson/home/hudson/hudson/jobs/Maven-2.1.x-with-bootstrap/workspace/trunk/maven-embedder/target/embedder-test-project-caching/target/embedder-test-project-1.0-SNAPSHOT.jar
[java] [INFO] Scanning for projects...
[java] [INFO] ------------------------------------------------------------------------
[java] [INFO] Building Maven Quick Start Archetype
[java] [INFO]
[java] [INFO] Id: org.apache.maven:embedder-test-project:jar:1.0-SNAPSHOT
[java] [INFO] task-segment: [package]
[java] [INFO] ------------------------------------------------------------------------
[java] [INFO] [resources:resources]
[java] [INFO] Using default encoding to copy filtered resources.
[java] [INFO] [compiler:compile]
[java] [INFO] Nothing to compile - all classes are up to date
[java] [INFO] [resources:testResources]
[java] [INFO] Using default encoding to copy filtered resources.
[java] [INFO] [compiler:testCompile]
[java] [INFO] Nothing to compile - all classes are up to date
[java] [INFO] [surefire:test]
[java] [INFO] Surefire report directory: /zonestorage/hudson/home/hudson/hudson/jobs/Maven-2.1.x-with-bootstrap/workspace/trunk/maven-embedder/target/embedder-test-project-caching/target/surefire-reports
[java]
[java] -------------------------------------------------------
[java] T E S T S
[java] -------------------------------------------------------
[java] Running org.apache.maven.AppTest
[java] Tests run: 1, Failures: 0, Errors: 0, Skipped: 0, Time elapsed: 0.033 sec
[java]
[java] Results :
[java]
[java] Tests run: 1, Failures: 0, Errors: 0, Skipped: 0
[java]
[java] [INFO] [jar:jar]
[java] Tests run: 16, Failures: 0, Errors: 0, Skipped: 0, Time elapsed: 13.274 sec
[java] Running org.apache.maven.embedder.MavenEmbedderExampleTest
[java] Tests run: 2, Failures: 0, Errors: 0, Skipped: 0, Time elapsed: 0.19 sec
[java] Running org.apache.maven.cli.CLIRequestUtilsTest
[java] key=value
[java] []
[java] Tests run: 2, Failures: 0, Errors: 0, Skipped: 0, Time elapsed: 0.151 sec
[java]
[java] Results :
[java]
[java] Tests run: 56, Failures: 0, Errors: 0, Skipped: 0
[java]
[java] [INFO] [jar:jar]
[java] [INFO] Building jar: /zonestorage/hudson/home/hudson/hudson/jobs/Maven-2.1.x-with-bootstrap/workspace/trunk/maven-embedder/target/maven-embedder-3.0-SNAPSHOT.jar
[java] [INFO] [install:install]
[java] [INFO] Installing /zonestorage/hudson/home/hudson/hudson/jobs/Maven-2.1.x-with-bootstrap/workspace/trunk/maven-embedder/target/maven-embedder-3.0-SNAPSHOT.jar to /export/home/hudson/.m2/repository/org/apache/maven/maven-embedder/3.0-SNAPSHOT/maven-embedder-3.0-SNAPSHOT.jar
[java] [INFO] ------------------------------------------------------------------------
[java] [INFO] Building Maven Distribution
[java] [INFO]
[java] [INFO] Id: org.apache.maven:apache-maven:jar:3.0-SNAPSHOT
[java] [INFO] task-segment: [clean, install]
[java] [INFO] ------------------------------------------------------------------------
[java] [INFO] [clean:clean]
[java] [INFO] Deleting directory /zonestorage/hudson/home/hudson/hudson/jobs/Maven-2.1.x-with-bootstrap/workspace/trunk/apache-maven/target
[java] [INFO] [remote-resources:process]
[java] [INFO] [resources:resources]
[java] [INFO] Using 'UTF-8' encoding to copy filtered resources.
[java] [INFO] skip non existing resourceDirectory /zonestorage/hudson/home/hudson/hudson/jobs/Maven-2.1.x-with-bootstrap/workspace/trunk/apache-maven/src/main/resources
[java] [INFO] Copying 3 resources
[java] [INFO] [compiler:compile]
[java] [INFO] No sources to compile
[java] [INFO] [resources:testResources]
[java] [INFO] Using 'UTF-8' encoding to copy filtered resources.
[java] [INFO] skip non existing resourceDirectory /zonestorage/hudson/home/hudson/hudson/jobs/Maven-2.1.x-with-bootstrap/workspace/trunk/apache-maven/src/test/resources
[java] [INFO] Copying 3 resources
[java] [INFO] [compiler:testCompile]
[java] [INFO] Compiling 1 source file to /zonestorage/hudson/home/hudson/hudson/jobs/Maven-2.1.x-with-bootstrap/workspace/trunk/apache-maven/target/test-classes
[java] [INFO] [surefire:test]
[java] [INFO] Surefire report directory: /zonestorage/hudson/home/hudson/hudson/jobs/Maven-2.1.x-with-bootstrap/workspace/trunk/apache-maven/target/surefire-reports
[java]
[java] -------------------------------------------------------
[java] T E S T S
[java] -------------------------------------------------------
[java] Running org.apache.maven.settings.GlobalSettingsTest
[java] Tests run: 1, Failures: 0, Errors: 0, Skipped: 0, Time elapsed: 0.102 sec
[java]
[java] Results :
[java]
[java] Tests run: 1, Failures: 0, Errors: 0, Skipped: 0
[java]
[java] [INFO] [jar:jar]
[java] [INFO] Building jar: /zonestorage/hudson/home/hudson/hudson/jobs/Maven-2.1.x-with-bootstrap/workspace/trunk/apache-maven/target/apache-maven-3.0-SNAPSHOT.jar
[java] [INFO] [assembly:single]
[java] [INFO] Reading assembly descriptor: src/main/assembly/bin.xml
[java] [INFO] Processing DependencySet (output=boot)
[java] [INFO] Processing DependencySet (output=lib)
[java] [WARNING] The following patterns were never triggered in this artifact exclusion filter:
[java] o 'org.codehaus.plexus:plexus-component-api'
[java] o 'classworlds:classworlds'
[java] o 'jmock:jmock'
[java] o 'xml-apis:xml-apis'
[java] o 'org.apache.maven:maven-artifact'
[java] o 'org.apache.maven:maven-monitor'
[java] o 'org.apache.maven:maven-plugin-descriptor'
[java] o 'jdom:jdom'
[java]
[java] [INFO] No files selected for line-ending conversion. Skipping: src/bin
[java] [INFO] No files selected for line-ending conversion. Skipping: src/bin
[java] [INFO] Building tar : /zonestorage/hudson/home/hudson/hudson/jobs/Maven-2.1.x-with-bootstrap/workspace/trunk/apache-maven/target/apache-maven-3.0-SNAPSHOT-bin.tar.gz
[java] [INFO] Processing DependencySet (output=boot)
[java] [INFO] Processing DependencySet (output=lib)
[java] [WARNING] The following patterns were never triggered in this artifact exclusion filter:
[java] o 'org.codehaus.plexus:plexus-component-api'
[java] o 'classworlds:classworlds'
[java] o 'jmock:jmock'
[java] o 'xml-apis:xml-apis'
[java] o 'org.apache.maven:maven-artifact'
[java] o 'org.apache.maven:maven-monitor'
[java] o 'org.apache.maven:maven-plugin-descriptor'
[java] o 'jdom:jdom'
[java]
[java] [INFO] No files selected for line-ending conversion. Skipping: src/bin
[java] [INFO] No files selected for line-ending conversion. Skipping: src/bin
[java] [INFO] Building tar : /zonestorage/hudson/home/hudson/hudson/jobs/Maven-2.1.x-with-bootstrap/workspace/trunk/apache-maven/target/apache-maven-3.0-SNAPSHOT-bin.tar.bz2
[java] [INFO] Processing DependencySet (output=boot)
[java] [INFO] Processing DependencySet (output=lib)
[java] [WARNING] The following patterns were never triggered in this artifact exclusion filter:
[java] o 'org.codehaus.plexus:plexus-component-api'
[java] o 'classworlds:classworlds'
[java] o 'jmock:jmock'
[java] o 'xml-apis:xml-apis'
[java] o 'org.apache.maven:maven-artifact'
[java] o 'org.apache.maven:maven-monitor'
[java] o 'org.apache.maven:maven-plugin-descriptor'
[java] o 'jdom:jdom'
[java]
[java] [INFO] No files selected for line-ending conversion. Skipping: src/bin
[java] [INFO] No files selected for line-ending conversion. Skipping: src/bin
[java] [INFO] Building zip: /zonestorage/hudson/home/hudson/hudson/jobs/Maven-2.1.x-with-bootstrap/workspace/trunk/apache-maven/target/apache-maven-3.0-SNAPSHOT-bin.zip
[java] [INFO] [install:install]
[java] [INFO] Installing /zonestorage/hudson/home/hudson/hudson/jobs/Maven-2.1.x-with-bootstrap/workspace/trunk/apache-maven/target/apache-maven-3.0-SNAPSHOT.jar to /export/home/hudson/.m2/repository/org/apache/maven/apache-maven/3.0-SNAPSHOT/apache-maven-3.0-SNAPSHOT.jar
[java] [INFO] Installing /zonestorage/hudson/home/hudson/hudson/jobs/Maven-2.1.x-with-bootstrap/workspace/trunk/apache-maven/target/apache-maven-3.0-SNAPSHOT-bin.tar.gz to /export/home/hudson/.m2/repository/org/apache/maven/apache-maven/3.0-SNAPSHOT/apache-maven-3.0-SNAPSHOT-bin.tar.gz
[java] [INFO] Installing /zonestorage/hudson/home/hudson/hudson/jobs/Maven-2.1.x-with-bootstrap/workspace/trunk/apache-maven/target/apache-maven-3.0-SNAPSHOT-bin.tar.bz2 to /export/home/hudson/.m2/repository/org/apache/maven/apache-maven/3.0-SNAPSHOT/apache-maven-3.0-SNAPSHOT-bin.tar.bz2
[java] [INFO] Installing /zonestorage/hudson/home/hudson/hudson/jobs/Maven-2.1.x-with-bootstrap/workspace/trunk/apache-maven/target/apache-maven-3.0-SNAPSHOT-bin.zip to /export/home/hudson/.m2/repository/org/apache/maven/apache-maven/3.0-SNAPSHOT/apache-maven-3.0-SNAPSHOT-bin.zip
[java] [INFO]
[java] [INFO]
[java] [INFO] ------------------------------------------------------------------------
[java] [INFO] Reactor Summary:
[java] [INFO] ------------------------------------------------------------------------
[java] [INFO] Apache Maven .......................................... SUCCESS [6.144s]
[java] [INFO] Maven Lifecycle Model ................................. SUCCESS [9.378s]
[java] [INFO] Maven Reporting API ................................... SUCCESS [2.053s]
[java] [INFO] Maven Model ........................................... SUCCESS [6.031s]
[java] [INFO] Maven Compat .......................................... SUCCESS [27.058s]
[java] [INFO] Maven Plugin API ...................................... SUCCESS [6.119s]
[java] [INFO] Maven Project Builder ................................. SUCCESS [6.206s]
[java] [INFO] Maven Project Builder ................................. SUCCESS [30.192s]
[java] [INFO] Maven Mercury ......................................... SUCCESS [13.890s]
[java] [INFO] Maven Core ............................................ SUCCESS [31.456s]
[java] [INFO] Maven Toolchains ...................................... SUCCESS [7.241s]
[java] [INFO] Maven Embedder ........................................ SUCCESS [54.057s]
[java] [INFO] Maven Distribution .................................... SUCCESS [44.926s]
[java] [INFO] ------------------------------------------------------------------------
[java] [INFO] ------------------------------------------------------------------------
[java] [INFO] BUILD SUCCESSFUL
[java] [INFO] ------------------------------------------------------------------------
[java] [INFO] Total time: 4 minutes 23 seconds
[java] [INFO] Finished at: Tue Jan 13 16:59:51 UTC 2009
[java] [INFO] Final Memory: 53M/199M
[java] [INFO] ------------------------------------------------------------------------
maven-assembly:
[echo]
[echo] The new Maven distribution was created as part of the MAVEN-COMPILE step, above.
[echo] This goal just validates the presence of that distribution.
[echo]
extract-assembly:
[echo] Extracting assembly to /home/hudson ...
[delete] Deleting directory /home/hudson/apache-maven-2.1-SNAPSHOT
[mkdir] Created dir: /home/hudson/apache-maven-2.1-SNAPSHOT
[unzip] Expanding: /zonestorage/hudson/home/hudson/hudson/jobs/Maven-2.1.x-with-bootstrap/workspace/trunk/apache-maven/target/apache-maven-3.0-SNAPSHOT-bin.zip into /home/hudson
BUILD FAILED
/zonestorage/hudson/home/hudson/hudson/jobs/Maven-2.1.x-with-bootstrap/workspace/trunk/build.xml:224: /home/hudson/apache-maven-2.1-SNAPSHOT/bin not found.
Total time: 5 minutes 25 seconds
Build failed in Hudson: Maven-2.1.x-with-bootstrap #261
Posted by Apache Hudson Server <hu...@hudson.zones.apache.org>.
See http://hudson.zones.apache.org/hudson/job/Maven-2.1.x-with-bootstrap/261/changes
Changes:
[jvanzyl] o fix location of assembly, needs to be centralized
[jvanzyl] o change module name
[jvanzyl] o change the artifact id to match
[jvanzyl] o everyone is having problems with this not name as the artifact we ship with and we can't change it from apache-maven now so back it goes.
[sisbell] Final fix for the problem where snapshot plugin repositories from external profiles were not being used. Added code for setting remote repos to MavenProject, after profile injection.
[sisbell] Profile Injector was missing injecting of plugin repositories from settings file. Fixes this.
[sisbell] Fix: Different types of ID Model containers were being joined if their ids matched. Now we have one ID model container factory instance per type.
[sisbell] Added #collection to repositories/pluginRepositories URI's to allow more than one in the pom.
[jvanzyl] o mercury settings were not right
[jvanzyl] o adding the mercury ant tasks
[jvanzyl] o start flipping over the bootstrap to mercury
[jvanzyl] MNG-3960: update plexus which allow the operation of the plexus-maven-plugin
[bentmann] o Created UT for MNG-3979
[bentmann] o Removed empty directories
[sisbell] Fix: MNG-3978
[brianf] MNG-3974 - stop on first mirror pattern match (fix to handle repeated entires)
[brianf] MNG-3974 - stop on first mirror pattern match
[jvanzyl] o as we collect rules embedded we'll capture the here fast before we forget, we can put them in the spec prop later
[sisbell] Fix: MNG-3943
[sisbell] Updated spec with profile info.
[ogusakov] [MNG-3973] masked NPE when parent metadata cannot be found
[jvanzyl] MNG-3961: reverted the addition and we'll deal with this later properly
[jvanzyl] MNG-3586: system scope is working again, the IT does not appear to work on OS/X. Both 2.0.9 and this snapshot fail the first test of the IT. Brian helped me verify and on Windows with 2.0.9 and this snapshot both tests pass.
------------------------------------------
[...truncated 1892 lines...]
[java] [INFO]
[java] [INFO] Id: org.apache.maven:embedder-test-project:jar:1.0-SNAPSHOT
[java] [INFO] task-segment: [package]
[java] [INFO] ------------------------------------------------------------------------
[java] [INFO] [resources:resources]
[java] [INFO] Using default encoding to copy filtered resources.
[java] [INFO] [compiler:compile]
[java] [INFO] Compiling 1 source file to /zonestorage/hudson/home/hudson/hudson/jobs/Maven-2.1.x-with-bootstrap/workspace/trunk/maven-embedder/target/embedder-test-project1/target/classes
[java] [INFO] [resources:testResources]
[java] [INFO] Using default encoding to copy filtered resources.
[java] [INFO] [compiler:testCompile]
[java] [INFO] Compiling 1 source file to /zonestorage/hudson/home/hudson/hudson/jobs/Maven-2.1.x-with-bootstrap/workspace/trunk/maven-embedder/target/embedder-test-project1/target/test-classes
[java] [INFO] [surefire:test]
[java] [INFO] Surefire report directory: /zonestorage/hudson/home/hudson/hudson/jobs/Maven-2.1.x-with-bootstrap/workspace/trunk/maven-embedder/target/embedder-test-project1/target/surefire-reports
[java]
[java] -------------------------------------------------------
[java] T E S T S
[java] -------------------------------------------------------
[java] Running org.apache.maven.AppTest
[java] Tests run: 1, Failures: 0, Errors: 0, Skipped: 0, Time elapsed: 0.033 sec
[java]
[java] Results :
[java]
[java] Tests run: 1, Failures: 0, Errors: 0, Skipped: 0
[java]
[java] [INFO] [jar:jar]
[java] [INFO] Building jar: /zonestorage/hudson/home/hudson/hudson/jobs/Maven-2.1.x-with-bootstrap/workspace/trunk/maven-embedder/target/embedder-test-project1/target/embedder-test-project-1.0-SNAPSHOT.jar
[java] [INFO] Scanning for projects...
[java] [INFO] ------------------------------------------------------------------------
[java] [INFO] Building Maven Quick Start Archetype
[java] [INFO]
[java] [INFO] Id: org.apache.maven:embedder-test-project:jar:1.0-SNAPSHOT
[java] [INFO] task-segment: [validate]
[java] [INFO] ------------------------------------------------------------------------
[java] [INFO] Scanning for projects...
[java] [INFO] ------------------------------------------------------------------------
[java] [INFO] Building Maven Quick Start Archetype
[java] [INFO]
[java] [INFO] Id: org.apache.maven:embedder-test-project:jar:1.0-SNAPSHOT
[java] [INFO] task-segment: [validate]
[java] [INFO] ------------------------------------------------------------------------
[java] [INFO] Scanning for projects...
[java] [INFO] ------------------------------------------------------------------------
[java] [INFO] Building Maven Quick Start Archetype
[java] [INFO]
[java] [INFO] Id: org.apache.maven:embedder-test-project:jar:1.0-SNAPSHOT
[java] [INFO] task-segment: [package]
[java] [INFO] ------------------------------------------------------------------------
[java] [INFO] [resources:resources]
[java] [INFO] Using default encoding to copy filtered resources.
[java] [INFO] [compiler:compile]
[java] [INFO] Compiling 1 source file to /zonestorage/hudson/home/hudson/hudson/jobs/Maven-2.1.x-with-bootstrap/workspace/trunk/maven-embedder/target/embedder-test-project-caching/target/classes
[java] [INFO] [resources:testResources]
[java] [INFO] Using default encoding to copy filtered resources.
[java] [INFO] [compiler:testCompile]
[java] [INFO] Compiling 1 source file to /zonestorage/hudson/home/hudson/hudson/jobs/Maven-2.1.x-with-bootstrap/workspace/trunk/maven-embedder/target/embedder-test-project-caching/target/test-classes
[java] [INFO] [surefire:test]
[java] [INFO] Surefire report directory: /zonestorage/hudson/home/hudson/hudson/jobs/Maven-2.1.x-with-bootstrap/workspace/trunk/maven-embedder/target/embedder-test-project-caching/target/surefire-reports
[java]
[java] -------------------------------------------------------
[java] T E S T S
[java] -------------------------------------------------------
[java] Running org.apache.maven.AppTest
[java] Tests run: 1, Failures: 0, Errors: 0, Skipped: 0, Time elapsed: 0.053 sec
[java]
[java] Results :
[java] Tests run: 1, Failures: 0, Errors: 0, Skipped: 0
[java]
[java] [INFO] [jar:jar]
[java] [INFO] Building jar: /zonestorage/hudson/home/hudson/hudson/jobs/Maven-2.1.x-with-bootstrap/workspace/trunk/maven-embedder/target/embedder-test-project-caching/target/embedder-test-project-1.0-SNAPSHOT.jar
[java] [INFO] Scanning for projects...
[java] [INFO] ------------------------------------------------------------------------
[java] [INFO] Building Maven Quick Start Archetype
[java] [INFO]
[java] [INFO] Id: org.apache.maven:embedder-test-project:jar:1.0-SNAPSHOT
[java] [INFO] task-segment: [package]
[java] [INFO] ------------------------------------------------------------------------
[java] [INFO] [resources:resources]
[java] [INFO] Using default encoding to copy filtered resources.
[java] [INFO] [compiler:compile]
[java] [INFO] Nothing to compile - all classes are up to date
[java] [INFO] [resources:testResources]
[java] [INFO] Using default encoding to copy filtered resources.
[java] [INFO] [compiler:testCompile]
[java] [INFO] Nothing to compile - all classes are up to date
[java] [INFO] [surefire:test]
[java] [INFO] Surefire report directory: /zonestorage/hudson/home/hudson/hudson/jobs/Maven-2.1.x-with-bootstrap/workspace/trunk/maven-embedder/target/embedder-test-project-caching/target/surefire-reports
[java]
[java] -------------------------------------------------------
[java] T E S T S
[java] -------------------------------------------------------
[java] Running org.apache.maven.AppTest
[java] Tests run: 1, Failures: 0, Errors: 0, Skipped: 0, Time elapsed: 0.03 sec
[java]
[java] Results :
[java]
[java] Tests run: 1, Failures: 0, Errors: 0, Skipped: 0
[java]
[java] [INFO] [jar:jar]
[java] Tests run: 16, Failures: 0, Errors: 0, Skipped: 0, Time elapsed: 12.8 sec
[java] Running org.apache.maven.embedder.MavenEmbedderExampleTest
[java] Tests run: 2, Failures: 0, Errors: 0, Skipped: 0, Time elapsed: 0.248 sec
[java] Running org.apache.maven.cli.CLIRequestUtilsTest
[java] key=value
[java] []
[java] Tests run: 2, Failures: 0, Errors: 0, Skipped: 0, Time elapsed: 0.192 sec
[java]
[java] Results :
[java]
[java] Tests run: 56, Failures: 0, Errors: 0, Skipped: 0
[java]
[java] [INFO] [jar:jar]
[java] [INFO] Building jar: /zonestorage/hudson/home/hudson/hudson/jobs/Maven-2.1.x-with-bootstrap/workspace/trunk/maven-embedder/target/maven-embedder-3.0-SNAPSHOT.jar
[java] [INFO] [install:install]
[java] [INFO] Installing /zonestorage/hudson/home/hudson/hudson/jobs/Maven-2.1.x-with-bootstrap/workspace/trunk/maven-embedder/target/maven-embedder-3.0-SNAPSHOT.jar to /export/home/hudson/.m2/repository/org/apache/maven/maven-embedder/3.0-SNAPSHOT/maven-embedder-3.0-SNAPSHOT.jar
[java] [INFO] ------------------------------------------------------------------------
[java] [INFO] Building Maven Distribution
[java] [INFO]
[java] [INFO] Id: org.apache.maven:apache-maven:jar:3.0-SNAPSHOT
[java] [INFO] task-segment: [clean, install]
[java] [INFO] ------------------------------------------------------------------------
[java] [INFO] [clean:clean]
[java] [INFO] snapshot org.apache.maven:maven-embedder:3.0-SNAPSHOT: checking for updates from apache.snapshots
[java] [INFO] [remote-resources:process]
[java] [INFO] [resources:resources]
[java] [INFO] Using 'UTF-8' encoding to copy filtered resources.
[java] [INFO] skip non existing resourceDirectory /zonestorage/hudson/home/hudson/hudson/jobs/Maven-2.1.x-with-bootstrap/workspace/trunk/apache-maven/src/main/resources
[java] [INFO] Copying 3 resources
[java] [INFO] [compiler:compile]
[java] [INFO] No sources to compile
[java] [INFO] [resources:testResources]
[java] [INFO] Using 'UTF-8' encoding to copy filtered resources.
[java] [INFO] skip non existing resourceDirectory /zonestorage/hudson/home/hudson/hudson/jobs/Maven-2.1.x-with-bootstrap/workspace/trunk/apache-maven/src/test/resources
[java] [INFO] Copying 3 resources
[java] [INFO] [compiler:testCompile]
[java] [INFO] Compiling 1 source file to /zonestorage/hudson/home/hudson/hudson/jobs/Maven-2.1.x-with-bootstrap/workspace/trunk/apache-maven/target/test-classes
[java] [INFO] [surefire:test]
[java] [INFO] Surefire report directory: /zonestorage/hudson/home/hudson/hudson/jobs/Maven-2.1.x-with-bootstrap/workspace/trunk/apache-maven/target/surefire-reports
[java]
[java] -------------------------------------------------------
[java] T E S T S
[java] -------------------------------------------------------
[java] Running org.apache.maven.settings.GlobalSettingsTest
[java] Tests run: 1, Failures: 0, Errors: 0, Skipped: 0, Time elapsed: 0.086 sec
[java]
[java] Results :
[java]
[java] Tests run: 1, Failures: 0, Errors: 0, Skipped: 0
[java]
[java] [INFO] [jar:jar]
[java] [INFO] Building jar: /zonestorage/hudson/home/hudson/hudson/jobs/Maven-2.1.x-with-bootstrap/workspace/trunk/apache-maven/target/apache-maven-3.0-SNAPSHOT.jar
[java] [INFO] [assembly:single]
[java] [INFO] Reading assembly descriptor: src/main/assembly/bin.xml
[java] [INFO] Processing DependencySet (output=boot)
[java] [INFO] Processing DependencySet (output=lib)
[java] [WARNING] The following patterns were never triggered in this artifact exclusion filter:
[java] o 'org.codehaus.plexus:plexus-component-api'
[java] o 'classworlds:classworlds'
[java] o 'jmock:jmock'
[java] o 'xml-apis:xml-apis'
[java] o 'org.apache.maven:maven-artifact'
[java] o 'org.apache.maven:maven-monitor'
[java] o 'org.apache.maven:maven-plugin-descriptor'
[java] o 'jdom:jdom'
[java]
[java] [INFO] snapshot org.apache.maven:apache-maven:3.0-SNAPSHOT: checking for updates from apache.snapshots
[java] url = http://people.apache.org/repo/m2-snapshot-repository
[java] Downloading: http://people.apache.org/repo/m2-snapshot-repository/org/apache/maven/apache-maven/3.0-SNAPSHOT/apache-maven-3.0-SNAPSHOT.pom
[java] [INFO] No files selected for line-ending conversion. Skipping: src/bin
[java] [INFO] No files selected for line-ending conversion. Skipping: src/bin
[java] [INFO] Building tar : /zonestorage/hudson/home/hudson/hudson/jobs/Maven-2.1.x-with-bootstrap/workspace/trunk/apache-maven/target/apache-maven-3.0-SNAPSHOT-bin.tar.gz
[java] [INFO] Processing DependencySet (output=boot)
[java] [INFO] Processing DependencySet (output=lib)
[java] [WARNING] The following patterns were never triggered in this artifact exclusion filter:
[java] o 'org.codehaus.plexus:plexus-component-api'
[java] o 'classworlds:classworlds'
[java] o 'jmock:jmock'
[java] o 'xml-apis:xml-apis'
[java] o 'org.apache.maven:maven-artifact'
[java] o 'org.apache.maven:maven-monitor'
[java] o 'org.apache.maven:maven-plugin-descriptor'
[java] o 'jdom:jdom'
[java]
[java] [INFO] No files selected for line-ending conversion. Skipping: src/bin
[java] [INFO] No files selected for line-ending conversion. Skipping: src/bin
[java] [INFO] Building tar : /zonestorage/hudson/home/hudson/hudson/jobs/Maven-2.1.x-with-bootstrap/workspace/trunk/apache-maven/target/apache-maven-3.0-SNAPSHOT-bin.tar.bz2
[java] [INFO] Processing DependencySet (output=boot)
[java] [INFO] Processing DependencySet (output=lib)
[java] [WARNING] The following patterns were never triggered in this artifact exclusion filter:
[java] o 'org.codehaus.plexus:plexus-component-api'
[java] o 'classworlds:classworlds'
[java] o 'jmock:jmock'
[java] o 'xml-apis:xml-apis'
[java] o 'org.apache.maven:maven-artifact'
[java] o 'org.apache.maven:maven-monitor'
[java] o 'org.apache.maven:maven-plugin-descriptor'
[java] o 'jdom:jdom'
[java]
[java] [INFO] No files selected for line-ending conversion. Skipping: src/bin
[java] [INFO] No files selected for line-ending conversion. Skipping: src/bin
[java] [INFO] Building zip: /zonestorage/hudson/home/hudson/hudson/jobs/Maven-2.1.x-with-bootstrap/workspace/trunk/apache-maven/target/apache-maven-3.0-SNAPSHOT-bin.zip
[java] [INFO] [install:install]
[java] [INFO] Installing /zonestorage/hudson/home/hudson/hudson/jobs/Maven-2.1.x-with-bootstrap/workspace/trunk/apache-maven/target/apache-maven-3.0-SNAPSHOT.jar to /export/home/hudson/.m2/repository/org/apache/maven/apache-maven/3.0-SNAPSHOT/apache-maven-3.0-SNAPSHOT.jar
[java] [INFO] Installing /zonestorage/hudson/home/hudson/hudson/jobs/Maven-2.1.x-with-bootstrap/workspace/trunk/apache-maven/target/apache-maven-3.0-SNAPSHOT-bin.tar.gz to /export/home/hudson/.m2/repository/org/apache/maven/apache-maven/3.0-SNAPSHOT/apache-maven-3.0-SNAPSHOT-bin.tar.gz
[java] [INFO] Installing /zonestorage/hudson/home/hudson/hudson/jobs/Maven-2.1.x-with-bootstrap/workspace/trunk/apache-maven/target/apache-maven-3.0-SNAPSHOT-bin.tar.bz2 to /export/home/hudson/.m2/repository/org/apache/maven/apache-maven/3.0-SNAPSHOT/apache-maven-3.0-SNAPSHOT-bin.tar.bz2
[java] [INFO] Installing /zonestorage/hudson/home/hudson/hudson/jobs/Maven-2.1.x-with-bootstrap/workspace/trunk/apache-maven/target/apache-maven-3.0-SNAPSHOT-bin.zip to /export/home/hudson/.m2/repository/org/apache/maven/apache-maven/3.0-SNAPSHOT/apache-maven-3.0-SNAPSHOT-bin.zip
[java] [INFO]
[java] [INFO]
[java] [INFO] ------------------------------------------------------------------------
[java] [INFO] Reactor Summary:
[java] [INFO] ------------------------------------------------------------------------
[java] [INFO] Apache Maven .......................................... SUCCESS [3.890s]
[java] [INFO] Maven Lifecycle Model ................................. SUCCESS [7.400s]
[java] [INFO] Maven Reporting API ................................... SUCCESS [1.949s]
[java] [INFO] Maven Model ........................................... SUCCESS [9.367s]
[java] [INFO] Maven Compat .......................................... SUCCESS [26.179s]
[java] [INFO] Maven Plugin API ...................................... SUCCESS [3.965s]
[java] [INFO] Maven Project Builder ................................. SUCCESS [5.257s]
[java] [INFO] Maven Project Builder ................................. SUCCESS [25.305s]
[java] [INFO] Maven Mercury ......................................... SUCCESS [11.038s]
[java] [INFO] Maven Core ............................................ SUCCESS [29.988s]
[java] [INFO] Maven Toolchains ...................................... SUCCESS [4.918s]
[java] [INFO] Maven Embedder ........................................ SUCCESS [52.459s]
[java] [INFO] Maven Distribution .................................... SUCCESS [54.082s]
[java] [INFO] ------------------------------------------------------------------------
[java] [INFO] ------------------------------------------------------------------------
[java] [INFO] BUILD SUCCESSFUL
[java] [INFO] ------------------------------------------------------------------------
[java] [INFO] Total time: 4 minutes 10 seconds
[java] [INFO] Finished at: Tue Jan 13 10:45:54 UTC 2009
[java] [INFO] Final Memory: 53M/199M
[java] [INFO] ------------------------------------------------------------------------
maven-assembly:
[echo]
[echo] The new Maven distribution was created as part of the MAVEN-COMPILE step, above.
[echo] This goal just validates the presence of that distribution.
[echo]
extract-assembly:
[echo] Extracting assembly to /home/hudson ...
[delete] Deleting directory /home/hudson/apache-maven-2.1-SNAPSHOT
[mkdir] Created dir: /home/hudson/apache-maven-2.1-SNAPSHOT
[unzip] Expanding: /zonestorage/hudson/home/hudson/hudson/jobs/Maven-2.1.x-with-bootstrap/workspace/trunk/apache-maven/target/apache-maven-3.0-SNAPSHOT-bin.zip into /home/hudson
BUILD FAILED
/zonestorage/hudson/home/hudson/hudson/jobs/Maven-2.1.x-with-bootstrap/workspace/trunk/build.xml:224: /home/hudson/apache-maven-2.1-SNAPSHOT/bin not found.
Total time: 5 minutes 0 seconds
Build failed in Hudson: Maven-2.1.x-with-bootstrap #260
Posted by Apache Hudson Server <hu...@hudson.zones.apache.org>.
See http://hudson.zones.apache.org/hudson/job/Maven-2.1.x-with-bootstrap/260/changes
Changes:
[sisbell] Fix: 3944 - we can just use the existence of the project directory to determine whether it is in the build. This will be a contract of the setProjectDirectory method
------------------------------------------
[...truncated 1368 lines...]
[java] [INFO] Scanning for projects...
[java] [INFO] ------------------------------------------------------------------------
[java] [INFO] Building Maven Quick Start Archetype
[java] [INFO]
[java] [INFO] Id: org.apache.maven:embedder-test-project:jar:1.0-SNAPSHOT
[java] [INFO] task-segment: [package]
[java] [INFO] ------------------------------------------------------------------------
[java] [INFO] [resources:resources]
[java] [INFO] Using default encoding to copy filtered resources.
[java] [INFO] [compiler:compile]
[java] [INFO] Compiling 1 source file to /zonestorage/hudson/home/hudson/hudson/jobs/Maven-2.1.x-with-bootstrap/workspace/trunk/maven-embedder/target/embedder-test-project1/target/classes
[java] [INFO] [resources:testResources]
[java] [INFO] Using default encoding to copy filtered resources.
[java] [INFO] [compiler:testCompile]
[java] [INFO] Compiling 1 source file to /zonestorage/hudson/home/hudson/hudson/jobs/Maven-2.1.x-with-bootstrap/workspace/trunk/maven-embedder/target/embedder-test-project1/target/test-classes
[java] [INFO] [surefire:test]
[java] [INFO] Surefire report directory: /zonestorage/hudson/home/hudson/hudson/jobs/Maven-2.1.x-with-bootstrap/workspace/trunk/maven-embedder/target/embedder-test-project1/target/surefire-reports
[java]
[java] -------------------------------------------------------
[java] T E S T S
[java] -------------------------------------------------------
[java] Running org.apache.maven.AppTest
[java] Tests run: 1, Failures: 0, Errors: 0, Skipped: 0, Time elapsed: 0.032 sec
[java]
[java] Results :
[java]
[java] Tests run: 1, Failures: 0, Errors: 0, Skipped: 0
[java]
[java] [INFO] [jar:jar]
[java] [INFO] Building jar: /zonestorage/hudson/home/hudson/hudson/jobs/Maven-2.1.x-with-bootstrap/workspace/trunk/maven-embedder/target/embedder-test-project1/target/embedder-test-project-1.0-SNAPSHOT.jar
[java] [INFO] Scanning for projects...
[java] [INFO] ------------------------------------------------------------------------
[java] [INFO] Building Maven Quick Start Archetype
[java] [INFO]
[java] [INFO] Id: org.apache.maven:embedder-test-project:jar:1.0-SNAPSHOT
[java] [INFO] task-segment: [validate]
[java] [INFO] ------------------------------------------------------------------------
[java] [INFO] Scanning for projects...
[java] [INFO] ------------------------------------------------------------------------
[java] [INFO] Building Maven Quick Start Archetype
[java] [INFO]
[java] [INFO] Id: org.apache.maven:embedder-test-project:jar:1.0-SNAPSHOT
[java] [INFO] task-segment: [validate]
[java] [INFO] ------------------------------------------------------------------------
[java] [INFO] Scanning for projects...
[java] [INFO] ------------------------------------------------------------------------
[java] [INFO] Building Maven Quick Start Archetype
[java] [INFO]
[java] [INFO] Id: org.apache.maven:embedder-test-project:jar:1.0-SNAPSHOT
[java] [INFO] task-segment: [package]
[java] [INFO] ------------------------------------------------------------------------
[java] [INFO] [resources:resources]
[java] [INFO] Using default encoding to copy filtered resources.
[java] [INFO] [compiler:compile]
[java] [INFO] Compiling 1 source file to /zonestorage/hudson/home/hudson/hudson/jobs/Maven-2.1.x-with-bootstrap/workspace/trunk/maven-embedder/target/embedder-test-project-caching/target/classes
[java] [INFO] [resources:testResources]
[java] [INFO] Using default encoding to copy filtered resources.
[java] [INFO] [compiler:testCompile]
[java] [INFO] Compiling 1 source file to /zonestorage/hudson/home/hudson/hudson/jobs/Maven-2.1.x-with-bootstrap/workspace/trunk/maven-embedder/target/embedder-test-project-caching/target/test-classes
[java] [INFO] [surefire:test]
[java] [INFO] Surefire report directory: /zonestorage/hudson/home/hudson/hudson/jobs/Maven-2.1.x-with-bootstrap/workspace/trunk/maven-embedder/target/embedder-test-project-caching/target/surefire-reports
[java]
[java] -------------------------------------------------------
[java] T E S T S
[java] -------------------------------------------------------
[java] Running org.apache.maven.AppTest
[java] Tests run: 1, Failures: 0, Errors: 0, Skipped: 0, Time elapsed: 0.029 sec
[java]
[java] Results :
[java] Tests run: 1, Failures: 0, Errors: 0, Skipped: 0
[java]
[java] [INFO] [jar:jar]
[java] [INFO] Building jar: /zonestorage/hudson/home/hudson/hudson/jobs/Maven-2.1.x-with-bootstrap/workspace/trunk/maven-embedder/target/embedder-test-project-caching/target/embedder-test-project-1.0-SNAPSHOT.jar
[java] [INFO] Scanning for projects...
[java] [INFO] ------------------------------------------------------------------------
[java] [INFO] Building Maven Quick Start Archetype
[java] [INFO]
[java] [INFO] Id: org.apache.maven:embedder-test-project:jar:1.0-SNAPSHOT
[java] [INFO] task-segment: [package]
[java] [INFO] ------------------------------------------------------------------------
[java] [INFO] [resources:resources]
[java] [INFO] Using default encoding to copy filtered resources.
[java] [INFO] [compiler:compile]
[java] [INFO] Nothing to compile - all classes are up to date
[java] [INFO] [resources:testResources]
[java] [INFO] Using default encoding to copy filtered resources.
[java] [INFO] [compiler:testCompile]
[java] [INFO] Nothing to compile - all classes are up to date
[java] [INFO] [surefire:test]
[java] [INFO] Surefire report directory: /zonestorage/hudson/home/hudson/hudson/jobs/Maven-2.1.x-with-bootstrap/workspace/trunk/maven-embedder/target/embedder-test-project-caching/target/surefire-reports
[java]
[java] -------------------------------------------------------
[java] T E S T S
[java] -------------------------------------------------------
[java] Running org.apache.maven.AppTest
[java] Tests run: 1, Failures: 0, Errors: 0, Skipped: 0, Time elapsed: 0.029 sec
[java]
[java] Results :
[java]
[java] Tests run: 1, Failures: 0, Errors: 0, Skipped: 0
[java]
[java] [INFO] [jar:jar]
[java] Tests run: 16, Failures: 0, Errors: 0, Skipped: 0, Time elapsed: 10.973 sec
[java] Running org.apache.maven.cli.CLIRequestUtilsTest
[java] key=value
[java] []
[java] Tests run: 2, Failures: 0, Errors: 0, Skipped: 0, Time elapsed: 0.124 sec
[java]
[java] Results :
[java]
[java] Tests run: 56, Failures: 0, Errors: 0, Skipped: 0
[java]
[java] [INFO] [jar:jar]
[java] [INFO] Building jar: /zonestorage/hudson/home/hudson/hudson/jobs/Maven-2.1.x-with-bootstrap/workspace/trunk/maven-embedder/target/maven-embedder-3.0-SNAPSHOT.jar
[java] [INFO] [install:install]
[java] [INFO] Installing /zonestorage/hudson/home/hudson/hudson/jobs/Maven-2.1.x-with-bootstrap/workspace/trunk/maven-embedder/target/maven-embedder-3.0-SNAPSHOT.jar to /export/home/hudson/.m2/repository/org/apache/maven/maven-embedder/3.0-SNAPSHOT/maven-embedder-3.0-SNAPSHOT.jar
[java] [INFO] ------------------------------------------------------------------------
[java] [INFO] Building Maven Distribution
[java] [INFO]
[java] [INFO] Id: org.apache.maven:maven-distribution:jar:3.0-SNAPSHOT
[java] [INFO] task-segment: [clean, install]
[java] [INFO] ------------------------------------------------------------------------
[java] [INFO] [clean:clean]
[java] [INFO] Deleting directory /zonestorage/hudson/home/hudson/hudson/jobs/Maven-2.1.x-with-bootstrap/workspace/trunk/maven-distribution/target
[java] [INFO] snapshot org.apache.maven:maven-embedder:3.0-SNAPSHOT: checking for updates from apache.snapshots
[java] [INFO] [remote-resources:process]
[java] [INFO] [resources:resources]
[java] [INFO] Using 'UTF-8' encoding to copy filtered resources.
[java] [INFO] skip non existing resourceDirectory /zonestorage/hudson/home/hudson/hudson/jobs/Maven-2.1.x-with-bootstrap/workspace/trunk/maven-distribution/src/main/resources
[java] [INFO] Copying 3 resources
[java] [INFO] [compiler:compile]
[java] [INFO] No sources to compile
[java] [INFO] [resources:testResources]
[java] [INFO] Using 'UTF-8' encoding to copy filtered resources.
[java] [INFO] skip non existing resourceDirectory /zonestorage/hudson/home/hudson/hudson/jobs/Maven-2.1.x-with-bootstrap/workspace/trunk/maven-distribution/src/test/resources
[java] [INFO] Copying 3 resources
[java] [INFO] [compiler:testCompile]
[java] [INFO] Compiling 1 source file to /zonestorage/hudson/home/hudson/hudson/jobs/Maven-2.1.x-with-bootstrap/workspace/trunk/maven-distribution/target/test-classes
[java] [INFO] [surefire:test]
[java] [INFO] Surefire report directory: /zonestorage/hudson/home/hudson/hudson/jobs/Maven-2.1.x-with-bootstrap/workspace/trunk/maven-distribution/target/surefire-reports
[java]
[java] -------------------------------------------------------
[java] T E S T S
[java] -------------------------------------------------------
[java] Running org.apache.maven.settings.GlobalSettingsTest
[java] Tests run: 1, Failures: 0, Errors: 0, Skipped: 0, Time elapsed: 0.114 sec
[java]
[java] Results :
[java]
[java] Tests run: 1, Failures: 0, Errors: 0, Skipped: 0
[java]
[java] [INFO] [jar:jar]
[java] [INFO] Building jar: /zonestorage/hudson/home/hudson/hudson/jobs/Maven-2.1.x-with-bootstrap/workspace/trunk/maven-distribution/target/maven-distribution-3.0-SNAPSHOT.jar
[java] [INFO] [assembly:single]
[java] [INFO] Reading assembly descriptor: src/main/assembly/bin.xml
[java] [INFO] Processing DependencySet (output=boot)
[java] [INFO] Processing DependencySet (output=lib)
[java] [WARNING] The following patterns were never triggered in this artifact exclusion filter:
[java] o 'org.codehaus.plexus:plexus-component-api'
[java] o 'classworlds:classworlds'
[java] o 'jmock:jmock'
[java] o 'xml-apis:xml-apis'
[java] o 'org.apache.maven:maven-artifact'
[java] o 'org.apache.maven:maven-monitor'
[java] o 'org.apache.maven:maven-plugin-descriptor'
[java] o 'jdom:jdom'
[java]
[java] [INFO] snapshot org.apache.maven:maven-distribution:3.0-SNAPSHOT: checking for updates from apache.snapshots
[java] [INFO] No files selected for line-ending conversion. Skipping: src/bin
[java] [INFO] No files selected for line-ending conversion. Skipping: src/bin
[java] [INFO] Building tar : /zonestorage/hudson/home/hudson/hudson/jobs/Maven-2.1.x-with-bootstrap/workspace/trunk/maven-distribution/target/apache-maven-3.0-SNAPSHOT-bin.tar.gz
[java] [INFO] Processing DependencySet (output=boot)
[java] [INFO] Processing DependencySet (output=lib)
[java] [WARNING] The following patterns were never triggered in this artifact exclusion filter:
[java] o 'org.codehaus.plexus:plexus-component-api'
[java] o 'classworlds:classworlds'
[java] o 'jmock:jmock'
[java] o 'xml-apis:xml-apis'
[java] o 'org.apache.maven:maven-artifact'
[java] o 'org.apache.maven:maven-monitor'
[java] o 'org.apache.maven:maven-plugin-descriptor'
[java] o 'jdom:jdom'
[java]
[java] [INFO] No files selected for line-ending conversion. Skipping: src/bin
[java] [INFO] No files selected for line-ending conversion. Skipping: src/bin
[java] [INFO] Building tar : /zonestorage/hudson/home/hudson/hudson/jobs/Maven-2.1.x-with-bootstrap/workspace/trunk/maven-distribution/target/apache-maven-3.0-SNAPSHOT-bin.tar.bz2
[java] [INFO] Processing DependencySet (output=boot)
[java] [INFO] Processing DependencySet (output=lib)
[java] [WARNING] The following patterns were never triggered in this artifact exclusion filter:
[java] o 'org.codehaus.plexus:plexus-component-api'
[java] o 'classworlds:classworlds'
[java] o 'jmock:jmock'
[java] o 'xml-apis:xml-apis'
[java] o 'org.apache.maven:maven-artifact'
[java] o 'org.apache.maven:maven-monitor'
[java] o 'org.apache.maven:maven-plugin-descriptor'
[java] o 'jdom:jdom'
[java]
[java] [INFO] No files selected for line-ending conversion. Skipping: src/bin
[java] [INFO] No files selected for line-ending conversion. Skipping: src/bin
[java] [INFO] Building zip: /zonestorage/hudson/home/hudson/hudson/jobs/Maven-2.1.x-with-bootstrap/workspace/trunk/maven-distribution/target/apache-maven-3.0-SNAPSHOT-bin.zip
[java] [INFO] [install:install]
[java] [INFO] Installing /zonestorage/hudson/home/hudson/hudson/jobs/Maven-2.1.x-with-bootstrap/workspace/trunk/maven-distribution/target/maven-distribution-3.0-SNAPSHOT.jar to /export/home/hudson/.m2/repository/org/apache/maven/maven-distribution/3.0-SNAPSHOT/maven-distribution-3.0-SNAPSHOT.jar
[java] [INFO] Installing /zonestorage/hudson/home/hudson/hudson/jobs/Maven-2.1.x-with-bootstrap/workspace/trunk/maven-distribution/target/apache-maven-3.0-SNAPSHOT-bin.tar.gz to /export/home/hudson/.m2/repository/org/apache/maven/maven-distribution/3.0-SNAPSHOT/maven-distribution-3.0-SNAPSHOT-bin.tar.gz
[java] [INFO] Installing /zonestorage/hudson/home/hudson/hudson/jobs/Maven-2.1.x-with-bootstrap/workspace/trunk/maven-distribution/target/apache-maven-3.0-SNAPSHOT-bin.tar.bz2 to /export/home/hudson/.m2/repository/org/apache/maven/maven-distribution/3.0-SNAPSHOT/maven-distribution-3.0-SNAPSHOT-bin.tar.bz2
[java] [INFO] Installing /zonestorage/hudson/home/hudson/hudson/jobs/Maven-2.1.x-with-bootstrap/workspace/trunk/maven-distribution/target/apache-maven-3.0-SNAPSHOT-bin.zip to /export/home/hudson/.m2/repository/org/apache/maven/maven-distribution/3.0-SNAPSHOT/maven-distribution-3.0-SNAPSHOT-bin.zip
[java] [INFO]
[java] [INFO]
[java] [INFO] ------------------------------------------------------------------------
[java] [INFO] Reactor Summary:
[java] [INFO] ------------------------------------------------------------------------
[java] [INFO] Apache Maven .......................................... SUCCESS [3.933s]
[java] [INFO] Maven Lifecycle Model ................................. SUCCESS [7.246s]
[java] [INFO] Maven Reporting API ................................... SUCCESS [2.366s]
[java] [INFO] Maven Model ........................................... SUCCESS [7.783s]
[java] [INFO] Maven Compat .......................................... SUCCESS [28.301s]
[java] [INFO] Maven Plugin API ...................................... SUCCESS [5.123s]
[java] [INFO] Maven Project Builder ................................. SUCCESS [4.730s]
[java] [INFO] Maven Project Builder ................................. SUCCESS [21.860s]
[java] [INFO] Maven Mercury ......................................... SUCCESS [10.192s]
[java] [INFO] Maven Core ............................................ SUCCESS [25.719s]
[java] [INFO] Maven Toolchains ...................................... SUCCESS [4.208s]
[java] [INFO] Maven Embedder ........................................ SUCCESS [46.958s]
[java] [INFO] Maven Distribution .................................... SUCCESS [37.887s]
[java] [INFO] ------------------------------------------------------------------------
[java] [INFO] ------------------------------------------------------------------------
[java] [INFO] BUILD SUCCESSFUL
[java] [INFO] ------------------------------------------------------------------------
[java] [INFO] Total time: 3 minutes 39 seconds
[java] [INFO] Finished at: Thu Jan 08 15:06:06 UTC 2009
[java] [INFO] Final Memory: 53M/199M
[java] [INFO] ------------------------------------------------------------------------
maven-assembly:
[echo]
[echo] The new Maven distribution was created as part of the MAVEN-COMPILE step, above.
[echo] This goal just validates the presence of that distribution.
[echo]
extract-assembly:
[echo] Extracting assembly to /home/hudson ...
[delete] Deleting directory /home/hudson/apache-maven-2.1-SNAPSHOT
[mkdir] Created dir: /home/hudson/apache-maven-2.1-SNAPSHOT
[unzip] Expanding: /zonestorage/hudson/home/hudson/hudson/jobs/Maven-2.1.x-with-bootstrap/workspace/trunk/maven-distribution/target/apache-maven-3.0-SNAPSHOT-bin.zip into /home/hudson
BUILD FAILED
/zonestorage/hudson/home/hudson/hudson/jobs/Maven-2.1.x-with-bootstrap/workspace/trunk/build.xml:224: /home/hudson/apache-maven-2.1-SNAPSHOT/bin not found.
Total time: 4 minutes 26 seconds
Build failed in Hudson: Maven-2.1.x-with-bootstrap #259
Posted by Apache Hudson Server <hu...@hudson.zones.apache.org>.
See http://hudson.zones.apache.org/hudson/job/Maven-2.1.x-with-bootstrap/259/changes
Changes:
[sisbell] Fix: MNG-3938
------------------------------------------
[...truncated 1355 lines...]
[java] [INFO] [jar:jar]
[java] [INFO] Building jar: /zonestorage/hudson/home/hudson/hudson/jobs/Maven-2.1.x-with-bootstrap/workspace/trunk/maven-embedder/target/embedder-test-project0/target/embedder-test-project-1.0-SNAPSHOT.jar
[java] [INFO] Scanning for projects...
[java] [INFO] ------------------------------------------------------------------------
[java] [INFO] Building Maven Quick Start Archetype
[java] [INFO]
[java] [INFO] Id: org.apache.maven:embedder-test-project:jar:1.0-SNAPSHOT
[java] [INFO] task-segment: [package]
[java] [INFO] ------------------------------------------------------------------------
[java] [INFO] [resources:resources]
[java] [INFO] Using default encoding to copy filtered resources.
[java] [INFO] [compiler:compile]
[java] [INFO] Compiling 1 source file to /zonestorage/hudson/home/hudson/hudson/jobs/Maven-2.1.x-with-bootstrap/workspace/trunk/maven-embedder/target/embedder-test-project1/target/classes
[java] [INFO] [resources:testResources]
[java] [INFO] Using default encoding to copy filtered resources.
[java] [INFO] [compiler:testCompile]
[java] [INFO] Compiling 1 source file to /zonestorage/hudson/home/hudson/hudson/jobs/Maven-2.1.x-with-bootstrap/workspace/trunk/maven-embedder/target/embedder-test-project1/target/test-classes
[java] [INFO] [surefire:test]
[java] [INFO] Surefire report directory: /zonestorage/hudson/home/hudson/hudson/jobs/Maven-2.1.x-with-bootstrap/workspace/trunk/maven-embedder/target/embedder-test-project1/target/surefire-reports
[java]
[java] -------------------------------------------------------
[java] T E S T S
[java] -------------------------------------------------------
[java] Running org.apache.maven.AppTest
[java] Tests run: 1, Failures: 0, Errors: 0, Skipped: 0, Time elapsed: 0.032 sec
[java]
[java] Results :
[java]
[java] Tests run: 1, Failures: 0, Errors: 0, Skipped: 0
[java]
[java] [INFO] [jar:jar]
[java] [INFO] Building jar: /zonestorage/hudson/home/hudson/hudson/jobs/Maven-2.1.x-with-bootstrap/workspace/trunk/maven-embedder/target/embedder-test-project1/target/embedder-test-project-1.0-SNAPSHOT.jar
[java] [INFO] Scanning for projects...
[java] [INFO] ------------------------------------------------------------------------
[java] [INFO] Building Maven Quick Start Archetype
[java] [INFO]
[java] [INFO] Id: org.apache.maven:embedder-test-project:jar:1.0-SNAPSHOT
[java] [INFO] task-segment: [validate]
[java] [INFO] ------------------------------------------------------------------------
[java] [INFO] Scanning for projects...
[java] [INFO] ------------------------------------------------------------------------
[java] [INFO] Building Maven Quick Start Archetype
[java] [INFO]
[java] [INFO] Id: org.apache.maven:embedder-test-project:jar:1.0-SNAPSHOT
[java] [INFO] task-segment: [validate]
[java] [INFO] ------------------------------------------------------------------------
[java] [INFO] Scanning for projects...
[java] [INFO] ------------------------------------------------------------------------
[java] [INFO] Building Maven Quick Start Archetype
[java] [INFO]
[java] [INFO] Id: org.apache.maven:embedder-test-project:jar:1.0-SNAPSHOT
[java] [INFO] task-segment: [package]
[java] [INFO] ------------------------------------------------------------------------
[java] [INFO] [resources:resources]
[java] [INFO] Using default encoding to copy filtered resources.
[java] [INFO] [compiler:compile]
[java] [INFO] Compiling 1 source file to /zonestorage/hudson/home/hudson/hudson/jobs/Maven-2.1.x-with-bootstrap/workspace/trunk/maven-embedder/target/embedder-test-project-caching/target/classes
[java] [INFO] [resources:testResources]
[java] [INFO] Using default encoding to copy filtered resources.
[java] [INFO] [compiler:testCompile]
[java] [INFO] Compiling 1 source file to /zonestorage/hudson/home/hudson/hudson/jobs/Maven-2.1.x-with-bootstrap/workspace/trunk/maven-embedder/target/embedder-test-project-caching/target/test-classes
[java] [INFO] [surefire:test]
[java] [INFO] Surefire report directory: /zonestorage/hudson/home/hudson/hudson/jobs/Maven-2.1.x-with-bootstrap/workspace/trunk/maven-embedder/target/embedder-test-project-caching/target/surefire-reports
[java]
[java] -------------------------------------------------------
[java] T E S T S
[java] -------------------------------------------------------
[java] Running org.apache.maven.AppTest
[java] Tests run: 1, Failures: 0, Errors: 0, Skipped: 0, Time elapsed: 0.049 sec
[java]
[java] Results :
[java] Tests run: 1, Failures: 0, Errors: 0, Skipped: 0
[java]
[java] [INFO] [jar:jar]
[java] [INFO] Building jar: /zonestorage/hudson/home/hudson/hudson/jobs/Maven-2.1.x-with-bootstrap/workspace/trunk/maven-embedder/target/embedder-test-project-caching/target/embedder-test-project-1.0-SNAPSHOT.jar
[java] [INFO] Scanning for projects...
[java] [INFO] ------------------------------------------------------------------------
[java] [INFO] Building Maven Quick Start Archetype
[java] [INFO]
[java] [INFO] Id: org.apache.maven:embedder-test-project:jar:1.0-SNAPSHOT
[java] [INFO] task-segment: [package]
[java] [INFO] ------------------------------------------------------------------------
[java] [INFO] [resources:resources]
[java] [INFO] Using default encoding to copy filtered resources.
[java] [INFO] [compiler:compile]
[java] [INFO] Nothing to compile - all classes are up to date
[java] [INFO] [resources:testResources]
[java] [INFO] Using default encoding to copy filtered resources.
[java] [INFO] [compiler:testCompile]
[java] [INFO] Nothing to compile - all classes are up to date
[java] [INFO] [surefire:test]
[java] [INFO] Surefire report directory: /zonestorage/hudson/home/hudson/hudson/jobs/Maven-2.1.x-with-bootstrap/workspace/trunk/maven-embedder/target/embedder-test-project-caching/target/surefire-reports
[java]
[java] -------------------------------------------------------
[java] T E S T S
[java] -------------------------------------------------------
[java] Running org.apache.maven.AppTest
[java] Tests run: 1, Failures: 0, Errors: 0, Skipped: 0, Time elapsed: 0.029 sec
[java]
[java] Results :
[java]
[java] Tests run: 1, Failures: 0, Errors: 0, Skipped: 0
[java]
[java] [INFO] [jar:jar]
[java] Tests run: 16, Failures: 0, Errors: 0, Skipped: 0, Time elapsed: 9.736 sec
[java] Running org.apache.maven.cli.CLIRequestUtilsTest
[java] key=value
[java] []
[java] Tests run: 2, Failures: 0, Errors: 0, Skipped: 0, Time elapsed: 0.097 sec
[java]
[java] Results :
[java]
[java] Tests run: 56, Failures: 0, Errors: 0, Skipped: 0
[java]
[java] [INFO] [jar:jar]
[java] [INFO] Building jar: /zonestorage/hudson/home/hudson/hudson/jobs/Maven-2.1.x-with-bootstrap/workspace/trunk/maven-embedder/target/maven-embedder-3.0-SNAPSHOT.jar
[java] [INFO] [install:install]
[java] [INFO] Installing /zonestorage/hudson/home/hudson/hudson/jobs/Maven-2.1.x-with-bootstrap/workspace/trunk/maven-embedder/target/maven-embedder-3.0-SNAPSHOT.jar to /export/home/hudson/.m2/repository/org/apache/maven/maven-embedder/3.0-SNAPSHOT/maven-embedder-3.0-SNAPSHOT.jar
[java] [INFO] ------------------------------------------------------------------------
[java] [INFO] Building Maven Distribution
[java] [INFO]
[java] [INFO] Id: org.apache.maven:maven-distribution:jar:3.0-SNAPSHOT
[java] [INFO] task-segment: [clean, install]
[java] [INFO] ------------------------------------------------------------------------
[java] [INFO] [clean:clean]
[java] [INFO] Deleting directory /zonestorage/hudson/home/hudson/hudson/jobs/Maven-2.1.x-with-bootstrap/workspace/trunk/maven-distribution/target
[java] [INFO] [remote-resources:process]
[java] [INFO] [resources:resources]
[java] [INFO] Using 'UTF-8' encoding to copy filtered resources.
[java] [INFO] skip non existing resourceDirectory /zonestorage/hudson/home/hudson/hudson/jobs/Maven-2.1.x-with-bootstrap/workspace/trunk/maven-distribution/src/main/resources
[java] [INFO] Copying 3 resources
[java] [INFO] [compiler:compile]
[java] [INFO] No sources to compile
[java] [INFO] [resources:testResources]
[java] [INFO] Using 'UTF-8' encoding to copy filtered resources.
[java] [INFO] skip non existing resourceDirectory /zonestorage/hudson/home/hudson/hudson/jobs/Maven-2.1.x-with-bootstrap/workspace/trunk/maven-distribution/src/test/resources
[java] [INFO] Copying 3 resources
[java] [INFO] [compiler:testCompile]
[java] [INFO] Compiling 1 source file to /zonestorage/hudson/home/hudson/hudson/jobs/Maven-2.1.x-with-bootstrap/workspace/trunk/maven-distribution/target/test-classes
[java] [INFO] [surefire:test]
[java] [INFO] Surefire report directory: /zonestorage/hudson/home/hudson/hudson/jobs/Maven-2.1.x-with-bootstrap/workspace/trunk/maven-distribution/target/surefire-reports
[java]
[java] -------------------------------------------------------
[java] T E S T S
[java] -------------------------------------------------------
[java] Running org.apache.maven.settings.GlobalSettingsTest
[java] Tests run: 1, Failures: 0, Errors: 0, Skipped: 0, Time elapsed: 0.2 sec
[java]
[java] Results :
[java]
[java] Tests run: 1, Failures: 0, Errors: 0, Skipped: 0
[java]
[java] [INFO] [jar:jar]
[java] [INFO] Building jar: /zonestorage/hudson/home/hudson/hudson/jobs/Maven-2.1.x-with-bootstrap/workspace/trunk/maven-distribution/target/maven-distribution-3.0-SNAPSHOT.jar
[java] [INFO] [assembly:single]
[java] [INFO] Reading assembly descriptor: src/main/assembly/bin.xml
[java] [INFO] Processing DependencySet (output=boot)
[java] [INFO] Processing DependencySet (output=lib)
[java] [WARNING] The following patterns were never triggered in this artifact exclusion filter:
[java] o 'org.codehaus.plexus:plexus-component-api'
[java] o 'classworlds:classworlds'
[java] o 'jmock:jmock'
[java] o 'xml-apis:xml-apis'
[java] o 'org.apache.maven:maven-artifact'
[java] o 'org.apache.maven:maven-monitor'
[java] o 'org.apache.maven:maven-plugin-descriptor'
[java] o 'jdom:jdom'
[java]
[java] [INFO] No files selected for line-ending conversion. Skipping: src/bin
[java] [INFO] No files selected for line-ending conversion. Skipping: src/bin
[java] [INFO] Building tar : /zonestorage/hudson/home/hudson/hudson/jobs/Maven-2.1.x-with-bootstrap/workspace/trunk/maven-distribution/target/apache-maven-3.0-SNAPSHOT-bin.tar.gz
[java] [INFO] Processing DependencySet (output=boot)
[java] [INFO] Processing DependencySet (output=lib)
[java] [WARNING] The following patterns were never triggered in this artifact exclusion filter:
[java] o 'org.codehaus.plexus:plexus-component-api'
[java] o 'classworlds:classworlds'
[java] o 'jmock:jmock'
[java] o 'xml-apis:xml-apis'
[java] o 'org.apache.maven:maven-artifact'
[java] o 'org.apache.maven:maven-monitor'
[java] o 'org.apache.maven:maven-plugin-descriptor'
[java] o 'jdom:jdom'
[java]
[java] [INFO] No files selected for line-ending conversion. Skipping: src/bin
[java] [INFO] No files selected for line-ending conversion. Skipping: src/bin
[java] [INFO] Building tar : /zonestorage/hudson/home/hudson/hudson/jobs/Maven-2.1.x-with-bootstrap/workspace/trunk/maven-distribution/target/apache-maven-3.0-SNAPSHOT-bin.tar.bz2
[java] [INFO] Processing DependencySet (output=boot)
[java] [INFO] Processing DependencySet (output=lib)
[java] [WARNING] The following patterns were never triggered in this artifact exclusion filter:
[java] o 'org.codehaus.plexus:plexus-component-api'
[java] o 'classworlds:classworlds'
[java] o 'jmock:jmock'
[java] o 'xml-apis:xml-apis'
[java] o 'org.apache.maven:maven-artifact'
[java] o 'org.apache.maven:maven-monitor'
[java] o 'org.apache.maven:maven-plugin-descriptor'
[java] o 'jdom:jdom'
[java]
[java] [INFO] No files selected for line-ending conversion. Skipping: src/bin
[java] [INFO] No files selected for line-ending conversion. Skipping: src/bin
[java] [INFO] Building zip: /zonestorage/hudson/home/hudson/hudson/jobs/Maven-2.1.x-with-bootstrap/workspace/trunk/maven-distribution/target/apache-maven-3.0-SNAPSHOT-bin.zip
[java] [INFO] [install:install]
[java] [INFO] Installing /zonestorage/hudson/home/hudson/hudson/jobs/Maven-2.1.x-with-bootstrap/workspace/trunk/maven-distribution/target/maven-distribution-3.0-SNAPSHOT.jar to /export/home/hudson/.m2/repository/org/apache/maven/maven-distribution/3.0-SNAPSHOT/maven-distribution-3.0-SNAPSHOT.jar
[java] [INFO] Installing /zonestorage/hudson/home/hudson/hudson/jobs/Maven-2.1.x-with-bootstrap/workspace/trunk/maven-distribution/target/apache-maven-3.0-SNAPSHOT-bin.tar.gz to /export/home/hudson/.m2/repository/org/apache/maven/maven-distribution/3.0-SNAPSHOT/maven-distribution-3.0-SNAPSHOT-bin.tar.gz
[java] [INFO] Installing /zonestorage/hudson/home/hudson/hudson/jobs/Maven-2.1.x-with-bootstrap/workspace/trunk/maven-distribution/target/apache-maven-3.0-SNAPSHOT-bin.tar.bz2 to /export/home/hudson/.m2/repository/org/apache/maven/maven-distribution/3.0-SNAPSHOT/maven-distribution-3.0-SNAPSHOT-bin.tar.bz2
[java] [INFO] Installing /zonestorage/hudson/home/hudson/hudson/jobs/Maven-2.1.x-with-bootstrap/workspace/trunk/maven-distribution/target/apache-maven-3.0-SNAPSHOT-bin.zip to /export/home/hudson/.m2/repository/org/apache/maven/maven-distribution/3.0-SNAPSHOT/maven-distribution-3.0-SNAPSHOT-bin.zip
[java] [INFO]
[java] [INFO]
[java] [INFO] ------------------------------------------------------------------------
[java] [INFO] Reactor Summary:
[java] [INFO] ------------------------------------------------------------------------
[java] [INFO] Apache Maven .......................................... SUCCESS [6.282s]
[java] [INFO] Maven Lifecycle Model ................................. SUCCESS [10.391s]
[java] [INFO] Maven Reporting API ................................... SUCCESS [2.423s]
[java] [INFO] Maven Model ........................................... SUCCESS [7.944s]
[java] [INFO] Maven Compat .......................................... SUCCESS [29.155s]
[java] [INFO] Maven Plugin API ...................................... SUCCESS [7.324s]
[java] [INFO] Maven Project Builder ................................. SUCCESS [8.588s]
[java] [INFO] Maven Project Builder ................................. SUCCESS [39.166s]
[java] [INFO] Maven Mercury ......................................... SUCCESS [12.208s]
[java] [INFO] Maven Core ............................................ SUCCESS [31.966s]
[java] [INFO] Maven Toolchains ...................................... SUCCESS [6.693s]
[java] [INFO] Maven Embedder ........................................ SUCCESS [42.559s]
[java] [INFO] Maven Distribution .................................... SUCCESS [49.306s]
[java] [INFO] ------------------------------------------------------------------------
[java] [INFO] ------------------------------------------------------------------------
[java] [INFO] BUILD SUCCESSFUL
[java] [INFO] ------------------------------------------------------------------------
[java] [INFO] Total time: 4 minutes 39 seconds
[java] [INFO] Finished at: Wed Jan 07 14:38:09 UTC 2009
[java] [INFO] Final Memory: 52M/199M
[java] [INFO] ------------------------------------------------------------------------
maven-assembly:
[echo]
[echo] The new Maven distribution was created as part of the MAVEN-COMPILE step, above.
[echo] This goal just validates the presence of that distribution.
[echo]
extract-assembly:
[echo] Extracting assembly to /home/hudson ...
[delete] Deleting directory /home/hudson/apache-maven-2.1-SNAPSHOT
[mkdir] Created dir: /home/hudson/apache-maven-2.1-SNAPSHOT
[unzip] Expanding: /zonestorage/hudson/home/hudson/hudson/jobs/Maven-2.1.x-with-bootstrap/workspace/trunk/maven-distribution/target/apache-maven-3.0-SNAPSHOT-bin.zip into /home/hudson
BUILD FAILED
/zonestorage/hudson/home/hudson/hudson/jobs/Maven-2.1.x-with-bootstrap/workspace/trunk/build.xml:224: /home/hudson/apache-maven-2.1-SNAPSHOT/bin not found.
Total time: 6 minutes 4 seconds
Build failed in Hudson: Maven-2.1.x-with-bootstrap #258
Posted by Apache Hudson Server <hu...@hudson.zones.apache.org>.
See http://hudson.zones.apache.org/hudson/job/Maven-2.1.x-with-bootstrap/258/changes
Changes:
[sisbell] Fix: MNG-3856 - Just needed to replace modelProperty.getValue with modelProperty.getResolvedValue.
------------------------------------------
[...truncated 1355 lines...]
[java] [INFO] Scanning for projects...
[java] [INFO] ------------------------------------------------------------------------
[java] [INFO] Building Maven Quick Start Archetype
[java] [INFO]
[java] [INFO] Id: org.apache.maven:embedder-test-project:jar:1.0-SNAPSHOT
[java] [INFO] task-segment: [package]
[java] [INFO] ------------------------------------------------------------------------
[java] [INFO] [resources:resources]
[java] [INFO] Using default encoding to copy filtered resources.
[java] [INFO] [compiler:compile]
[java] [INFO] Compiling 1 source file to /zonestorage/hudson/home/hudson/hudson/jobs/Maven-2.1.x-with-bootstrap/workspace/trunk/maven-embedder/target/embedder-test-project1/target/classes
[java] [INFO] [resources:testResources]
[java] [INFO] Using default encoding to copy filtered resources.
[java] [INFO] [compiler:testCompile]
[java] [INFO] Compiling 1 source file to /zonestorage/hudson/home/hudson/hudson/jobs/Maven-2.1.x-with-bootstrap/workspace/trunk/maven-embedder/target/embedder-test-project1/target/test-classes
[java] [INFO] [surefire:test]
[java] [INFO] Surefire report directory: /zonestorage/hudson/home/hudson/hudson/jobs/Maven-2.1.x-with-bootstrap/workspace/trunk/maven-embedder/target/embedder-test-project1/target/surefire-reports
[java]
[java] -------------------------------------------------------
[java] T E S T S
[java] -------------------------------------------------------
[java] Running org.apache.maven.AppTest
[java] Tests run: 1, Failures: 0, Errors: 0, Skipped: 0, Time elapsed: 0.033 sec
[java]
[java] Results :
[java]
[java] Tests run: 1, Failures: 0, Errors: 0, Skipped: 0
[java]
[java] [INFO] [jar:jar]
[java] [INFO] Building jar: /zonestorage/hudson/home/hudson/hudson/jobs/Maven-2.1.x-with-bootstrap/workspace/trunk/maven-embedder/target/embedder-test-project1/target/embedder-test-project-1.0-SNAPSHOT.jar
[java] [INFO] Scanning for projects...
[java] [INFO] ------------------------------------------------------------------------
[java] [INFO] Building Maven Quick Start Archetype
[java] [INFO]
[java] [INFO] Id: org.apache.maven:embedder-test-project:jar:1.0-SNAPSHOT
[java] [INFO] task-segment: [validate]
[java] [INFO] ------------------------------------------------------------------------
[java] [INFO] Scanning for projects...
[java] [INFO] ------------------------------------------------------------------------
[java] [INFO] Building Maven Quick Start Archetype
[java] [INFO]
[java] [INFO] Id: org.apache.maven:embedder-test-project:jar:1.0-SNAPSHOT
[java] [INFO] task-segment: [validate]
[java] [INFO] ------------------------------------------------------------------------
[java] [INFO] Scanning for projects...
[java] [INFO] ------------------------------------------------------------------------
[java] [INFO] Building Maven Quick Start Archetype
[java] [INFO]
[java] [INFO] Id: org.apache.maven:embedder-test-project:jar:1.0-SNAPSHOT
[java] [INFO] task-segment: [package]
[java] [INFO] ------------------------------------------------------------------------
[java] [INFO] [resources:resources]
[java] [INFO] Using default encoding to copy filtered resources.
[java] [INFO] [compiler:compile]
[java] [INFO] Compiling 1 source file to /zonestorage/hudson/home/hudson/hudson/jobs/Maven-2.1.x-with-bootstrap/workspace/trunk/maven-embedder/target/embedder-test-project-caching/target/classes
[java] [INFO] [resources:testResources]
[java] [INFO] Using default encoding to copy filtered resources.
[java] [INFO] [compiler:testCompile]
[java] [INFO] Compiling 1 source file to /zonestorage/hudson/home/hudson/hudson/jobs/Maven-2.1.x-with-bootstrap/workspace/trunk/maven-embedder/target/embedder-test-project-caching/target/test-classes
[java] [INFO] [surefire:test]
[java] [INFO] Surefire report directory: /zonestorage/hudson/home/hudson/hudson/jobs/Maven-2.1.x-with-bootstrap/workspace/trunk/maven-embedder/target/embedder-test-project-caching/target/surefire-reports
[java]
[java] -------------------------------------------------------
[java] T E S T S
[java] -------------------------------------------------------
[java] Running org.apache.maven.AppTest
[java] Tests run: 1, Failures: 0, Errors: 0, Skipped: 0, Time elapsed: 0.047 sec
[java]
[java] Results :
[java] Tests run: 1, Failures: 0, Errors: 0, Skipped: 0
[java]
[java] [INFO] [jar:jar]
[java] [INFO] Building jar: /zonestorage/hudson/home/hudson/hudson/jobs/Maven-2.1.x-with-bootstrap/workspace/trunk/maven-embedder/target/embedder-test-project-caching/target/embedder-test-project-1.0-SNAPSHOT.jar
[java] [INFO] Scanning for projects...
[java] [INFO] ------------------------------------------------------------------------
[java] [INFO] Building Maven Quick Start Archetype
[java] [INFO]
[java] [INFO] Id: org.apache.maven:embedder-test-project:jar:1.0-SNAPSHOT
[java] [INFO] task-segment: [package]
[java] [INFO] ------------------------------------------------------------------------
[java] [INFO] [resources:resources]
[java] [INFO] Using default encoding to copy filtered resources.
[java] [INFO] [compiler:compile]
[java] [INFO] Nothing to compile - all classes are up to date
[java] [INFO] [resources:testResources]
[java] [INFO] Using default encoding to copy filtered resources.
[java] [INFO] [compiler:testCompile]
[java] [INFO] Nothing to compile - all classes are up to date
[java] [INFO] [surefire:test]
[java] [INFO] Surefire report directory: /zonestorage/hudson/home/hudson/hudson/jobs/Maven-2.1.x-with-bootstrap/workspace/trunk/maven-embedder/target/embedder-test-project-caching/target/surefire-reports
[java]
[java] -------------------------------------------------------
[java] T E S T S
[java] -------------------------------------------------------
[java] Running org.apache.maven.AppTest
[java] Tests run: 1, Failures: 0, Errors: 0, Skipped: 0, Time elapsed: 0.029 sec
[java]
[java] Results :
[java]
[java] Tests run: 1, Failures: 0, Errors: 0, Skipped: 0
[java]
[java] [INFO] [jar:jar]
[java] Tests run: 16, Failures: 0, Errors: 0, Skipped: 0, Time elapsed: 10.95 sec
[java] Running org.apache.maven.embedder.MavenEmbedderExampleTest
[java] Tests run: 2, Failures: 0, Errors: 0, Skipped: 0, Time elapsed: 0.236 sec
[java] Running org.apache.maven.cli.CLIRequestUtilsTest
[java] key=value
[java] []
[java] Tests run: 2, Failures: 0, Errors: 0, Skipped: 0, Time elapsed: 0.166 sec
[java]
[java] Results :
[java]
[java] Tests run: 56, Failures: 0, Errors: 0, Skipped: 0
[java]
[java] [INFO] [jar:jar]
[java] [INFO] Building jar: /zonestorage/hudson/home/hudson/hudson/jobs/Maven-2.1.x-with-bootstrap/workspace/trunk/maven-embedder/target/maven-embedder-3.0-SNAPSHOT.jar
[java] [INFO] [install:install]
[java] [INFO] Installing /zonestorage/hudson/home/hudson/hudson/jobs/Maven-2.1.x-with-bootstrap/workspace/trunk/maven-embedder/target/maven-embedder-3.0-SNAPSHOT.jar to /export/home/hudson/.m2/repository/org/apache/maven/maven-embedder/3.0-SNAPSHOT/maven-embedder-3.0-SNAPSHOT.jar
[java] [INFO] ------------------------------------------------------------------------
[java] [INFO] Building Maven Distribution
[java] [INFO]
[java] [INFO] Id: org.apache.maven:maven-distribution:jar:3.0-SNAPSHOT
[java] [INFO] task-segment: [clean, install]
[java] [INFO] ------------------------------------------------------------------------
[java] [INFO] [clean:clean]
[java] [INFO] Deleting directory /zonestorage/hudson/home/hudson/hudson/jobs/Maven-2.1.x-with-bootstrap/workspace/trunk/maven-distribution/target
[java] [INFO] [remote-resources:process]
[java] [INFO] [resources:resources]
[java] [INFO] Using 'UTF-8' encoding to copy filtered resources.
[java] [INFO] skip non existing resourceDirectory /zonestorage/hudson/home/hudson/hudson/jobs/Maven-2.1.x-with-bootstrap/workspace/trunk/maven-distribution/src/main/resources
[java] [INFO] Copying 3 resources
[java] [INFO] [compiler:compile]
[java] [INFO] No sources to compile
[java] [INFO] [resources:testResources]
[java] [INFO] Using 'UTF-8' encoding to copy filtered resources.
[java] [INFO] skip non existing resourceDirectory /zonestorage/hudson/home/hudson/hudson/jobs/Maven-2.1.x-with-bootstrap/workspace/trunk/maven-distribution/src/test/resources
[java] [INFO] Copying 3 resources
[java] [INFO] [compiler:testCompile]
[java] [INFO] Compiling 1 source file to /zonestorage/hudson/home/hudson/hudson/jobs/Maven-2.1.x-with-bootstrap/workspace/trunk/maven-distribution/target/test-classes
[java] [INFO] [surefire:test]
[java] [INFO] Surefire report directory: /zonestorage/hudson/home/hudson/hudson/jobs/Maven-2.1.x-with-bootstrap/workspace/trunk/maven-distribution/target/surefire-reports
[java]
[java] -------------------------------------------------------
[java] T E S T S
[java] -------------------------------------------------------
[java] Running org.apache.maven.settings.GlobalSettingsTest
[java] Tests run: 1, Failures: 0, Errors: 0, Skipped: 0, Time elapsed: 0.233 sec
[java]
[java] Results :
[java]
[java] Tests run: 1, Failures: 0, Errors: 0, Skipped: 0
[java]
[java] [INFO] [jar:jar]
[java] [INFO] Building jar: /zonestorage/hudson/home/hudson/hudson/jobs/Maven-2.1.x-with-bootstrap/workspace/trunk/maven-distribution/target/maven-distribution-3.0-SNAPSHOT.jar
[java] [INFO] [assembly:single]
[java] [INFO] Reading assembly descriptor: src/main/assembly/bin.xml
[java] [INFO] Processing DependencySet (output=boot)
[java] [INFO] Processing DependencySet (output=lib)
[java] [WARNING] The following patterns were never triggered in this artifact exclusion filter:
[java] o 'org.codehaus.plexus:plexus-component-api'
[java] o 'classworlds:classworlds'
[java] o 'jmock:jmock'
[java] o 'xml-apis:xml-apis'
[java] o 'org.apache.maven:maven-artifact'
[java] o 'org.apache.maven:maven-monitor'
[java] o 'org.apache.maven:maven-plugin-descriptor'
[java] o 'jdom:jdom'
[java]
[java] [INFO] No files selected for line-ending conversion. Skipping: src/bin
[java] [INFO] No files selected for line-ending conversion. Skipping: src/bin
[java] [INFO] Building tar : /zonestorage/hudson/home/hudson/hudson/jobs/Maven-2.1.x-with-bootstrap/workspace/trunk/maven-distribution/target/apache-maven-3.0-SNAPSHOT-bin.tar.gz
[java] [INFO] Processing DependencySet (output=boot)
[java] [INFO] Processing DependencySet (output=lib)
[java] [WARNING] The following patterns were never triggered in this artifact exclusion filter:
[java] o 'org.codehaus.plexus:plexus-component-api'
[java] o 'classworlds:classworlds'
[java] o 'jmock:jmock'
[java] o 'xml-apis:xml-apis'
[java] o 'org.apache.maven:maven-artifact'
[java] o 'org.apache.maven:maven-monitor'
[java] o 'org.apache.maven:maven-plugin-descriptor'
[java] o 'jdom:jdom'
[java]
[java] [INFO] No files selected for line-ending conversion. Skipping: src/bin
[java] [INFO] No files selected for line-ending conversion. Skipping: src/bin
[java] [INFO] Building tar : /zonestorage/hudson/home/hudson/hudson/jobs/Maven-2.1.x-with-bootstrap/workspace/trunk/maven-distribution/target/apache-maven-3.0-SNAPSHOT-bin.tar.bz2
[java] [INFO] Processing DependencySet (output=boot)
[java] [INFO] Processing DependencySet (output=lib)
[java] [WARNING] The following patterns were never triggered in this artifact exclusion filter:
[java] o 'org.codehaus.plexus:plexus-component-api'
[java] o 'classworlds:classworlds'
[java] o 'jmock:jmock'
[java] o 'xml-apis:xml-apis'
[java] o 'org.apache.maven:maven-artifact'
[java] o 'org.apache.maven:maven-monitor'
[java] o 'org.apache.maven:maven-plugin-descriptor'
[java] o 'jdom:jdom'
[java]
[java] [INFO] No files selected for line-ending conversion. Skipping: src/bin
[java] [INFO] No files selected for line-ending conversion. Skipping: src/bin
[java] [INFO] Building zip: /zonestorage/hudson/home/hudson/hudson/jobs/Maven-2.1.x-with-bootstrap/workspace/trunk/maven-distribution/target/apache-maven-3.0-SNAPSHOT-bin.zip
[java] [INFO] [install:install]
[java] [INFO] Installing /zonestorage/hudson/home/hudson/hudson/jobs/Maven-2.1.x-with-bootstrap/workspace/trunk/maven-distribution/target/maven-distribution-3.0-SNAPSHOT.jar to /export/home/hudson/.m2/repository/org/apache/maven/maven-distribution/3.0-SNAPSHOT/maven-distribution-3.0-SNAPSHOT.jar
[java] [INFO] Installing /zonestorage/hudson/home/hudson/hudson/jobs/Maven-2.1.x-with-bootstrap/workspace/trunk/maven-distribution/target/apache-maven-3.0-SNAPSHOT-bin.tar.gz to /export/home/hudson/.m2/repository/org/apache/maven/maven-distribution/3.0-SNAPSHOT/maven-distribution-3.0-SNAPSHOT-bin.tar.gz
[java] [INFO] Installing /zonestorage/hudson/home/hudson/hudson/jobs/Maven-2.1.x-with-bootstrap/workspace/trunk/maven-distribution/target/apache-maven-3.0-SNAPSHOT-bin.tar.bz2 to /export/home/hudson/.m2/repository/org/apache/maven/maven-distribution/3.0-SNAPSHOT/maven-distribution-3.0-SNAPSHOT-bin.tar.bz2
[java] [INFO] Installing /zonestorage/hudson/home/hudson/hudson/jobs/Maven-2.1.x-with-bootstrap/workspace/trunk/maven-distribution/target/apache-maven-3.0-SNAPSHOT-bin.zip to /export/home/hudson/.m2/repository/org/apache/maven/maven-distribution/3.0-SNAPSHOT/maven-distribution-3.0-SNAPSHOT-bin.zip
[java] [INFO]
[java] [INFO]
[java] [INFO] ------------------------------------------------------------------------
[java] [INFO] Reactor Summary:
[java] [INFO] ------------------------------------------------------------------------
[java] [INFO] Apache Maven .......................................... SUCCESS [4.149s]
[java] [INFO] Maven Lifecycle Model ................................. SUCCESS [7.905s]
[java] [INFO] Maven Reporting API ................................... SUCCESS [2.208s]
[java] [INFO] Maven Model ........................................... SUCCESS [5.488s]
[java] [INFO] Maven Compat .......................................... SUCCESS [28.517s]
[java] [INFO] Maven Plugin API ...................................... SUCCESS [3.713s]
[java] [INFO] Maven Project Builder ................................. SUCCESS [4.625s]
[java] [INFO] Maven Project Builder ................................. SUCCESS [20.031s]
[java] [INFO] Maven Mercury ......................................... SUCCESS [7.301s]
[java] [INFO] Maven Core ............................................ SUCCESS [21.477s]
[java] [INFO] Maven Toolchains ...................................... SUCCESS [4.093s]
[java] [INFO] Maven Embedder ........................................ SUCCESS [44.455s]
[java] [INFO] Maven Distribution .................................... SUCCESS [36.599s]
[java] [INFO] ------------------------------------------------------------------------
[java] [INFO] ------------------------------------------------------------------------
[java] [INFO] BUILD SUCCESSFUL
[java] [INFO] ------------------------------------------------------------------------
[java] [INFO] Total time: 3 minutes 25 seconds
[java] [INFO] Finished at: Wed Jan 07 10:20:47 UTC 2009
[java] [INFO] Final Memory: 54M/199M
[java] [INFO] ------------------------------------------------------------------------
maven-assembly:
[echo]
[echo] The new Maven distribution was created as part of the MAVEN-COMPILE step, above.
[echo] This goal just validates the presence of that distribution.
[echo]
extract-assembly:
[echo] Extracting assembly to /home/hudson ...
[delete] Deleting directory /home/hudson/apache-maven-2.1-SNAPSHOT
[mkdir] Created dir: /home/hudson/apache-maven-2.1-SNAPSHOT
[unzip] Expanding: /zonestorage/hudson/home/hudson/hudson/jobs/Maven-2.1.x-with-bootstrap/workspace/trunk/maven-distribution/target/apache-maven-3.0-SNAPSHOT-bin.zip into /home/hudson
BUILD FAILED
/zonestorage/hudson/home/hudson/hudson/jobs/Maven-2.1.x-with-bootstrap/workspace/trunk/build.xml:224: /home/hudson/apache-maven-2.1-SNAPSHOT/bin not found.
Total time: 4 minutes 15 seconds