You are viewing a plain text version of this content. The canonical link for it is here.
Posted to dev@kafka.apache.org by Apache Jenkins Server <je...@builds.apache.org> on 2016/10/30 22:14:44 UTC

Build failed in Jenkins: kafka-trunk-jdk8 #1011

See <https://builds.apache.org/job/kafka-trunk-jdk8/1011/changes>

Changes:

[wangguoz] KAFKA-3559: Recycle old tasks when possible

[wangguoz] KAFKA-4302: Simplify KTableSource

[wangguoz] HOTFIX: improve error message on invalid input record timestamp

------------------------------------------
[...truncated 7505 lines...]
kafka.log.LogSegmentTest > testChangeFileSuffixes STARTED

kafka.log.LogSegmentTest > testChangeFileSuffixes PASSED

kafka.log.LogSegmentTest > testRecoveryFixesCorruptTimeIndex STARTED

kafka.log.LogSegmentTest > testRecoveryFixesCorruptTimeIndex PASSED

kafka.log.LogSegmentTest > testReloadLargestTimestampAfterTruncation STARTED

kafka.log.LogSegmentTest > testReloadLargestTimestampAfterTruncation PASSED

kafka.log.LogSegmentTest > testMaxOffset STARTED

kafka.log.LogSegmentTest > testMaxOffset PASSED

kafka.log.LogSegmentTest > testNextOffsetCalculation STARTED

kafka.log.LogSegmentTest > testNextOffsetCalculation PASSED

kafka.log.LogSegmentTest > testFindOffsetByTimestamp STARTED

kafka.log.LogSegmentTest > testFindOffsetByTimestamp PASSED

kafka.log.LogSegmentTest > testReadOnEmptySegment STARTED

kafka.log.LogSegmentTest > testReadOnEmptySegment PASSED

kafka.log.LogSegmentTest > testReadAfterLast STARTED

kafka.log.LogSegmentTest > testReadAfterLast PASSED

kafka.log.LogSegmentTest > testCreateWithInitFileSizeClearShutdown STARTED

kafka.log.LogSegmentTest > testCreateWithInitFileSizeClearShutdown PASSED

kafka.log.LogSegmentTest > testTruncateFull STARTED

kafka.log.LogSegmentTest > testTruncateFull PASSED

kafka.log.LogCleanerTest > testCleanCorruptMessageSet STARTED

kafka.log.LogCleanerTest > testCleanCorruptMessageSet PASSED

kafka.log.LogCleanerTest > testBuildOffsetMap STARTED

kafka.log.LogCleanerTest > testBuildOffsetMap PASSED

kafka.log.LogCleanerTest > testBuildOffsetMapFakeLarge STARTED

kafka.log.LogCleanerTest > testBuildOffsetMapFakeLarge PASSED

kafka.log.LogCleanerTest > testSegmentGrouping STARTED

kafka.log.LogCleanerTest > testSegmentGrouping PASSED

kafka.log.LogCleanerTest > testCleanSegmentsWithAbort STARTED

kafka.log.LogCleanerTest > testCleanSegmentsWithAbort PASSED

kafka.log.LogCleanerTest > testSegmentGroupingWithSparseOffsets STARTED

kafka.log.LogCleanerTest > testSegmentGroupingWithSparseOffsets PASSED

kafka.log.LogCleanerTest > testLargeMessage STARTED

kafka.log.LogCleanerTest > testLargeMessage PASSED

kafka.log.LogCleanerTest > testRecoveryAfterCrash STARTED

kafka.log.LogCleanerTest > testRecoveryAfterCrash PASSED

kafka.log.LogCleanerTest > testCleaningWithUncleanableSection STARTED

kafka.log.LogCleanerTest > testCleaningWithUncleanableSection PASSED

kafka.log.LogCleanerTest > testLogToClean STARTED

kafka.log.LogCleanerTest > testLogToClean PASSED

kafka.log.LogCleanerTest > testCleaningWithDeletes STARTED

kafka.log.LogCleanerTest > testCleaningWithDeletes PASSED

kafka.log.LogCleanerTest > testClientHandlingOfCorruptMessageSet STARTED

kafka.log.LogCleanerTest > testClientHandlingOfCorruptMessageSet PASSED

kafka.log.LogCleanerTest > testCleanSegments STARTED

kafka.log.LogCleanerTest > testCleanSegments PASSED

kafka.log.LogCleanerTest > testLogToCleanWithUncleanableSection STARTED

kafka.log.LogCleanerTest > testLogToCleanWithUncleanableSection PASSED

kafka.log.LogCleanerTest > testBuildPartialOffsetMap STARTED

kafka.log.LogCleanerTest > testBuildPartialOffsetMap PASSED

kafka.log.LogCleanerTest > testCleaningWithUnkeyedMessages STARTED

kafka.log.LogCleanerTest > testCleaningWithUnkeyedMessages PASSED

kafka.log.LogCleanerTest > testPartialSegmentClean STARTED

kafka.log.LogCleanerTest > testPartialSegmentClean PASSED

kafka.log.LogConfigTest > shouldValidateThrottledReplicasConfig STARTED

kafka.log.LogConfigTest > shouldValidateThrottledReplicasConfig PASSED

kafka.log.LogConfigTest > testFromPropsEmpty STARTED

kafka.log.LogConfigTest > testFromPropsEmpty PASSED

kafka.log.LogConfigTest > testKafkaConfigToProps STARTED

kafka.log.LogConfigTest > testKafkaConfigToProps PASSED

kafka.log.LogConfigTest > testFromPropsInvalid STARTED

kafka.log.LogConfigTest > testFromPropsInvalid PASSED

kafka.log.LogCleanerIntegrationTest > testCleansCombinedCompactAndDeleteTopic[0] STARTED

kafka.log.LogCleanerIntegrationTest > testCleansCombinedCompactAndDeleteTopic[0] PASSED

kafka.log.LogCleanerIntegrationTest > testCleaningNestedMessagesWithMultipleVersions[0] STARTED

kafka.log.LogCleanerIntegrationTest > testCleaningNestedMessagesWithMultipleVersions[0] PASSED

kafka.log.LogCleanerIntegrationTest > cleanerTest[0] STARTED

kafka.log.LogCleanerIntegrationTest > cleanerTest[0] PASSED

kafka.log.LogCleanerIntegrationTest > testCleanerWithMessageFormatV0[0] STARTED

kafka.log.LogCleanerIntegrationTest > testCleanerWithMessageFormatV0[0] PASSED

kafka.log.LogCleanerIntegrationTest > testCleansCombinedCompactAndDeleteTopic[1] STARTED

kafka.log.LogCleanerIntegrationTest > testCleansCombinedCompactAndDeleteTopic[1] PASSED

kafka.log.LogCleanerIntegrationTest > testCleaningNestedMessagesWithMultipleVersions[1] STARTED

kafka.log.LogCleanerIntegrationTest > testCleaningNestedMessagesWithMultipleVersions[1] PASSED

kafka.log.LogCleanerIntegrationTest > cleanerTest[1] STARTED

kafka.log.LogCleanerIntegrationTest > cleanerTest[1] PASSED

kafka.log.LogCleanerIntegrationTest > testCleanerWithMessageFormatV0[1] STARTED

kafka.log.LogCleanerIntegrationTest > testCleanerWithMessageFormatV0[1] PASSED

kafka.log.LogCleanerIntegrationTest > testCleansCombinedCompactAndDeleteTopic[2] STARTED

kafka.log.LogCleanerIntegrationTest > testCleansCombinedCompactAndDeleteTopic[2] PASSED

kafka.log.LogCleanerIntegrationTest > testCleaningNestedMessagesWithMultipleVersions[2] STARTED

kafka.log.LogCleanerIntegrationTest > testCleaningNestedMessagesWithMultipleVersions[2] PASSED

kafka.log.LogCleanerIntegrationTest > cleanerTest[2] STARTED

kafka.log.LogCleanerIntegrationTest > cleanerTest[2] PASSED

kafka.log.LogCleanerIntegrationTest > testCleanerWithMessageFormatV0[2] STARTED

kafka.log.LogCleanerIntegrationTest > testCleanerWithMessageFormatV0[2] PASSED

kafka.log.LogCleanerIntegrationTest > testCleansCombinedCompactAndDeleteTopic[3] STARTED

kafka.log.LogCleanerIntegrationTest > testCleansCombinedCompactAndDeleteTopic[3] PASSED

kafka.log.LogCleanerIntegrationTest > testCleaningNestedMessagesWithMultipleVersions[3] STARTED

kafka.log.LogCleanerIntegrationTest > testCleaningNestedMessagesWithMultipleVersions[3] PASSED

kafka.log.LogCleanerIntegrationTest > cleanerTest[3] STARTED

kafka.log.LogCleanerIntegrationTest > cleanerTest[3] PASSED

kafka.log.LogCleanerIntegrationTest > testCleanerWithMessageFormatV0[3] STARTED

kafka.log.LogCleanerIntegrationTest > testCleanerWithMessageFormatV0[3] PASSED

kafka.log.LogCleanerLagIntegrationTest > cleanerTest[0] STARTED

kafka.log.LogCleanerLagIntegrationTest > cleanerTest[0] PASSED

kafka.log.LogCleanerLagIntegrationTest > cleanerTest[1] STARTED

kafka.log.LogCleanerLagIntegrationTest > cleanerTest[1] PASSED

kafka.log.LogCleanerLagIntegrationTest > cleanerTest[2] STARTED

kafka.log.LogCleanerLagIntegrationTest > cleanerTest[2] PASSED

kafka.log.LogCleanerLagIntegrationTest > cleanerTest[3] STARTED

kafka.log.LogCleanerLagIntegrationTest > cleanerTest[3] PASSED

kafka.log.LogManagerTest > testCleanupSegmentsToMaintainSize STARTED

kafka.log.LogManagerTest > testCleanupSegmentsToMaintainSize PASSED

kafka.log.LogManagerTest > testRecoveryDirectoryMappingWithRelativeDirectory STARTED

kafka.log.LogManagerTest > testRecoveryDirectoryMappingWithRelativeDirectory PASSED

kafka.log.LogManagerTest > testGetNonExistentLog STARTED

kafka.log.LogManagerTest > testGetNonExistentLog PASSED

kafka.log.LogManagerTest > testTwoLogManagersUsingSameDirFails STARTED

kafka.log.LogManagerTest > testTwoLogManagersUsingSameDirFails PASSED

kafka.log.LogManagerTest > testLeastLoadedAssignment STARTED

kafka.log.LogManagerTest > testLeastLoadedAssignment PASSED

kafka.log.LogManagerTest > testCleanupExpiredSegments STARTED
ERROR: Could not install GRADLE_2_4_RC_2_HOME
java.lang.NullPointerException
	at hudson.plugins.toolenv.ToolEnvBuildWrapper$1.buildEnvVars(ToolEnvBuildWrapper.java:46)
	at hudson.model.AbstractBuild.getEnvironment(AbstractBuild.java:931)
	at hudson.plugins.git.GitSCM.getParamExpandedRepos(GitSCM.java:404)
	at hudson.plugins.git.GitSCM.compareRemoteRevisionWithImpl(GitSCM.java:609)
	at hudson.plugins.git.GitSCM.compareRemoteRevisionWith(GitSCM.java:574)
	at hudson.scm.SCM.compareRemoteRevisionWith(SCM.java:381)
	at hudson.scm.SCM.poll(SCM.java:398)
	at hudson.model.AbstractProject._poll(AbstractProject.java:1446)
	at hudson.model.AbstractProject.poll(AbstractProject.java:1349)
	at hudson.triggers.SCMTrigger$Runner.runPolling(SCMTrigger.java:528)
	at hudson.triggers.SCMTrigger$Runner.run(SCMTrigger.java:557)
	at hudson.util.SequentialExecutionQueue$QueueEntry.run(SequentialExecutionQueue.java:119)
	at java.util.concurrent.Executors$RunnableAdapter.call(Executors.java:511)
	at java.util.concurrent.FutureTask.run(FutureTask.java:266)
	at java.util.concurrent.ThreadPoolExecutor.runWorker(ThreadPoolExecutor.java:1142)
	at java.util.concurrent.ThreadPoolExecutor$Worker.run(ThreadPoolExecutor.java:617)
	at java.lang.Thread.run(Thread.java:745)
Build timed out (after 180 minutes). Marking the build as failed.
Build was aborted
Recording test results
Setting GRADLE_2_4_RC_2_HOME=/home/jenkins/jenkins-slave/tools/hudson.plugins.gradle.GradleInstallation/Gradle_2.4-rc-2
Setting GRADLE_2_4_RC_2_HOME=/home/jenkins/jenkins-slave/tools/hudson.plugins.gradle.GradleInstallation/Gradle_2.4-rc-2

Build failed in Jenkins: kafka-trunk-jdk8 #1013

Posted by Apache Jenkins Server <je...@builds.apache.org>.
See <https://builds.apache.org/job/kafka-trunk-jdk8/1013/changes>

Changes:

[wangguoz] KAFKA-4361: Streams does not respect user configs for "default" params

[wangguoz] KAFKA-4352: instable ResetTool integration test

------------------------------------------
[...truncated 14363 lines...]
org.apache.kafka.streams.processor.internals.StreamPartitionAssignorTest > testSubscription PASSED

org.apache.kafka.streams.processor.internals.StreamPartitionAssignorTest > shouldSetClusterMetadataOnAssignment STARTED

org.apache.kafka.streams.processor.internals.StreamPartitionAssignorTest > shouldSetClusterMetadataOnAssignment PASSED

org.apache.kafka.streams.processor.internals.StreamPartitionAssignorTest > testAssignWithInternalTopics STARTED

org.apache.kafka.streams.processor.internals.StreamPartitionAssignorTest > testAssignWithInternalTopics PASSED

org.apache.kafka.streams.processor.internals.RecordCollectorTest > testSpecificPartition STARTED

org.apache.kafka.streams.processor.internals.RecordCollectorTest > testSpecificPartition PASSED

org.apache.kafka.streams.processor.internals.RecordCollectorTest > shouldThrowStreamsExceptionAfterMaxAttempts STARTED

org.apache.kafka.streams.processor.internals.RecordCollectorTest > shouldThrowStreamsExceptionAfterMaxAttempts PASSED

org.apache.kafka.streams.processor.internals.RecordCollectorTest > shouldRetryWhenTimeoutExceptionOccursOnSend STARTED

org.apache.kafka.streams.processor.internals.RecordCollectorTest > shouldRetryWhenTimeoutExceptionOccursOnSend PASSED

org.apache.kafka.streams.processor.internals.RecordCollectorTest > testStreamPartitioner STARTED

org.apache.kafka.streams.processor.internals.RecordCollectorTest > testStreamPartitioner PASSED

org.apache.kafka.streams.processor.internals.InternalTopicConfigTest > shouldHaveCompactionPropSetIfSupplied STARTED

org.apache.kafka.streams.processor.internals.InternalTopicConfigTest > shouldHaveCompactionPropSetIfSupplied PASSED

org.apache.kafka.streams.processor.internals.InternalTopicConfigTest > shouldThrowIfNameIsNull STARTED

org.apache.kafka.streams.processor.internals.InternalTopicConfigTest > shouldThrowIfNameIsNull PASSED

org.apache.kafka.streams.processor.internals.InternalTopicConfigTest > shouldConfigureRetentionMsWithAdditionalRetentionWhenCompactAndDelete STARTED

org.apache.kafka.streams.processor.internals.InternalTopicConfigTest > shouldConfigureRetentionMsWithAdditionalRetentionWhenCompactAndDelete PASSED

org.apache.kafka.streams.processor.internals.InternalTopicConfigTest > shouldBeCompactedIfCleanupPolicyCompactOrCompactAndDelete STARTED

org.apache.kafka.streams.processor.internals.InternalTopicConfigTest > shouldBeCompactedIfCleanupPolicyCompactOrCompactAndDelete PASSED

org.apache.kafka.streams.processor.internals.InternalTopicConfigTest > shouldNotBeCompactedWhenCleanupPolicyIsDelete STARTED

org.apache.kafka.streams.processor.internals.InternalTopicConfigTest > shouldNotBeCompactedWhenCleanupPolicyIsDelete PASSED

org.apache.kafka.streams.processor.internals.InternalTopicConfigTest > shouldHavePropertiesSuppliedByUser STARTED

org.apache.kafka.streams.processor.internals.InternalTopicConfigTest > shouldHavePropertiesSuppliedByUser PASSED

org.apache.kafka.streams.processor.internals.InternalTopicConfigTest > shouldUseCleanupPolicyFromConfigIfSupplied STARTED

org.apache.kafka.streams.processor.internals.InternalTopicConfigTest > shouldUseCleanupPolicyFromConfigIfSupplied PASSED

org.apache.kafka.streams.processor.internals.InternalTopicConfigTest > shouldNotConfigureRetentionMsWhenCompact STARTED

org.apache.kafka.streams.processor.internals.InternalTopicConfigTest > shouldNotConfigureRetentionMsWhenCompact PASSED

org.apache.kafka.streams.processor.internals.InternalTopicConfigTest > shouldNotConfigureRetentionMsWhenDelete STARTED

org.apache.kafka.streams.processor.internals.InternalTopicConfigTest > shouldNotConfigureRetentionMsWhenDelete PASSED

org.apache.kafka.streams.processor.TopologyBuilderTest > shouldNotAllowNullProcessorSupplier STARTED

org.apache.kafka.streams.processor.TopologyBuilderTest > shouldNotAllowNullProcessorSupplier PASSED

org.apache.kafka.streams.processor.TopologyBuilderTest > shouldNotSetApplicationIdToNull STARTED

org.apache.kafka.streams.processor.TopologyBuilderTest > shouldNotSetApplicationIdToNull PASSED

org.apache.kafka.streams.processor.TopologyBuilderTest > testSourceTopics STARTED

org.apache.kafka.streams.processor.TopologyBuilderTest > testSourceTopics PASSED

org.apache.kafka.streams.processor.TopologyBuilderTest > shouldNotAllowNullNameWhenAddingSink STARTED

org.apache.kafka.streams.processor.TopologyBuilderTest > shouldNotAllowNullNameWhenAddingSink PASSED

org.apache.kafka.streams.processor.TopologyBuilderTest > testNamedTopicMatchesAlreadyProvidedPattern STARTED

org.apache.kafka.streams.processor.TopologyBuilderTest > testNamedTopicMatchesAlreadyProvidedPattern PASSED

org.apache.kafka.streams.processor.TopologyBuilderTest > shouldAddInternalTopicConfigWithCompactAndDeleteSetForWindowStores STARTED

org.apache.kafka.streams.processor.TopologyBuilderTest > shouldAddInternalTopicConfigWithCompactAndDeleteSetForWindowStores PASSED

org.apache.kafka.streams.processor.TopologyBuilderTest > shouldAddInternalTopicConfigWithCompactForNonWindowStores STARTED

org.apache.kafka.streams.processor.TopologyBuilderTest > shouldAddInternalTopicConfigWithCompactForNonWindowStores PASSED

org.apache.kafka.streams.processor.TopologyBuilderTest > testAddSinkWithSameName STARTED

org.apache.kafka.streams.processor.TopologyBuilderTest > testAddSinkWithSameName PASSED

org.apache.kafka.streams.processor.TopologyBuilderTest > testAddSinkWithSelfParent STARTED

org.apache.kafka.streams.processor.TopologyBuilderTest > testAddSinkWithSelfParent PASSED

org.apache.kafka.streams.processor.TopologyBuilderTest > testAddProcessorWithSelfParent STARTED

org.apache.kafka.streams.processor.TopologyBuilderTest > testAddProcessorWithSelfParent PASSED

org.apache.kafka.streams.processor.TopologyBuilderTest > shouldAssociateStateStoreNameWhenStateStoreSupplierIsInternal STARTED

org.apache.kafka.streams.processor.TopologyBuilderTest > shouldAssociateStateStoreNameWhenStateStoreSupplierIsInternal PASSED

org.apache.kafka.streams.processor.TopologyBuilderTest > testAddStateStoreWithSink STARTED

org.apache.kafka.streams.processor.TopologyBuilderTest > testAddStateStoreWithSink PASSED

org.apache.kafka.streams.processor.TopologyBuilderTest > testTopicGroups STARTED

org.apache.kafka.streams.processor.TopologyBuilderTest > testTopicGroups PASSED

org.apache.kafka.streams.processor.TopologyBuilderTest > testBuild STARTED

org.apache.kafka.streams.processor.TopologyBuilderTest > testBuild PASSED

org.apache.kafka.streams.processor.TopologyBuilderTest > shouldNotAddNullStateStoreSupplier STARTED

org.apache.kafka.streams.processor.TopologyBuilderTest > shouldNotAddNullStateStoreSupplier PASSED

org.apache.kafka.streams.processor.TopologyBuilderTest > shouldNotAllowNullNameWhenAddingSource STARTED

org.apache.kafka.streams.processor.TopologyBuilderTest > shouldNotAllowNullNameWhenAddingSource PASSED

org.apache.kafka.streams.processor.TopologyBuilderTest > shouldNotAllowNullTopicWhenAddingSink STARTED

org.apache.kafka.streams.processor.TopologyBuilderTest > shouldNotAllowNullTopicWhenAddingSink PASSED

org.apache.kafka.streams.processor.TopologyBuilderTest > testAddStateStoreWithSource STARTED

org.apache.kafka.streams.processor.TopologyBuilderTest > testAddStateStoreWithSource PASSED

org.apache.kafka.streams.processor.TopologyBuilderTest > shouldThroughOnUnassignedStateStoreAccess STARTED

org.apache.kafka.streams.processor.TopologyBuilderTest > shouldThroughOnUnassignedStateStoreAccess PASSED

org.apache.kafka.streams.processor.TopologyBuilderTest > shouldNotAllowNullProcessorNameWhenConnectingProcessorAndStateStores STARTED

org.apache.kafka.streams.processor.TopologyBuilderTest > shouldNotAllowNullProcessorNameWhenConnectingProcessorAndStateStores PASSED

org.apache.kafka.streams.processor.TopologyBuilderTest > testAddSourceWithSameName STARTED

org.apache.kafka.streams.processor.TopologyBuilderTest > testAddSourceWithSameName PASSED

org.apache.kafka.streams.processor.TopologyBuilderTest > testAddMoreThanOnePatternSourceNode STARTED

org.apache.kafka.streams.processor.TopologyBuilderTest > testAddMoreThanOnePatternSourceNode PASSED

org.apache.kafka.streams.processor.TopologyBuilderTest > testAddProcessorWithSameName STARTED

org.apache.kafka.streams.processor.TopologyBuilderTest > testAddProcessorWithSameName PASSED

org.apache.kafka.streams.processor.TopologyBuilderTest > shouldSetCorrectSourceNodesWithRegexUpdatedTopics STARTED

org.apache.kafka.streams.processor.TopologyBuilderTest > shouldSetCorrectSourceNodesWithRegexUpdatedTopics PASSED

org.apache.kafka.streams.processor.TopologyBuilderTest > testAddSourceWithSameTopic STARTED

org.apache.kafka.streams.processor.TopologyBuilderTest > testAddSourceWithSameTopic PASSED

org.apache.kafka.streams.processor.TopologyBuilderTest > testTopicGroupsByStateStore STARTED

org.apache.kafka.streams.processor.TopologyBuilderTest > testTopicGroupsByStateStore PASSED

org.apache.kafka.streams.processor.TopologyBuilderTest > testAddStateStoreWithDuplicates STARTED

org.apache.kafka.streams.processor.TopologyBuilderTest > testAddStateStoreWithDuplicates PASSED

org.apache.kafka.streams.processor.TopologyBuilderTest > testPatternSourceTopic STARTED

org.apache.kafka.streams.processor.TopologyBuilderTest > testPatternSourceTopic PASSED

org.apache.kafka.streams.processor.TopologyBuilderTest > shouldAssociateStateStoreNameWhenStateStoreSupplierIsExternal STARTED

org.apache.kafka.streams.processor.TopologyBuilderTest > shouldAssociateStateStoreNameWhenStateStoreSupplierIsExternal PASSED

org.apache.kafka.streams.processor.TopologyBuilderTest > testAddSinkWithWrongParent STARTED

org.apache.kafka.streams.processor.TopologyBuilderTest > testAddSinkWithWrongParent PASSED

org.apache.kafka.streams.processor.TopologyBuilderTest > testPatternMatchesAlreadyProvidedTopicSource STARTED

org.apache.kafka.streams.processor.TopologyBuilderTest > testPatternMatchesAlreadyProvidedTopicSource PASSED

org.apache.kafka.streams.processor.TopologyBuilderTest > testAddSinkConnectedWithMultipleParent STARTED

org.apache.kafka.streams.processor.TopologyBuilderTest > testAddSinkConnectedWithMultipleParent PASSED

org.apache.kafka.streams.processor.TopologyBuilderTest > testSubscribeTopicNameAndPattern STARTED

org.apache.kafka.streams.processor.TopologyBuilderTest > testSubscribeTopicNameAndPattern PASSED

org.apache.kafka.streams.processor.TopologyBuilderTest > shouldNotAddNullInternalTopic STARTED

org.apache.kafka.streams.processor.TopologyBuilderTest > shouldNotAddNullInternalTopic PASSED

org.apache.kafka.streams.processor.TopologyBuilderTest > testAddProcessorWithWrongParent STARTED

org.apache.kafka.streams.processor.TopologyBuilderTest > testAddProcessorWithWrongParent PASSED

org.apache.kafka.streams.processor.TopologyBuilderTest > shouldNotAllowNullNameWhenAddingProcessor STARTED

org.apache.kafka.streams.processor.TopologyBuilderTest > shouldNotAllowNullNameWhenAddingProcessor PASSED

org.apache.kafka.streams.processor.TopologyBuilderTest > testAddStateStore STARTED

org.apache.kafka.streams.processor.TopologyBuilderTest > testAddStateStore PASSED

org.apache.kafka.streams.processor.TopologyBuilderTest > testAddSinkConnectedWithParent STARTED

org.apache.kafka.streams.processor.TopologyBuilderTest > testAddSinkConnectedWithParent PASSED

org.apache.kafka.streams.processor.TopologyBuilderTest > testAddStateStoreWithNonExistingProcessor STARTED

org.apache.kafka.streams.processor.TopologyBuilderTest > testAddStateStoreWithNonExistingProcessor PASSED

org.apache.kafka.streams.processor.TopologyBuilderTest > shouldAddInternalTopicConfigWithCleanupPolicyDeleteForInternalTopics STARTED

org.apache.kafka.streams.processor.TopologyBuilderTest > shouldAddInternalTopicConfigWithCleanupPolicyDeleteForInternalTopics PASSED

org.apache.kafka.streams.processor.TopologyBuilderTest > shouldCorrectlyMapStateStoreToInternalTopics STARTED

org.apache.kafka.streams.processor.TopologyBuilderTest > shouldCorrectlyMapStateStoreToInternalTopics PASSED

org.apache.kafka.streams.KeyValueTest > shouldHaveSaneEqualsAndHashCode STARTED

org.apache.kafka.streams.KeyValueTest > shouldHaveSaneEqualsAndHashCode PASSED

516 tests completed, 1 failed
:streams:test FAILED

FAILURE: Build failed with an exception.

* What went wrong:
Execution failed for task ':streams:test'.
> There were failing tests. See the report at: file://<https://builds.apache.org/job/kafka-trunk-jdk8/ws/streams/build/reports/tests/test/index.html>

* Try:
Run with --stacktrace option to get the stack trace. Run with --info or --debug option to get more log output.

BUILD FAILED

Total time: 2 hrs 49 mins 36.252 secs
Build step 'Execute shell' marked build as failure
Recording test results
Setting GRADLE_2_4_RC_2_HOME=/home/jenkins/jenkins-slave/tools/hudson.plugins.gradle.GradleInstallation/Gradle_2.4-rc-2
Setting GRADLE_2_4_RC_2_HOME=/home/jenkins/jenkins-slave/tools/hudson.plugins.gradle.GradleInstallation/Gradle_2.4-rc-2

Build failed in Jenkins: kafka-trunk-jdk8 #1012

Posted by Apache Jenkins Server <je...@builds.apache.org>.
See <https://builds.apache.org/job/kafka-trunk-jdk8/1012/changes>

Changes:

[jason] MINOR: Fix issue in `AsyncProducerTest` where it expects the `port`

------------------------------------------
[...truncated 14592 lines...]
org.apache.kafka.streams.processor.internals.AbstractTaskTest > shouldThrowProcessorStateExceptionOnInitializeOffsetsWhenKafkaException PASSED

org.apache.kafka.streams.processor.internals.AbstractTaskTest > shouldThrowWakeupExceptionOnInitializeOffsetsWhenWakeupException STARTED

org.apache.kafka.streams.processor.internals.AbstractTaskTest > shouldThrowWakeupExceptionOnInitializeOffsetsWhenWakeupException PASSED

org.apache.kafka.streams.processor.internals.StreamPartitionAssignorTest > shouldThrowExceptionIfApplicationServerConfigIsNotHostPortPair STARTED

org.apache.kafka.streams.processor.internals.StreamPartitionAssignorTest > shouldThrowExceptionIfApplicationServerConfigIsNotHostPortPair PASSED

org.apache.kafka.streams.processor.internals.StreamPartitionAssignorTest > shouldMapUserEndPointToTopicPartitions STARTED

org.apache.kafka.streams.processor.internals.StreamPartitionAssignorTest > shouldMapUserEndPointToTopicPartitions PASSED

org.apache.kafka.streams.processor.internals.StreamPartitionAssignorTest > shouldAddUserDefinedEndPointToSubscription STARTED

org.apache.kafka.streams.processor.internals.StreamPartitionAssignorTest > shouldAddUserDefinedEndPointToSubscription PASSED

org.apache.kafka.streams.processor.internals.StreamPartitionAssignorTest > testAssignWithStandbyReplicas STARTED

org.apache.kafka.streams.processor.internals.StreamPartitionAssignorTest > testAssignWithStandbyReplicas PASSED

org.apache.kafka.streams.processor.internals.StreamPartitionAssignorTest > testAssignWithNewTasks STARTED

org.apache.kafka.streams.processor.internals.StreamPartitionAssignorTest > testAssignWithNewTasks PASSED

org.apache.kafka.streams.processor.internals.StreamPartitionAssignorTest > shouldExposeHostStateToTopicPartitionsOnAssignment STARTED

org.apache.kafka.streams.processor.internals.StreamPartitionAssignorTest > shouldExposeHostStateToTopicPartitionsOnAssignment PASSED

org.apache.kafka.streams.processor.internals.StreamPartitionAssignorTest > testAssignWithStates STARTED

org.apache.kafka.streams.processor.internals.StreamPartitionAssignorTest > testAssignWithStates PASSED

org.apache.kafka.streams.processor.internals.StreamPartitionAssignorTest > shouldThrowExceptionIfApplicationServerConfigPortIsNotAnInteger STARTED

org.apache.kafka.streams.processor.internals.StreamPartitionAssignorTest > shouldThrowExceptionIfApplicationServerConfigPortIsNotAnInteger PASSED

org.apache.kafka.streams.processor.internals.StreamPartitionAssignorTest > shouldReturnEmptyClusterMetadataIfItHasntBeenBuilt STARTED

org.apache.kafka.streams.processor.internals.StreamPartitionAssignorTest > shouldReturnEmptyClusterMetadataIfItHasntBeenBuilt PASSED

org.apache.kafka.streams.processor.internals.StreamPartitionAssignorTest > testAssignBasic STARTED

org.apache.kafka.streams.processor.internals.StreamPartitionAssignorTest > testAssignBasic PASSED

org.apache.kafka.streams.processor.internals.StreamPartitionAssignorTest > testOnAssignment STARTED

org.apache.kafka.streams.processor.internals.StreamPartitionAssignorTest > testOnAssignment PASSED

org.apache.kafka.streams.processor.internals.StreamPartitionAssignorTest > testAssignWithInternalTopicThatsSourceIsAnotherInternalTopic STARTED

org.apache.kafka.streams.processor.internals.StreamPartitionAssignorTest > testAssignWithInternalTopicThatsSourceIsAnotherInternalTopic PASSED

org.apache.kafka.streams.processor.internals.StreamPartitionAssignorTest > testSubscription STARTED

org.apache.kafka.streams.processor.internals.StreamPartitionAssignorTest > testSubscription PASSED

org.apache.kafka.streams.processor.internals.StreamPartitionAssignorTest > shouldSetClusterMetadataOnAssignment STARTED

org.apache.kafka.streams.processor.internals.StreamPartitionAssignorTest > shouldSetClusterMetadataOnAssignment PASSED

org.apache.kafka.streams.processor.internals.StreamPartitionAssignorTest > testAssignWithInternalTopics STARTED

org.apache.kafka.streams.processor.internals.StreamPartitionAssignorTest > testAssignWithInternalTopics PASSED

org.apache.kafka.streams.processor.TopologyBuilderTest > shouldNotAllowNullProcessorSupplier STARTED

org.apache.kafka.streams.processor.TopologyBuilderTest > shouldNotAllowNullProcessorSupplier PASSED

org.apache.kafka.streams.processor.TopologyBuilderTest > shouldNotSetApplicationIdToNull STARTED

org.apache.kafka.streams.processor.TopologyBuilderTest > shouldNotSetApplicationIdToNull PASSED

org.apache.kafka.streams.processor.TopologyBuilderTest > testSourceTopics STARTED

org.apache.kafka.streams.processor.TopologyBuilderTest > testSourceTopics PASSED

org.apache.kafka.streams.processor.TopologyBuilderTest > shouldNotAllowNullNameWhenAddingSink STARTED

org.apache.kafka.streams.processor.TopologyBuilderTest > shouldNotAllowNullNameWhenAddingSink PASSED

org.apache.kafka.streams.processor.TopologyBuilderTest > testNamedTopicMatchesAlreadyProvidedPattern STARTED

org.apache.kafka.streams.processor.TopologyBuilderTest > testNamedTopicMatchesAlreadyProvidedPattern PASSED

org.apache.kafka.streams.processor.TopologyBuilderTest > shouldAddInternalTopicConfigWithCompactAndDeleteSetForWindowStores STARTED

org.apache.kafka.streams.processor.TopologyBuilderTest > shouldAddInternalTopicConfigWithCompactAndDeleteSetForWindowStores PASSED

org.apache.kafka.streams.processor.TopologyBuilderTest > shouldAddInternalTopicConfigWithCompactForNonWindowStores STARTED

org.apache.kafka.streams.processor.TopologyBuilderTest > shouldAddInternalTopicConfigWithCompactForNonWindowStores PASSED

org.apache.kafka.streams.processor.TopologyBuilderTest > testAddSinkWithSameName STARTED

org.apache.kafka.streams.processor.TopologyBuilderTest > testAddSinkWithSameName PASSED

org.apache.kafka.streams.processor.TopologyBuilderTest > testAddSinkWithSelfParent STARTED

org.apache.kafka.streams.processor.TopologyBuilderTest > testAddSinkWithSelfParent PASSED

org.apache.kafka.streams.processor.TopologyBuilderTest > testAddProcessorWithSelfParent STARTED

org.apache.kafka.streams.processor.TopologyBuilderTest > testAddProcessorWithSelfParent PASSED

org.apache.kafka.streams.processor.TopologyBuilderTest > shouldAssociateStateStoreNameWhenStateStoreSupplierIsInternal STARTED

org.apache.kafka.streams.processor.TopologyBuilderTest > shouldAssociateStateStoreNameWhenStateStoreSupplierIsInternal PASSED

org.apache.kafka.streams.processor.TopologyBuilderTest > testAddStateStoreWithSink STARTED

org.apache.kafka.streams.processor.TopologyBuilderTest > testAddStateStoreWithSink PASSED

org.apache.kafka.streams.processor.TopologyBuilderTest > testTopicGroups STARTED

org.apache.kafka.streams.processor.TopologyBuilderTest > testTopicGroups PASSED

org.apache.kafka.streams.processor.TopologyBuilderTest > testBuild STARTED

org.apache.kafka.streams.processor.TopologyBuilderTest > testBuild PASSED

org.apache.kafka.streams.processor.TopologyBuilderTest > shouldNotAddNullStateStoreSupplier STARTED

org.apache.kafka.streams.processor.TopologyBuilderTest > shouldNotAddNullStateStoreSupplier PASSED

org.apache.kafka.streams.processor.TopologyBuilderTest > shouldNotAllowNullNameWhenAddingSource STARTED

org.apache.kafka.streams.processor.TopologyBuilderTest > shouldNotAllowNullNameWhenAddingSource PASSED

org.apache.kafka.streams.processor.TopologyBuilderTest > shouldNotAllowNullTopicWhenAddingSink STARTED

org.apache.kafka.streams.processor.TopologyBuilderTest > shouldNotAllowNullTopicWhenAddingSink PASSED

org.apache.kafka.streams.processor.TopologyBuilderTest > testAddStateStoreWithSource STARTED

org.apache.kafka.streams.processor.TopologyBuilderTest > testAddStateStoreWithSource PASSED

org.apache.kafka.streams.processor.TopologyBuilderTest > shouldThroughOnUnassignedStateStoreAccess STARTED

org.apache.kafka.streams.processor.TopologyBuilderTest > shouldThroughOnUnassignedStateStoreAccess PASSED

org.apache.kafka.streams.processor.TopologyBuilderTest > shouldNotAllowNullProcessorNameWhenConnectingProcessorAndStateStores STARTED

org.apache.kafka.streams.processor.TopologyBuilderTest > shouldNotAllowNullProcessorNameWhenConnectingProcessorAndStateStores PASSED

org.apache.kafka.streams.processor.TopologyBuilderTest > testAddSourceWithSameName STARTED

org.apache.kafka.streams.processor.TopologyBuilderTest > testAddSourceWithSameName PASSED

org.apache.kafka.streams.processor.TopologyBuilderTest > testAddMoreThanOnePatternSourceNode STARTED

org.apache.kafka.streams.processor.TopologyBuilderTest > testAddMoreThanOnePatternSourceNode PASSED

org.apache.kafka.streams.processor.TopologyBuilderTest > testAddProcessorWithSameName STARTED

org.apache.kafka.streams.processor.TopologyBuilderTest > testAddProcessorWithSameName PASSED

org.apache.kafka.streams.processor.TopologyBuilderTest > shouldSetCorrectSourceNodesWithRegexUpdatedTopics STARTED

org.apache.kafka.streams.processor.TopologyBuilderTest > shouldSetCorrectSourceNodesWithRegexUpdatedTopics PASSED

org.apache.kafka.streams.processor.TopologyBuilderTest > testAddSourceWithSameTopic STARTED

org.apache.kafka.streams.processor.TopologyBuilderTest > testAddSourceWithSameTopic PASSED

org.apache.kafka.streams.processor.TopologyBuilderTest > testTopicGroupsByStateStore STARTED

org.apache.kafka.streams.processor.TopologyBuilderTest > testTopicGroupsByStateStore PASSED

org.apache.kafka.streams.processor.TopologyBuilderTest > testAddStateStoreWithDuplicates STARTED

org.apache.kafka.streams.processor.TopologyBuilderTest > testAddStateStoreWithDuplicates PASSED

org.apache.kafka.streams.processor.TopologyBuilderTest > testPatternSourceTopic STARTED

org.apache.kafka.streams.processor.TopologyBuilderTest > testPatternSourceTopic PASSED

org.apache.kafka.streams.processor.TopologyBuilderTest > shouldAssociateStateStoreNameWhenStateStoreSupplierIsExternal STARTED

org.apache.kafka.streams.processor.TopologyBuilderTest > shouldAssociateStateStoreNameWhenStateStoreSupplierIsExternal PASSED

org.apache.kafka.streams.processor.TopologyBuilderTest > testAddSinkWithWrongParent STARTED

org.apache.kafka.streams.processor.TopologyBuilderTest > testAddSinkWithWrongParent PASSED

org.apache.kafka.streams.processor.TopologyBuilderTest > testPatternMatchesAlreadyProvidedTopicSource STARTED

org.apache.kafka.streams.processor.TopologyBuilderTest > testPatternMatchesAlreadyProvidedTopicSource PASSED

org.apache.kafka.streams.processor.TopologyBuilderTest > testAddSinkConnectedWithMultipleParent STARTED

org.apache.kafka.streams.processor.TopologyBuilderTest > testAddSinkConnectedWithMultipleParent PASSED

org.apache.kafka.streams.processor.TopologyBuilderTest > testSubscribeTopicNameAndPattern STARTED

org.apache.kafka.streams.processor.TopologyBuilderTest > testSubscribeTopicNameAndPattern PASSED

org.apache.kafka.streams.processor.TopologyBuilderTest > shouldNotAddNullInternalTopic STARTED

org.apache.kafka.streams.processor.TopologyBuilderTest > shouldNotAddNullInternalTopic PASSED

org.apache.kafka.streams.processor.TopologyBuilderTest > testAddProcessorWithWrongParent STARTED

org.apache.kafka.streams.processor.TopologyBuilderTest > testAddProcessorWithWrongParent PASSED

org.apache.kafka.streams.processor.TopologyBuilderTest > shouldNotAllowNullNameWhenAddingProcessor STARTED

org.apache.kafka.streams.processor.TopologyBuilderTest > shouldNotAllowNullNameWhenAddingProcessor PASSED

org.apache.kafka.streams.processor.TopologyBuilderTest > testAddStateStore STARTED

org.apache.kafka.streams.processor.TopologyBuilderTest > testAddStateStore PASSED

org.apache.kafka.streams.processor.TopologyBuilderTest > testAddSinkConnectedWithParent STARTED

org.apache.kafka.streams.processor.TopologyBuilderTest > testAddSinkConnectedWithParent PASSED

org.apache.kafka.streams.processor.TopologyBuilderTest > testAddStateStoreWithNonExistingProcessor STARTED

org.apache.kafka.streams.processor.TopologyBuilderTest > testAddStateStoreWithNonExistingProcessor PASSED

org.apache.kafka.streams.processor.TopologyBuilderTest > shouldAddInternalTopicConfigWithCleanupPolicyDeleteForInternalTopics STARTED

org.apache.kafka.streams.processor.TopologyBuilderTest > shouldAddInternalTopicConfigWithCleanupPolicyDeleteForInternalTopics PASSED

org.apache.kafka.streams.processor.TopologyBuilderTest > shouldCorrectlyMapStateStoreToInternalTopics STARTED

org.apache.kafka.streams.processor.TopologyBuilderTest > shouldCorrectlyMapStateStoreToInternalTopics PASSED

511 tests completed, 1 failed
:streams:test FAILED

FAILURE: Build failed with an exception.

* What went wrong:
Execution failed for task ':streams:test'.
> There were failing tests. See the report at: file://<https://builds.apache.org/job/kafka-trunk-jdk8/ws/streams/build/reports/tests/test/index.html>

* Try:
Run with --stacktrace option to get the stack trace. Run with --info or --debug option to get more log output.

BUILD FAILED

Total time: 1 hrs 16 mins 34.901 secs
Build step 'Execute shell' marked build as failure
Recording test results
Setting GRADLE_2_4_RC_2_HOME=/home/jenkins/jenkins-slave/tools/hudson.plugins.gradle.GradleInstallation/Gradle_2.4-rc-2
Setting GRADLE_2_4_RC_2_HOME=/home/jenkins/jenkins-slave/tools/hudson.plugins.gradle.GradleInstallation/Gradle_2.4-rc-2