You are viewing a plain text version of this content. The canonical link for it is here.
Posted to builds@solr.apache.org by Policeman Jenkins Server <je...@thetaphi.de> on 2025/08/26 16:00:43 UTC
[JENKINS] Solr-main-Linux (64bit/hotspot/jdk-24) - Build # 28151 - Still Unstable!
Build: https://jenkins.thetaphi.de/job/Solr-main-Linux/28151/
Java: 64bit/hotspot/jdk-24 -XX:+UseCompressedOops -XX:+UseG1GC
1 tests failed.
FAILED: org.apache.solr.cloud.TestDistribDocBasedVersion.testPullReplica
Error Message:
com.carrotsearch.randomizedtesting.UncaughtExceptionError: Captured an uncaught exception in thread: Thread[id=5578, name=updateExecutor-2962-thread-1, state=RUNNABLE, group=TGRP-TestDistribDocBasedVersion]
Stack Trace:
com.carrotsearch.randomizedtesting.UncaughtExceptionError: Captured an uncaught exception in thread: Thread[id=5578, name=updateExecutor-2962-thread-1, state=RUNNABLE, group=TGRP-TestDistribDocBasedVersion]
at __randomizedtesting.SeedInfo.seed([BD218C0F1BD3BAA9:F59D1BC1BE0193D0]:0)
Caused by: org.apache.solr.common.SolrException: java.util.concurrent.ExecutionException: org.apache.solr.common.cloud.ZooKeeperException:
at __randomizedtesting.SeedInfo.seed([BD218C0F1BD3BAA9]:0)
at app//org.apache.solr.update.DefaultSolrCoreState$2.run(DefaultSolrCoreState.java:356)
at app//com.codahale.metrics.InstrumentedExecutorService$InstrumentedRunnable.run(InstrumentedExecutorService.java:212)
at app//org.apache.solr.common.util.ExecutorUtil$MDCAwareThreadPoolExecutor.lambda$execute$0(ExecutorUtil.java:381)
at java.base@24/java.util.concurrent.ThreadPoolExecutor.runWorker(ThreadPoolExecutor.java:1095)
at java.base@24/java.util.concurrent.ThreadPoolExecutor$Worker.run(ThreadPoolExecutor.java:619)
at java.base@24/java.lang.Thread.run(Thread.java:1447)
Caused by: java.util.concurrent.ExecutionException: org.apache.solr.common.cloud.ZooKeeperException:
at java.base/java.util.concurrent.FutureTask.report(FutureTask.java:124)
at java.base/java.util.concurrent.FutureTask.get(FutureTask.java:193)
at org.apache.solr.update.DefaultSolrCoreState$2.run(DefaultSolrCoreState.java:351)
... 5 more
Caused by: org.apache.solr.common.cloud.ZooKeeperException:
at app//org.apache.solr.cloud.RecoveryStrategy.run(RecoveryStrategy.java:330)
at app//com.codahale.metrics.InstrumentedExecutorService$InstrumentedRunnable.run(InstrumentedExecutorService.java:212)
at java.base@24/java.util.concurrent.Executors$RunnableAdapter.call(Executors.java:545)
at java.base@24/java.util.concurrent.FutureTask.run(FutureTask.java:328)
... 4 more
Caused by: org.apache.solr.common.SolrException: SolrCore not found:collection1_shard1_replica_p5 in [control_collection_shard1_replica_n1]
at app//org.apache.solr.cloud.ReplicateFromLeader.startReplication(ReplicateFromLeader.java:75)
at app//org.apache.solr.cloud.ZkController.startReplicationFromLeader(ZkController.java:1538)
at app//org.apache.solr.cloud.RecoveryStrategy.doReplicateOnlyRecovery(RecoveryStrategy.java:431)
at app//org.apache.solr.cloud.RecoveryStrategy.doRecovery(RecoveryStrategy.java:349)
at app//org.apache.solr.cloud.RecoveryStrategy.run(RecoveryStrategy.java:323)
... 7 more
[JENKINS] Solr-main-Linux (64bit/hotspot/jdk-21.0.6) - Build # 28152 - Still Unstable!
Posted by Policeman Jenkins Server <je...@thetaphi.de>.
Build: https://jenkins.thetaphi.de/job/Solr-main-Linux/28152/
Java: 64bit/hotspot/jdk-21.0.6 -XX:+UseCompressedOops -XX:+UseG1GC
1 tests failed.
FAILED: org.apache.solr.cloud.BasicDistributedZk2Test.test
Error Message:
org.apache.solr.client.solrj.SolrClient$RemoteSolrException: Error from server at http://127.0.0.1:38287/solr: Cannot talk to ZooKeeper - Updates are disabled.
Stack Trace:
org.apache.solr.client.solrj.SolrClient$RemoteSolrException: Error from server at http://127.0.0.1:38287/solr: Cannot talk to ZooKeeper - Updates are disabled.
at __randomizedtesting.SeedInfo.seed([E4EC8E6FBA5ADB47:6CB8B1B514A6B6BF]:0)
at app//org.apache.solr.client.solrj.impl.HttpSolrClient.executeMethod(HttpSolrClient.java:708)
at app//org.apache.solr.client.solrj.impl.HttpSolrClient.request(HttpSolrClient.java:250)
at app//org.apache.solr.client.solrj.impl.HttpSolrClient.request(HttpSolrClient.java:229)
at app//org.apache.solr.client.solrj.impl.LBSolrClient.doRequest(LBSolrClient.java:515)
at app//org.apache.solr.client.solrj.impl.LBSolrClient.doRequest(LBSolrClient.java:497)
at app//org.apache.solr.client.solrj.impl.LBSolrClient.doRequest(LBSolrClient.java:524)
at app//org.apache.solr.client.solrj.impl.LBSolrClient.request(LBSolrClient.java:466)
at app//org.apache.solr.client.solrj.impl.CloudSolrClient.sendRequest(CloudSolrClient.java:1151)
at app//org.apache.solr.client.solrj.impl.CloudSolrClient.requestWithRetryOnStaleState(CloudSolrClient.java:844)
at app//org.apache.solr.client.solrj.impl.CloudSolrClient.request(CloudSolrClient.java:775)
at app//org.apache.solr.client.solrj.SolrRequest.process(SolrRequest.java:285)
at app//org.apache.solr.client.solrj.SolrRequest.process(SolrRequest.java:305)
at app//org.apache.solr.cloud.AbstractFullDistribZkTestBase.indexDoc(AbstractFullDistribZkTestBase.java:1098)
at app//org.apache.solr.BaseDistributedSearchTestCase.indexr(BaseDistributedSearchTestCase.java:466)
at app//org.apache.solr.cloud.AbstractBasicDistributedZk2TestBase.test(AbstractBasicDistributedZk2TestBase.java:161)
at app//org.apache.solr.cloud.BasicDistributedZk2Test.test(BasicDistributedZk2Test.java:34)
at java.base@21.0.6/jdk.internal.reflect.DirectMethodHandleAccessor.invoke(DirectMethodHandleAccessor.java:103)
at java.base@21.0.6/java.lang.reflect.Method.invoke(Method.java:580)
at app//com.carrotsearch.randomizedtesting.RandomizedRunner.invoke(RandomizedRunner.java:1758)
at app//com.carrotsearch.randomizedtesting.RandomizedRunner$8.evaluate(RandomizedRunner.java:946)
at app//com.carrotsearch.randomizedtesting.RandomizedRunner$9.evaluate(RandomizedRunner.java:982)
at app//com.carrotsearch.randomizedtesting.RandomizedRunner$10.evaluate(RandomizedRunner.java:996)
at app//org.apache.solr.BaseDistributedSearchTestCase$ShardsRepeatRule$ShardsFixedStatement.callStatement(BaseDistributedSearchTestCase.java:1066)
at app//org.apache.solr.BaseDistributedSearchTestCase$ShardsRepeatRule$ShardsStatement.evaluate(BaseDistributedSearchTestCase.java:1037)
at app//com.carrotsearch.randomizedtesting.rules.SystemPropertiesRestoreRule$1.evaluate(SystemPropertiesRestoreRule.java:80)
at app//org.junit.rules.RunRules.evaluate(RunRules.java:20)
at app//org.apache.lucene.tests.util.TestRuleSetupTeardownChained$1.evaluate(TestRuleSetupTeardownChained.java:48)
at app//org.apache.lucene.tests.util.AbstractBeforeAfterRule$1.evaluate(AbstractBeforeAfterRule.java:43)
at app//org.apache.lucene.tests.util.TestRuleThreadAndTestName$1.evaluate(TestRuleThreadAndTestName.java:45)
at app//org.apache.lucene.tests.util.TestRuleIgnoreAfterMaxFailures$1.evaluate(TestRuleIgnoreAfterMaxFailures.java:60)
at app//org.apache.lucene.tests.util.TestRuleMarkFailure$1.evaluate(TestRuleMarkFailure.java:44)
at app//org.junit.rules.RunRules.evaluate(RunRules.java:20)
at app//com.carrotsearch.randomizedtesting.rules.StatementAdapter.evaluate(StatementAdapter.java:36)
at app//com.carrotsearch.randomizedtesting.ThreadLeakControl$StatementRunner.run(ThreadLeakControl.java:390)
at app//com.carrotsearch.randomizedtesting.ThreadLeakControl.forkTimeoutingTask(ThreadLeakControl.java:843)
at app//com.carrotsearch.randomizedtesting.ThreadLeakControl$3.evaluate(ThreadLeakControl.java:490)
at app//com.carrotsearch.randomizedtesting.RandomizedRunner.runSingleTest(RandomizedRunner.java:955)
at app//com.carrotsearch.randomizedtesting.RandomizedRunner$5.evaluate(RandomizedRunner.java:840)
at app//com.carrotsearch.randomizedtesting.RandomizedRunner$6.evaluate(RandomizedRunner.java:891)
at app//com.carrotsearch.randomizedtesting.RandomizedRunner$7.evaluate(RandomizedRunner.java:902)
at app//com.carrotsearch.randomizedtesting.rules.StatementAdapter.evaluate(StatementAdapter.java:36)
at app//com.carrotsearch.randomizedtesting.rules.StatementAdapter.evaluate(StatementAdapter.java:36)
at app//org.apache.lucene.tests.util.AbstractBeforeAfterRule$1.evaluate(AbstractBeforeAfterRule.java:43)
at app//com.carrotsearch.randomizedtesting.rules.SystemPropertiesRestoreRule$1.evaluate(SystemPropertiesRestoreRule.java:80)
at app//org.junit.rules.RunRules.evaluate(RunRules.java:20)
at app//org.apache.lucene.tests.util.AbstractBeforeAfterRule$1.evaluate(AbstractBeforeAfterRule.java:43)
at app//com.carrotsearch.randomizedtesting.rules.StatementAdapter.evaluate(StatementAdapter.java:36)
at app//org.apache.lucene.tests.util.TestRuleStoreClassName$1.evaluate(TestRuleStoreClassName.java:38)
at app//com.carrotsearch.randomizedtesting.rules.NoShadowingOrOverridesOnMethodsRule$1.evaluate(NoShadowingOrOverridesOnMethodsRule.java:40)
at app//com.carrotsearch.randomizedtesting.rules.NoShadowingOrOverridesOnMethodsRule$1.evaluate(NoShadowingOrOverridesOnMethodsRule.java:40)
at app//com.carrotsearch.randomizedtesting.rules.StatementAdapter.evaluate(StatementAdapter.java:36)
at app//com.carrotsearch.randomizedtesting.rules.StatementAdapter.evaluate(StatementAdapter.java:36)
at app//org.apache.lucene.tests.util.TestRuleAssertionsRequired$1.evaluate(TestRuleAssertionsRequired.java:53)
at app//org.apache.lucene.tests.util.AbstractBeforeAfterRule$1.evaluate(AbstractBeforeAfterRule.java:43)
at app//org.apache.lucene.tests.util.TestRuleMarkFailure$1.evaluate(TestRuleMarkFailure.java:44)
at app//org.apache.lucene.tests.util.TestRuleIgnoreAfterMaxFailures$1.evaluate(TestRuleIgnoreAfterMaxFailures.java:60)
at app//org.apache.lucene.tests.util.TestRuleIgnoreTestSuites$1.evaluate(TestRuleIgnoreTestSuites.java:47)
at app//org.junit.rules.RunRules.evaluate(RunRules.java:20)
at app//com.carrotsearch.randomizedtesting.rules.StatementAdapter.evaluate(StatementAdapter.java:36)
at app//com.carrotsearch.randomizedtesting.ThreadLeakControl$StatementRunner.run(ThreadLeakControl.java:390)
at app//com.carrotsearch.randomizedtesting.ThreadLeakControl.lambda$forkTimeoutingTask$0(ThreadLeakControl.java:850)
at java.base@21.0.6/java.lang.Thread.run(Thread.java:1583)