You are viewing a plain text version of this content. The canonical link for it is here.
Posted to dev@lucene.apache.org by Policeman Jenkins Server <je...@thetaphi.de> on 2019/03/03 10:09:45 UTC
[JENKINS] Lucene-Solr-8.x-Windows (32bit/jdk1.8.0_172) - Build # 65
- Still Unstable!
Build: https://jenkins.thetaphi.de/job/Lucene-Solr-8.x-Windows/65/
Java: 32bit/jdk1.8.0_172 -server -XX:+UseParallelGC
1 tests failed.
FAILED: junit.framework.TestSuite.org.apache.solr.search.TestAddFieldRealTimeGet
Error Message:
Could not remove the following files (in the order of attempts): C:\Users\jenkins\workspace\Lucene-Solr-8.x-Windows\solr\build\solr-core\test\J0\temp\solr.search.TestAddFieldRealTimeGet_69BC4140636D5AEA-001\init-core-data-001: java.nio.file.AccessDeniedException: C:\Users\jenkins\workspace\Lucene-Solr-8.x-Windows\solr\build\solr-core\test\J0\temp\solr.search.TestAddFieldRealTimeGet_69BC4140636D5AEA-001\init-core-data-001 C:\Users\jenkins\workspace\Lucene-Solr-8.x-Windows\solr\build\solr-core\test\J0\temp\solr.search.TestAddFieldRealTimeGet_69BC4140636D5AEA-001: java.nio.file.DirectoryNotEmptyException: C:\Users\jenkins\workspace\Lucene-Solr-8.x-Windows\solr\build\solr-core\test\J0\temp\solr.search.TestAddFieldRealTimeGet_69BC4140636D5AEA-001
Stack Trace:
java.io.IOException: Could not remove the following files (in the order of attempts):
C:\Users\jenkins\workspace\Lucene-Solr-8.x-Windows\solr\build\solr-core\test\J0\temp\solr.search.TestAddFieldRealTimeGet_69BC4140636D5AEA-001\init-core-data-001: java.nio.file.AccessDeniedException: C:\Users\jenkins\workspace\Lucene-Solr-8.x-Windows\solr\build\solr-core\test\J0\temp\solr.search.TestAddFieldRealTimeGet_69BC4140636D5AEA-001\init-core-data-001
C:\Users\jenkins\workspace\Lucene-Solr-8.x-Windows\solr\build\solr-core\test\J0\temp\solr.search.TestAddFieldRealTimeGet_69BC4140636D5AEA-001: java.nio.file.DirectoryNotEmptyException: C:\Users\jenkins\workspace\Lucene-Solr-8.x-Windows\solr\build\solr-core\test\J0\temp\solr.search.TestAddFieldRealTimeGet_69BC4140636D5AEA-001
at __randomizedtesting.SeedInfo.seed([69BC4140636D5AEA]:0)
at org.apache.lucene.util.IOUtils.rm(IOUtils.java:318)
at org.apache.lucene.util.TestRuleTemporaryFilesCleanup.afterAlways(TestRuleTemporaryFilesCleanup.java:216)
at com.carrotsearch.randomizedtesting.rules.TestRuleAdapter$1.afterAlways(TestRuleAdapter.java:31)
at com.carrotsearch.randomizedtesting.rules.StatementAdapter.evaluate(StatementAdapter.java:43)
at com.carrotsearch.randomizedtesting.rules.StatementAdapter.evaluate(StatementAdapter.java:36)
at org.apache.lucene.util.TestRuleAssertionsRequired$1.evaluate(TestRuleAssertionsRequired.java:53)
at org.apache.lucene.util.TestRuleMarkFailure$1.evaluate(TestRuleMarkFailure.java:47)
at org.apache.lucene.util.TestRuleIgnoreAfterMaxFailures$1.evaluate(TestRuleIgnoreAfterMaxFailures.java:64)
at org.apache.lucene.util.TestRuleIgnoreTestSuites$1.evaluate(TestRuleIgnoreTestSuites.java:54)
at com.carrotsearch.randomizedtesting.rules.StatementAdapter.evaluate(StatementAdapter.java:36)
at com.carrotsearch.randomizedtesting.ThreadLeakControl$StatementRunner.run(ThreadLeakControl.java:368)
at java.lang.Thread.run(Thread.java:748)
Build Log:
[...truncated 13350 lines...]
[junit4] Suite: org.apache.solr.search.TestAddFieldRealTimeGet
[junit4] 2> Creating dataDir: C:\Users\jenkins\workspace\Lucene-Solr-8.x-Windows\solr\build\solr-core\test\J0\temp\solr.search.TestAddFieldRealTimeGet_69BC4140636D5AEA-001\init-core-data-001
[junit4] 2> 1445172 INFO (TEST-TestAddFieldRealTimeGet.test-seed#[69BC4140636D5AEA]) [ ] o.a.s.c.SolrConfig Using Lucene MatchVersion: 8.1.0
[junit4] 2> 1445184 INFO (TEST-TestAddFieldRealTimeGet.test-seed#[69BC4140636D5AEA]) [ ] o.a.s.s.ManagedIndexSchemaFactory The schema is configured as managed, but managed schema resource managed-schema not found - loading non-managed schema schema-id-and-version-fields-only.xml instead
[junit4] 2> 1445187 INFO (TEST-TestAddFieldRealTimeGet.test-seed#[69BC4140636D5AEA]) [ ] o.a.s.s.IndexSchema [null] Schema name=id-and-version-fields-only
[junit4] 2> 1445192 INFO (TEST-TestAddFieldRealTimeGet.test-seed#[69BC4140636D5AEA]) [ ] o.a.s.s.IndexSchema Loaded schema id-and-version-fields-only/1.6 with uniqueid field id
[junit4] 2> 1445192 INFO (TEST-TestAddFieldRealTimeGet.test-seed#[69BC4140636D5AEA]) [ ] o.a.s.s.ManagedIndexSchema Upgraded to managed schema at C:\Users\jenkins\workspace\Lucene-Solr-8.x-Windows\solr\build\solr-core\test\J0\temp\solr.search.TestAddFieldRealTimeGet_69BC4140636D5AEA-001\tempDir-001\collection1\conf\managed-schema
[junit4] 2> 1445192 INFO (TEST-TestAddFieldRealTimeGet.test-seed#[69BC4140636D5AEA]) [ ] o.a.s.s.ManagedIndexSchemaFactory After upgrading to managed schema, renamed the non-managed schema C:\Users\jenkins\workspace\Lucene-Solr-8.x-Windows\solr\build\solr-core\test\J0\temp\solr.search.TestAddFieldRealTimeGet_69BC4140636D5AEA-001\tempDir-001\collection1\conf\schema-id-and-version-fields-only.xml to C:\Users\jenkins\workspace\Lucene-Solr-8.x-Windows\solr\build\solr-core\test\J0\temp\solr.search.TestAddFieldRealTimeGet_69BC4140636D5AEA-001\tempDir-001\collection1\conf\schema-id-and-version-fields-only.xml.bak
[junit4] 2> 1445773 INFO (TEST-TestAddFieldRealTimeGet.test-seed#[69BC4140636D5AEA]) [ ] o.a.s.h.c.HttpShardHandlerFactory Host whitelist initialized: WhitelistHostChecker [whitelistHosts=null, whitelistHostCheckingEnabled=true]
[junit4] 2> 1445781 WARN (TEST-TestAddFieldRealTimeGet.test-seed#[69BC4140636D5AEA]) [ ] o.e.j.u.s.S.config No Client EndPointIdentificationAlgorithm configured for SslContextFactory@1facc8a[provider=null,keyStore=null,trustStore=null]
[junit4] 2> 1445788 WARN (TEST-TestAddFieldRealTimeGet.test-seed#[69BC4140636D5AEA]) [ ] o.e.j.u.s.S.config No Client EndPointIdentificationAlgorithm configured for SslContextFactory@63cbda[provider=null,keyStore=null,trustStore=null]
[junit4] 2> 1445854 INFO (TEST-TestAddFieldRealTimeGet.test-seed#[69BC4140636D5AEA]) [ ] o.a.s.c.TransientSolrCoreCacheDefault Allocating transient cache for 2147483647 transient cores
[junit4] 2> 1445854 INFO (TEST-TestAddFieldRealTimeGet.test-seed#[69BC4140636D5AEA]) [ ] o.a.s.h.a.MetricsHistoryHandler No .system collection, keeping metrics history in memory.
[junit4] 2> 1445883 INFO (TEST-TestAddFieldRealTimeGet.test-seed#[69BC4140636D5AEA]) [ ] o.a.s.m.r.SolrJmxReporter JMX monitoring for 'solr.node' (registry 'solr.node') enabled at server: com.sun.jmx.mbeanserver.JmxMBeanServer@c61241
[junit4] 2> 1445888 INFO (TEST-TestAddFieldRealTimeGet.test-seed#[69BC4140636D5AEA]) [ ] o.a.s.m.r.SolrJmxReporter JMX monitoring for 'solr.jvm' (registry 'solr.jvm') enabled at server: com.sun.jmx.mbeanserver.JmxMBeanServer@c61241
[junit4] 2> 1445888 INFO (TEST-TestAddFieldRealTimeGet.test-seed#[69BC4140636D5AEA]) [ ] o.a.s.m.r.SolrJmxReporter JMX monitoring for 'solr.jetty' (registry 'solr.jetty') enabled at server: com.sun.jmx.mbeanserver.JmxMBeanServer@c61241
[junit4] 2> 1445957 INFO (coreLoadExecutor-5759-thread-1) [ x:collection1] o.a.s.c.SolrConfig Using Lucene MatchVersion: 8.1.0
[junit4] 2> 1445963 INFO (coreLoadExecutor-5759-thread-1) [ x:collection1] o.a.s.s.IndexSchema [collection1] Schema name=id-and-version-fields-only
[junit4] 2> 1445968 INFO (coreLoadExecutor-5759-thread-1) [ x:collection1] o.a.s.s.IndexSchema Loaded schema id-and-version-fields-only/1.6 with uniqueid field id
[junit4] 2> 1445968 INFO (coreLoadExecutor-5759-thread-1) [ x:collection1] o.a.s.c.CoreContainer Creating SolrCore 'collection1' using configuration from instancedir C:\Users\jenkins\workspace\Lucene-Solr-8.x-Windows\solr\build\solr-core\test\J0\temp\solr.search.TestAddFieldRealTimeGet_69BC4140636D5AEA-001\tempDir-001\collection1, trusted=true
[junit4] 2> 1445969 INFO (coreLoadExecutor-5759-thread-1) [ x:collection1] o.a.s.m.r.SolrJmxReporter JMX monitoring for 'solr.core.collection1' (registry 'solr.core.collection1') enabled at server: com.sun.jmx.mbeanserver.JmxMBeanServer@c61241
[junit4] 2> 1445969 INFO (coreLoadExecutor-5759-thread-1) [ x:collection1] o.a.s.c.SolrCore [[collection1] ] Opening new SolrCore at [C:\Users\jenkins\workspace\Lucene-Solr-8.x-Windows\solr\build\solr-core\test\J0\temp\solr.search.TestAddFieldRealTimeGet_69BC4140636D5AEA-001\tempDir-001\collection1], dataDir=[C:\Users\jenkins\workspace\Lucene-Solr-8.x-Windows\solr\build\solr-core\test\J0\temp\solr.search.TestAddFieldRealTimeGet_69BC4140636D5AEA-001\init-core-data-001\]
[junit4] 2> 1445974 INFO (coreLoadExecutor-5759-thread-1) [ x:collection1] o.a.s.u.RandomMergePolicy RandomMergePolicy wrapping class org.apache.lucene.index.TieredMergePolicy: [TieredMergePolicy: maxMergeAtOnce=36, maxMergeAtOnceExplicit=29, maxMergedSegmentMB=25.54296875, floorSegmentMB=0.93359375, forceMergeDeletesPctAllowed=21.591283932274237, segmentsPerTier=15.0, maxCFSSegmentSizeMB=8.796093022207999E12, noCFSRatio=0.0, deletesPctAllowed=31.636775718997924
[junit4] 2> 1445979 WARN (coreLoadExecutor-5759-thread-1) [ x:collection1] o.a.s.c.RequestHandlers INVALID paramSet a in requestHandler {type = requestHandler,name = /dump,class = DumpRequestHandler,attributes = {initParams=a, name=/dump, registerPath=/solr,/v2, class=DumpRequestHandler},args = {defaults={a=A,b=B}}}
[junit4] 2> 1446085 INFO (coreLoadExecutor-5759-thread-1) [ x:collection1] o.a.s.u.UpdateHandler Using UpdateLog implementation: org.apache.solr.update.UpdateLog
[junit4] 2> 1446085 INFO (coreLoadExecutor-5759-thread-1) [ x:collection1] o.a.s.u.UpdateLog Initializing UpdateLog: dataDir= defaultSyncLevel=FLUSH numRecordsToKeep=100 maxNumLogsToKeep=10 numVersionBuckets=65536
[junit4] 2> 1446097 INFO (coreLoadExecutor-5759-thread-1) [ x:collection1] o.a.s.u.CommitTracker Hard AutoCommit: disabled
[junit4] 2> 1446097 INFO (coreLoadExecutor-5759-thread-1) [ x:collection1] o.a.s.u.CommitTracker Soft AutoCommit: disabled
[junit4] 2> 1446098 INFO (coreLoadExecutor-5759-thread-1) [ x:collection1] o.a.s.u.RandomMergePolicy RandomMergePolicy wrapping class org.apache.lucene.index.TieredMergePolicy: [TieredMergePolicy: maxMergeAtOnce=29, maxMergeAtOnceExplicit=35, maxMergedSegmentMB=80.77734375, floorSegmentMB=1.1689453125, forceMergeDeletesPctAllowed=13.929787948199868, segmentsPerTier=26.0, maxCFSSegmentSizeMB=8.796093022207999E12, noCFSRatio=0.5268362799909182, deletesPctAllowed=20.83425403561803
[junit4] 2> 1446098 INFO (coreLoadExecutor-5759-thread-1) [ x:collection1] o.a.s.s.SolrIndexSearcher Opening [Searcher@1b3dfa[collection1] main]
[junit4] 2> 1446099 INFO (coreLoadExecutor-5759-thread-1) [ x:collection1] o.a.s.r.ManagedResourceStorage File-based storage initialized to use dir: C:\Users\jenkins\workspace\Lucene-Solr-8.x-Windows\solr\build\solr-core\test\J0\temp\solr.search.TestAddFieldRealTimeGet_69BC4140636D5AEA-001\tempDir-001\collection1\conf
[junit4] 2> 1446100 INFO (coreLoadExecutor-5759-thread-1) [ x:collection1] o.a.s.h.ReplicationHandler Commits will be reserved for 10000ms.
[junit4] 2> 1446100 INFO (coreLoadExecutor-5759-thread-1) [ x:collection1] o.a.s.u.UpdateLog Could not find max version in index or recent updates, using new clock 1626973027983949824
[junit4] 2> 1446103 INFO (searcherExecutor-5760-thread-1-processing-x:collection1) [ x:collection1] o.a.s.c.SolrCore [collection1] Registered new searcher Searcher@1b3dfa[collection1] main{ExitableDirectoryReader(UninvertingDirectoryReader())}
[junit4] 2> 1446110 INFO (TEST-TestAddFieldRealTimeGet.test-seed#[69BC4140636D5AEA]) [ ] o.a.s.u.DirectUpdateHandler2 [collection1] REMOVING ALL DOCUMENTS FROM INDEX
[junit4] 2> 1446112 INFO (TEST-TestAddFieldRealTimeGet.test-seed#[69BC4140636D5AEA]) [ ] o.a.s.s.SolrIndexSearcher Opening [Searcher@10f10bf[collection1] realtime]
[junit4] 2> 1446112 INFO (TEST-TestAddFieldRealTimeGet.test-seed#[69BC4140636D5AEA]) [ ] o.a.s.u.p.LogUpdateProcessorFactory [collection1] webapp=null path=null params={_version_=-9223372036854775807&update.distrib=FROMLEADER&versions=true&wt=json&indent=true}{deleteByQuery=*:* (-9223372036854775807)} 0 2
[junit4] 2> 1446113 INFO (TEST-TestAddFieldRealTimeGet.test-seed#[69BC4140636D5AEA]) [ ] o.a.s.u.DirectUpdateHandler2 start commit{_version_=1626973027997581312,optimize=false,openSearcher=true,waitSearcher=true,expungeDeletes=false,softCommit=false,prepareCommit=false}
[junit4] 2> 1446113 INFO (TEST-TestAddFieldRealTimeGet.test-seed#[69BC4140636D5AEA]) [ ] o.a.s.u.SolrIndexWriter Calling setCommitData with IW:org.apache.solr.update.SolrIndexWriter@b9337f commitCommandVersion:1626973027997581312
[junit4] 2> 1446118 INFO (TEST-TestAddFieldRealTimeGet.test-seed#[69BC4140636D5AEA]) [ ] o.a.s.s.SolrIndexSearcher Opening [Searcher@133b6da[collection1] main]
[junit4] 2> 1446118 INFO (TEST-TestAddFieldRealTimeGet.test-seed#[69BC4140636D5AEA]) [ ] o.a.s.u.DirectUpdateHandler2 end_commit_flush
[junit4] 2> 1446119 INFO (searcherExecutor-5760-thread-1) [ ] o.a.s.c.SolrCore [collection1] Registered new searcher Searcher@133b6da[collection1] main{ExitableDirectoryReader(UninvertingDirectoryReader())}
[junit4] 2> 1446119 INFO (TEST-TestAddFieldRealTimeGet.test-seed#[69BC4140636D5AEA]) [ ] o.a.s.u.p.LogUpdateProcessorFactory [collection1] webapp=null path=null params={}{commit=} 0 6
[junit4] 2> 1446125 INFO (TEST-TestAddFieldRealTimeGet.test-seed#[69BC4140636D5AEA]) [ ] o.a.s.u.p.LogUpdateProcessorFactory [collection1] webapp=null path=null params={}{} 0 0
[junit4] 2> 1446126 ERROR (TEST-TestAddFieldRealTimeGet.test-seed#[69BC4140636D5AEA]) [ ] o.a.s.h.RequestHandlerBase org.apache.solr.common.SolrException: ERROR: [doc=1] unknown field 'newfield'
[junit4] 2> at org.apache.solr.update.DocumentBuilder.toDocument(DocumentBuilder.java:226)
[junit4] 2> at org.apache.solr.update.AddUpdateCommand.getLuceneDocument(AddUpdateCommand.java:105)
[junit4] 2> at org.apache.solr.update.DirectUpdateHandler2.updateDocOrDocValues(DirectUpdateHandler2.java:968)
[junit4] 2> at org.apache.solr.update.DirectUpdateHandler2.doNormalUpdate(DirectUpdateHandler2.java:342)
[junit4] 2> at org.apache.solr.update.DirectUpdateHandler2.addDoc0(DirectUpdateHandler2.java:289)
[junit4] 2> at org.apache.solr.update.DirectUpdateHandler2.addDoc(DirectUpdateHandler2.java:236)
[junit4] 2> at org.apache.solr.update.processor.RunUpdateProcessor.processAdd(RunUpdateProcessorFactory.java:76)
[junit4] 2> at org.apache.solr.update.processor.UpdateRequestProcessor.processAdd(UpdateRequestProcessor.java:55)
[junit4] 2> at org.apache.solr.update.processor.DistributedUpdateProcessor.doLocalAdd(DistributedUpdateProcessor.java:990)
[junit4] 2> at org.apache.solr.update.processor.DistributedUpdateProcessor.versionAdd(DistributedUpdateProcessor.java:1211)
[junit4] 2> at org.apache.solr.update.processor.DistributedUpdateProcessor.processAdd(DistributedUpdateProcessor.java:695)
[junit4] 2> at org.apache.solr.update.processor.LogUpdateProcessorFactory$LogUpdateProcessor.processAdd(LogUpdateProcessorFactory.java:103)
[junit4] 2> at org.apache.solr.handler.loader.XMLLoader.processUpdate(XMLLoader.java:261)
[junit4] 2> at org.apache.solr.handler.loader.XMLLoader.load(XMLLoader.java:188)
[junit4] 2> at org.apache.solr.handler.UpdateRequestHandler$1.load(UpdateRequestHandler.java:97)
[junit4] 2> at org.apache.solr.handler.ContentStreamHandlerBase.handleRequestBody(ContentStreamHandlerBase.java:68)
[junit4] 2> at org.apache.solr.handler.RequestHandlerBase.handleRequest(RequestHandlerBase.java:199)
[junit4] 2> at org.apache.solr.core.SolrCore.execute(SolrCore.java:2565)
[junit4] 2> at org.apache.solr.servlet.DirectSolrConnection.request(DirectSolrConnection.java:125)
[junit4] 2> at org.apache.solr.util.TestHarness.update(TestHarness.java:285)
[junit4] 2> at org.apache.solr.util.BaseTestHarness.checkUpdateStatus(BaseTestHarness.java:274)
[junit4] 2> at org.apache.solr.util.BaseTestHarness.validateErrorUpdate(BaseTestHarness.java:257)
[junit4] 2> at org.apache.solr.SolrTestCaseJ4.checkUpdateU(SolrTestCaseJ4.java:882)
[junit4] 2> at org.apache.solr.SolrTestCaseJ4.assertFailedU(SolrTestCaseJ4.java:870)
[junit4] 2> at org.apache.solr.search.TestAddFieldRealTimeGet.test(TestAddFieldRealTimeGet.java:62)
[junit4] 2> at sun.reflect.NativeMethodAccessorImpl.invoke0(Native Method)
[junit4] 2> at sun.reflect.NativeMethodAccessorImpl.invoke(NativeMethodAccessorImpl.java:62)
[junit4] 2> at sun.reflect.DelegatingMethodAccessorImpl.invoke(DelegatingMethodAccessorImpl.java:43)
[junit4] 2> at java.lang.reflect.Method.invoke(Method.java:498)
[junit4] 2> at com.carrotsearch.randomizedtesting.RandomizedRunner.invoke(RandomizedRunner.java:1750)
[junit4] 2> at com.carrotsearch.randomizedtesting.RandomizedRunner$8.evaluate(RandomizedRunner.java:938)
[junit4] 2> at com.carrotsearch.randomizedtesting.RandomizedRunner$9.evaluate(RandomizedRunner.java:974)
[junit4] 2> at com.carrotsearch.randomizedtesting.RandomizedRunner$10.evaluate(RandomizedRunner.java:988)
[junit4] 2> at com.carrotsearch.randomizedtesting.rules.SystemPropertiesRestoreRule$1.evaluate(SystemPropertiesRestoreRule.java:57)
[junit4] 2> at org.apache.lucene.util.TestRuleSetupTeardownChained$1.evaluate(TestRuleSetupTeardownChained.java:49)
[junit4] 2> at org.apache.lucene.util.AbstractBeforeAfterRule$1.evaluate(AbstractBeforeAfterRule.java:45)
[junit4] 2> at org.apache.lucene.util.TestRuleThreadAndTestName$1.evaluate(TestRuleThreadAndTestName.java:48)
[junit4] 2> at org.apache.lucene.util.TestRuleIgnoreAfterMaxFailures$1.evaluate(TestRuleIgnoreAfterMaxFailures.java:64)
[junit4] 2> at org.apache.lucene.util.TestRuleMarkFailure$1.evaluate(TestRuleMarkFailure.java:47)
[junit4] 2> at com.carrotsearch.randomizedtesting.rules.StatementAdapter.evaluate(StatementAdapter.java:36)
[junit4] 2> at com.carrotsearch.randomizedtesting.ThreadLeakControl$StatementRunner.run(ThreadLeakControl.java:368)
[junit4] 2> at com.carrotsearch.randomizedtesting.ThreadLeakControl.forkTimeoutingTask(ThreadLeakControl.java:817)
[junit4] 2> at com.carrotsearch.randomizedtesting.ThreadLeakControl$3.evaluate(ThreadLeakControl.java:468)
[junit4] 2> at com.carrotsearch.randomizedtesting.RandomizedRunner.runSingleTest(RandomizedRunner.java:947)
[junit4] 2> at com.carrotsearch.randomizedtesting.RandomizedRunner$5.evaluate(RandomizedRunner.java:832)
[junit4] 2> at com.carrotsearch.randomizedtesting.RandomizedRunner$6.evaluate(RandomizedRunner.java:883)
[junit4] 2> at com.carrotsearch.randomizedtesting.RandomizedRunner$7.evaluate(RandomizedRunner.java:894)
[junit4] 2> at com.carrotsearch.randomizedtesting.rules.StatementAdapter.evaluate(StatementAdapter.java:36)
[junit4] 2> at com.carrotsearch.randomizedtesting.rules.SystemPropertiesRestoreRule$1.evaluate(SystemPropertiesRestoreRule.java:57)
[junit4] 2> at org.apache.lucene.util.AbstractBeforeAfterRule$1.evaluate(AbstractBeforeAfterRule.java:45)
[junit4] 2> at com.carrotsearch.randomizedtesting.rules.StatementAdapter.evaluate(StatementAdapter.java:36)
[junit4] 2> at org.apache.lucene.util.TestRuleStoreClassName$1.evaluate(TestRuleStoreClassName.java:41)
[junit4] 2> at com.carrotsearch.randomizedtesting.rules.NoShadowingOrOverridesOnMethodsRule$1.evaluate(NoShadowingOrOverridesOnMethodsRule.java:40)
[junit4] 2> at com.carrotsearch.randomizedtesting.rules.NoShadowingOrOverridesOnMethodsRule$1.evaluate(NoShadowingOrOverridesOnMethodsRule.java:40)
[junit4] 2> at com.carrotsearch.randomizedtesting.rules.StatementAdapter.evaluate(StatementAdapter.java:36)
[junit4] 2> at com.carrotsearch.randomizedtesting.rules.StatementAdapter.evaluate(StatementAdapter.java:36)
[junit4] 2> at com.carrotsearch.randomizedtesting.rules.StatementAdapter.evaluate(StatementAdapter.java:36)
[junit4] 2> at org.apache.lucene.util.TestRuleAssertionsRequired$1.evaluate(TestRuleAssertionsRequired.java:53)
[junit4] 2> at org.apache.lucene.util.TestRuleMarkFailure$1.evaluate(TestRuleMarkFailure.java:47)
[junit4] 2> at org.apache.lucene.util.TestRuleIgnoreAfterMaxFailures$1.evaluate(TestRuleIgnoreAfterMaxFailures.java:64)
[junit4] 2> at org.apache.lucene.util.TestRuleIgnoreTestSuites$1.evaluate(TestRuleIgnoreTestSuites.java:54)
[junit4] 2> at com.carrotsearch.randomizedtesting.rules.StatementAdapter.evaluate(StatementAdapter.java:36)
[junit4] 2> at com.carrotsearch.randomizedtesting.ThreadLeakControl$StatementRunner.run(ThreadLeakControl.java:368)
[junit4] 2> at java.lang.Thread.run(Thread.java:748)
[junit4] 2>
[junit4] 2> 1446126 INFO (TEST-TestAddFieldRealTimeGet.test-seed#[69BC4140636D5AEA]) [ ] o.a.s.s.ManagedIndexSchema Upgraded to managed schema at C:\Users\jenkins\workspace\Lucene-Solr-8.x-Windows\solr\build\solr-core\test\J0\temp\solr.search.TestAddFieldRealTimeGet_69BC4140636D5AEA-001\tempDir-001\collection1\conf\managed-schema
[junit4] 2> 1446129 INFO (TEST-TestAddFieldRealTimeGet.test-seed#[69BC4140636D5AEA]) [ ] o.a.s.u.p.LogUpdateProcessorFactory [collection1] webapp=null path=null params={}{add=[1 (1626973028012261376)]} 0 1
[junit4] 2> 1446129 INFO (TEST-TestAddFieldRealTimeGet.test-seed#[69BC4140636D5AEA]) [ ] o.a.s.c.S.Request [collection1] webapp=null path=null params={q=id:1&wt=xml} hits=0 status=0 QTime=0
[junit4] 2> 1446130 INFO (TEST-TestAddFieldRealTimeGet.test-seed#[69BC4140636D5AEA]) [ ] o.a.s.c.S.Request [collection1] webapp=null path=null params={qt=/get&fl=id,newfield&id=1&wt=xml} status=0 QTime=0
[junit4] 2> 1446130 INFO (TEST-TestAddFieldRealTimeGet.test-seed#[69BC4140636D5AEA]) [ ] o.a.s.c.S.Request [collection1] webapp=null path=null params={qt=/get&fl=id,newfield&ids=1&wt=xml} status=0 QTime=0
[junit4] 2> 1446130 INFO (TEST-TestAddFieldRealTimeGet.test-seed#[69BC4140636D5AEA]) [ ] o.a.s.u.DirectUpdateHandler2 start commit{_version_=1626973028015407104,optimize=false,openSearcher=true,waitSearcher=true,expungeDeletes=false,softCommit=false,prepareCommit=false}
[junit4] 2> 1446131 INFO (TEST-TestAddFieldRealTimeGet.test-seed#[69BC4140636D5AEA]) [ ] o.a.s.u.SolrIndexWriter Calling setCommitData with IW:org.apache.solr.update.SolrIndexWriter@b9337f commitCommandVersion:1626973028015407104
[junit4] 2> 1446148 INFO (TEST-TestAddFieldRealTimeGet.test-seed#[69BC4140636D5AEA]) [ ] o.a.s.s.SolrIndexSearcher Opening [Searcher@11888dd[collection1] main]
[junit4] 2> 1446148 INFO (TEST-TestAddFieldRealTimeGet.test-seed#[69BC4140636D5AEA]) [ ] o.a.s.u.DirectUpdateHandler2 end_commit_flush
[junit4] 2> 1446148 INFO (searcherExecutor-5760-thread-1) [ ] o.a.s.c.SolrCore [collection1] Registered new searcher Searcher@11888dd[collection1] main{ExitableDirectoryReader(UninvertingDirectoryReader(Uninverting(_0(8.1.0):C1:[diagnostics={os=Windows 10, java.vendor=Oracle Corporation, java.version=1.8.0_172, java.vm.version=25.172-b11, lucene.version=8.1.0, os.arch=x86, java.runtime.version=1.8.0_172-b11, source=flush, os.version=10.0, timestamp=1551602390305}]:[attributes={Lucene50StoredFieldsFormat.mode=BEST_SPEED}])))}
[junit4] 2> 1446151 INFO (TEST-TestAddFieldRealTimeGet.test-seed#[69BC4140636D5AEA]) [ ] o.a.s.u.p.LogUpdateProcessorFactory [collection1] webapp=null path=null params={}{commit=} 0 20
[junit4] 2> 1446151 INFO (TEST-TestAddFieldRealTimeGet.test-seed#[69BC4140636D5AEA]) [ ] o.a.s.c.S.Request [collection1] webapp=null path=null params={q=id:1&wt=xml} hits=1 status=0 QTime=0
[junit4] 2> 1446151 INFO (TEST-TestAddFieldRealTimeGet.test-seed#[69BC4140636D5AEA]) [ ] o.a.s.c.S.Request [collection1] webapp=null path=null params={qt=/get&fl=id,newfield&id=1&wt=xml} status=0 QTime=0
[junit4] 2> 1446151 INFO (TEST-TestAddFieldRealTimeGet.test-seed#[69BC4140636D5AEA]) [ ] o.a.s.c.S.Request [collection1] webapp=null path=null params={qt=/get&fl=id,newfield&ids=1&wt=xml} status=0 QTime=0
[junit4] 2> 1446152 INFO (SUITE-TestAddFieldRealTimeGet-seed#[69BC4140636D5AEA]-worker) [ ] o.a.s.c.CoreContainer Shutting down CoreContainer instance=24708725
[junit4] 2> 1446157 INFO (coreCloseExecutor-5765-thread-1) [ x:collection1] o.a.s.c.SolrCore [collection1] CLOSING SolrCore org.apache.solr.core.SolrCore@741104
[junit4] 2> 1446157 INFO (coreCloseExecutor-5765-thread-1) [ x:collection1] o.a.s.m.SolrMetricManager Closing metric reporters for registry=solr.core.collection1, tag=741104
[junit4] 2> 1446157 INFO (coreCloseExecutor-5765-thread-1) [ x:collection1] o.a.s.m.r.SolrJmxReporter Closing reporter [org.apache.solr.metrics.reporters.SolrJmxReporter@67c65e: rootName = null, domain = solr.core.collection1, service url = null, agent id = null] for registry solr.core.collection1 / com.codahale.metrics.MetricRegistry@259efc
[junit4] 2> 1446184 INFO (SUITE-TestAddFieldRealTimeGet-seed#[69BC4140636D5AEA]-worker) [ ] o.a.s.m.SolrMetricManager Closing metric reporters for registry=solr.node, tag=null
[junit4] 2> 1446184 INFO (SUITE-TestAddFieldRealTimeGet-seed#[69BC4140636D5AEA]-worker) [ ] o.a.s.m.r.SolrJmxReporter Closing reporter [org.apache.solr.metrics.reporters.SolrJmxReporter@a42d49: rootName = null, domain = solr.node, service url = null, agent id = null] for registry solr.node / com.codahale.metrics.MetricRegistry@1e4bbea
[junit4] 2> 1446187 INFO (SUITE-TestAddFieldRealTimeGet-seed#[69BC4140636D5AEA]-worker) [ ] o.a.s.m.SolrMetricManager Closing metric reporters for registry=solr.jvm, tag=null
[junit4] 2> 1446187 INFO (SUITE-TestAddFieldRealTimeGet-seed#[69BC4140636D5AEA]-worker) [ ] o.a.s.m.r.SolrJmxReporter Closing reporter [org.apache.solr.metrics.reporters.SolrJmxReporter@19618c3: rootName = null, domain = solr.jvm, service url = null, agent id = null] for registry solr.jvm / com.codahale.metrics.MetricRegistry@1a63581
[junit4] 2> 1446189 INFO (SUITE-TestAddFieldRealTimeGet-seed#[69BC4140636D5AEA]-worker) [ ] o.a.s.m.SolrMetricManager Closing metric reporters for registry=solr.jetty, tag=null
[junit4] 2> 1446189 INFO (SUITE-TestAddFieldRealTimeGet-seed#[69BC4140636D5AEA]-worker) [ ] o.a.s.m.r.SolrJmxReporter Closing reporter [org.apache.solr.metrics.reporters.SolrJmxReporter@e89899: rootName = null, domain = solr.jetty, service url = null, agent id = null] for registry solr.jetty / com.codahale.metrics.MetricRegistry@66a5d6
[junit4] 2> NOTE: test params are: codec=Asserting(Lucene80): {}, docValues:{}, maxPointsInLeafNode=370, maxMBSortInHeap=7.441770211690973, sim=Asserting(org.apache.lucene.search.similarities.AssertingSimilarity@6a1610), locale=pt-BR, timezone=Asia/Samarkand
[junit4] 2> NOTE: Windows 10 10.0 x86/Oracle Corporation 1.8.0_172 (32-bit)/cpus=3,threads=1,free=212249704,total=509607936
[junit4] 2> NOTE: All tests run in this JVM: [TaggingAttributeTest, TestNonDefinedSimilarityFactory, UnloadDistributedZkTest, TestRawTransformer, TestReplicationHandlerDiskOverFlow, TestSolrConfigHandlerConcurrent, TestDistribDocBasedVersion, PrimitiveFieldTypeTest, RollingRestartTest, TestStreamBody, DistributedTermsComponentTest, AdminHandlersProxyTest, TriggerSetPropertiesIntegrationTest, DOMUtilTest, TestMinMaxOnMultiValuedField, QueryResultKeyTest, TestFieldResource, ShardSplitTest, TestJsonFacetRefinement, TestConfigSets, TestSegmentSorting, RequestHandlersTest, QueryParsingTest, TestOverriddenPrefixQueryForCustomFieldType, TestFileDictionaryLookup, EmbeddedSolrNoSerializeTest, CoreMergeIndexesAdminHandlerTest, HighlighterMaxOffsetTest, TestSimDistributedQueue, TestSolrCloudWithDelegationTokens, ForceLeaderTest, TestConfigSetsAPIExclusivity, DistributedFacetPivotSmallTest, TestCopyFieldCollectionResource, TestSortByMinMaxFunction, TestReplicaProperties, ScheduledMaintenanceTriggerTest, TestClusterProperties, TestSolrDeletionPolicy2, CollectionPropsTest, CustomTermsComponentTest, TlogReplayBufferedWhileIndexingTest, TestCloudRecovery2, TestCollationFieldDocValues, TestMultiWordSynonyms, CollectionsAPISolrJTest, TestTolerantUpdateProcessorRandomCloud, CoreSorterTest, SolrCoreTest, TestCollectionAPI, TestLegacyField, MigrateRouteKeyTest, ZkFailoverTest, TestStressRecovery, HdfsSyncSliceTest, TestComponentsName, TestMiniSolrCloudClusterSSL, TestDistributedGrouping, SolrJmxReporterTest, SolrIndexMetricsTest, TestGroupingSearch, LoggingHandlerTest, TestEmbeddedSolrServerAdminHandler, ExitableDirectoryReaderTest, TestRecoveryHdfs, DateFieldTest, CoreAdminOperationTest, TestPostingsSolrHighlighter, TestSolrQueryParser, TestExtendedDismaxParser, TestFiltering, TestAnalyzedSuggestions, TestLegacyNumericUtils, SOLR749Test, TestJsonFacetsStatsParsing, AssignBackwardCompatibilityTest, TestChildDocTransformerHierarchy, TestManagedSchemaThreadSafety, SynonymTokenizerTest, SpellCheckComponentTest, TestSearcherReuse, TestReloadDeadlock, TimeZoneUtilsTest, TestLeaderElectionZkExpiry, ReplicationFactorTest, TestAddFieldRealTimeGet]
[junit4] 2> NOTE: reproduce with: ant test -Dtestcase=TestAddFieldRealTimeGet -Dtests.seed=69BC4140636D5AEA -Dtests.slow=true -Dtests.locale=pt-BR -Dtests.timezone=Asia/Samarkand -Dtests.asserts=true -Dtests.file.encoding=Cp1252
[junit4] ERROR 0.00s J0 | TestAddFieldRealTimeGet (suite) <<<
[junit4] > Throwable #1: java.io.IOException: Could not remove the following files (in the order of attempts):
[junit4] > C:\Users\jenkins\workspace\Lucene-Solr-8.x-Windows\solr\build\solr-core\test\J0\temp\solr.search.TestAddFieldRealTimeGet_69BC4140636D5AEA-001\init-core-data-001: java.nio.file.AccessDeniedException: C:\Users\jenkins\workspace\Lucene-Solr-8.x-Windows\solr\build\solr-core\test\J0\temp\solr.search.TestAddFieldRealTimeGet_69BC4140636D5AEA-001\init-core-data-001
[junit4] > C:\Users\jenkins\workspace\Lucene-Solr-8.x-Windows\solr\build\solr-core\test\J0\temp\solr.search.TestAddFieldRealTimeGet_69BC4140636D5AEA-001: java.nio.file.DirectoryNotEmptyException: C:\Users\jenkins\workspace\Lucene-Solr-8.x-Windows\solr\build\solr-core\test\J0\temp\solr.search.TestAddFieldRealTimeGet_69BC4140636D5AEA-001
[junit4] > at __randomizedtesting.SeedInfo.seed([69BC4140636D5AEA]:0)
[junit4] > at org.apache.lucene.util.IOUtils.rm(IOUtils.java:318)
[junit4] > at java.lang.Thread.run(Thread.java:748)
[junit4] Completed [217/844 (1!)] on J0 in 1.36s, 1 test, 1 error <<< FAILURES!
[...truncated 47462 lines...]
[repro] Jenkins log URL: https://jenkins.thetaphi.de/job/Lucene-Solr-8.x-Windows/65/consoleText
[repro] Revision: 677a97edc7ba07a35f644792c98fa5ebf5667bb5
[repro] Ant options: "-Dargs=-server -XX:+UseParallelGC"
[repro] ant clean
[...truncated 6 lines...]
[repro] Test suites by module:
[repro] solr\core
[repro] TestAddFieldRealTimeGet
[repro] ant compile-test
[...truncated 3597 lines...]
[repro] ant test-nocompile -Dtests.dups=5 -Dtests.maxfailures=5 -Dtests.class="*.TestAddFieldRealTimeGet" -Dtests.showOutput=onerror "-Dargs=-server -XX:+UseParallelGC" -Dtests.seed=69BC4140636D5AEA -Dtests.slow=true -Dtests.locale=pt-BR -Dtests.timezone=Asia/Samarkand -Dtests.asserts=true -Dtests.file.encoding=Cp1252
[...truncated 68 lines...]
[repro] Failures:
[repro] 0/5 failed: org.apache.solr.search.TestAddFieldRealTimeGet
[repro] Exiting with code 0
[...truncated 78 lines...]