You are viewing a plain text version of this content. The canonical link for it is here.
Posted to builds@solr.apache.org by Apache Jenkins Server <je...@builds.apache.org> on 2023/12/19 07:52:41 UTC

[JENKINS] Solr » Solr-Smoketest-9.x - Build # 272 - Failure!

Build: https://ci-builds.apache.org/job/Solr/job/Solr-Smoketest-9.x/272/

Log: 
Started by timer
Running as SYSTEM
[EnvInject] - Loading node environment variables.
Building remotely on lucene-solr-1 (solr lucene) in workspace /home/jenkins/jenkins-slave/workspace/Solr/Solr-Smoketest-9.x
[WS-CLEANUP] Deleting project workspace...
[WS-CLEANUP] Deferred wipeout is used...
[WS-CLEANUP] Done
The recommended git tool is: NONE
No credentials specified
Cloning the remote Git repository
Cloning repository https://github.com/apache/solr.git
 > git init /home/jenkins/jenkins-slave/workspace/Solr/Solr-Smoketest-9.x # timeout=10
Fetching upstream changes from https://github.com/apache/solr.git
 > git --version # timeout=10
 > git --version # 'git version 2.17.1'
 > git fetch --tags --progress -- https://github.com/apache/solr.git +refs/heads/*:refs/remotes/origin/* # timeout=10
 > git config remote.origin.url https://github.com/apache/solr.git # timeout=10
 > git config --add remote.origin.fetch +refs/heads/*:refs/remotes/origin/* # timeout=10
Avoid second fetch
 > git rev-parse origin/branch_9x^{commit} # timeout=10
Checking out Revision 3a57d72c2cd1a38b675136f2f94814bbb89198c9 (origin/branch_9x)
 > git config core.sparsecheckout # timeout=10
 > git checkout -f 3a57d72c2cd1a38b675136f2f94814bbb89198c9 # timeout=10
 > git branch -a -v --no-abbrev # timeout=10
 > git checkout -b branch_9x 3a57d72c2cd1a38b675136f2f94814bbb89198c9 # timeout=10
Commit message: "Copy the file from the "solrj" module (#2158)"
 > git rev-list --no-walk c79011e81dada2f9bc4b4df32ffb32152ef81152 # timeout=10
No emails were triggered.
provisioning config files...
copy managed file [gradle.properties] to file:/home/jenkins/jenkins-slave/workspace/Solr/Solr-Smoketest-9.x/gradle.properties
[Gradle] - Launching build.
[Solr-Smoketest-9.x] $ /home/jenkins/jenkins-slave/workspace/Solr/Solr-Smoketest-9.x/gradlew -Dversion.suffix= -Dgradle.user.home=/home/jenkins/jenkins-slave/workspace/Solr/.gradle -Porg.gradle.daemon=false -Pvalidation.git.failOnModified=false --continue clean assembleRelease
Downloading gradle-wrapper.jar from https://raw.githubusercontent.com/gradle/gradle/v8.4.0/gradle/wrapper/gradle-wrapper.jar
To honour the JVM settings for this build a single-use Daemon process will be forked. For more on this, please refer to https://docs.gradle.org/8.4/userguide/gradle_daemon.html#sec:disabling_the_daemon in the Gradle documentation.
Daemon will be stopped at the end of the build 

> Task :buildSrc:compileJava
Note: /home/jenkins/jenkins-slave/workspace/Solr/Solr-Smoketest-9.x/buildSrc/src/main/java/org/apache/lucene/gradle/Checksum.java uses or overrides a deprecated API.
Note: Recompile with -Xlint:deprecation for details.

> Task :buildSrc:compileGroovy NO-SOURCE
> Task :buildSrc:processResources NO-SOURCE
> Task :buildSrc:classes
> Task :buildSrc:jar
> Task :clean
> Task :solr:clean UP-TO-DATE
> Task :solr:api:clean
> Task :solr:benchmark:clean
> Task :solr:core:clean
> Task :solr:distribution:clean UP-TO-DATE
> Task :solr:docker:clean UP-TO-DATE
> Task :solr:documentation:clean UP-TO-DATE
> Task :solr:example:clean UP-TO-DATE
> Task :solr:modules:clean UP-TO-DATE
> Task :solr:packaging:clean UP-TO-DATE
> Task :solr:prometheus-exporter:clean
> Task :solr:server:clean
> Task :solr:solr-ref-guide:clean
> Task :solr:solrj:clean
> Task :solr:solrj-streaming:clean
> Task :solr:solrj-zookeeper:clean
> Task :solr:test-framework:clean
> Task :solr:webapp:clean
> Task :solr:modules:analysis-extras:clean
> Task :solr:modules:analytics:clean
> Task :solr:modules:clustering:clean
> Task :solr:modules:extraction:clean
> Task :solr:modules:gcs-repository:clean
> Task :solr:modules:hadoop-auth:clean
> Task :solr:modules:hdfs:clean
> Task :solr:modules:jaegertracer-configurator:clean
> Task :solr:modules:jwt-auth:clean
> Task :solr:modules:langid:clean
> Task :solr:modules:ltr:clean
> Task :solr:modules:opentelemetry:clean
> Task :solr:modules:s3-repository:clean
> Task :solr:modules:scripting:clean
> Task :solr:modules:sql:clean
> Task :mavenLocalClean UP-TO-DATE
> Task :solr-missing-doclet:compileJava
> Task :solr-missing-doclet:processResources NO-SOURCE
> Task :solr-missing-doclet:classes
> Task :solr-missing-doclet:jar
> Task :gitStatus
> Task :checkJdkInternalsExportedToGradle
> Task :solr:api:compileJava
> Task :solr:api:processResources NO-SOURCE
> Task :solr:api:classes
> Task :solr:api:jar
> Task :solr:api:generateMetadataFileForJarsPublication SKIPPED
> Task :solr:api:generatePomFileForJarsPublication
> Task :solr:api:renderJavadoc
> Task :solr:api:javadoc SKIPPED
> Task :solr:api:javadocJar
> Task :solr:api:sourcesJar
> Task :solr:api:signJarsPublication SKIPPED
> Task :solr:api:publishJarsPublicationToBuildRepository

> Task :solr:api:resolve
SLF4J: No SLF4J providers were found.
SLF4J: Defaulting to no-operation (NOP) logger implementation
SLF4J: See https://www.slf4j.org/codes.html#noProviders for further details.

> Task :solr:solrj:openApiGenerate
################################################################################
# Thanks for using OpenAPI Generator.                                          #
# Please consider donation to help us maintain this project 🙏                 #
# https://opencollective.com/openapi_generator/donate                          #
################################################################################
Successfully generated code to /home/jenkins/jenkins-slave/workspace/Solr/Solr-Smoketest-9.x/solr/solrj/build/generated/

> Task :spotlessInternalRegisterDependencies
> Task :solr:solrj:generatedSpotlessHelper
> Task :solr:solrj:generatedSpotless

> Task :solr:solrj:compileJava
Note: Some input files use or override a deprecated API.
Note: Recompile with -Xlint:deprecation for details.

> Task :solr:solrj-streaming:compileJava
Note: Some input files use or override a deprecated API.
Note: Recompile with -Xlint:deprecation for details.

> Task :solr:solrj-zookeeper:compileJava
Note: Some input files use or override a deprecated API.
Note: Recompile with -Xlint:deprecation for details.

> Task :solr:core:compileJava
Note: Some input files use or override a deprecated API.
Note: Recompile with -Xlint:deprecation for details.

> Task :solr:core:processResources
> Task :solr:core:classes
> Task :solr:core:jar
> Task :solr:core:generateMetadataFileForJarsPublication SKIPPED
> Task :solr:core:generatePomFileForJarsPublication
> Task :solr:solrj:renderJavadoc
> Task :solr:solrj-streaming:renderJavadoc
> Task :solr:solrj-zookeeper:renderJavadoc
> Task :solr:core:renderJavadoc
> Task :solr:core:javadoc SKIPPED
> Task :solr:core:javadocJar
> Task :solr:core:sourcesJar
> Task :solr:core:signJarsPublication SKIPPED
> Task :solr:core:publishJarsPublicationToBuildRepository

> Task :solr:prometheus-exporter:compileJava
Note: Some input files use or override a deprecated API.
Note: Recompile with -Xlint:deprecation for details.

> Task :solr:prometheus-exporter:processResources NO-SOURCE
> Task :solr:prometheus-exporter:classes
> Task :solr:prometheus-exporter:jar
> Task :solr:prometheus-exporter:generateMetadataFileForJarsPublication SKIPPED
> Task :solr:prometheus-exporter:generatePomFileForJarsPublication
> Task :solr:prometheus-exporter:renderJavadoc
> Task :solr:prometheus-exporter:javadoc SKIPPED
> Task :solr:prometheus-exporter:javadocJar
> Task :solr:prometheus-exporter:sourcesJar
> Task :solr:prometheus-exporter:signJarsPublication SKIPPED
> Task :solr:prometheus-exporter:publishJarsPublicationToBuildRepository
> Task :solr:solrj:processResources
> Task :solr:solrj:classes
> Task :solr:solrj:jar
> Task :solr:solrj:generateMetadataFileForJarsPublication SKIPPED
> Task :solr:solrj:generatePomFileForJarsPublication
> Task :solr:solrj:javadoc SKIPPED
> Task :solr:solrj:javadocJar
> Task :solr:solrj:sourcesJar
> Task :solr:solrj:signJarsPublication SKIPPED
> Task :solr:solrj:publishJarsPublicationToBuildRepository
> Task :solr:solrj-streaming:processResources
> Task :solr:solrj-streaming:classes
> Task :solr:solrj-streaming:jar
> Task :solr:solrj-streaming:generateMetadataFileForJarsPublication SKIPPED
> Task :solr:solrj-streaming:generatePomFileForJarsPublication
> Task :solr:solrj-streaming:javadoc SKIPPED
> Task :solr:solrj-streaming:javadocJar
> Task :solr:solrj-streaming:sourcesJar
> Task :solr:solrj-streaming:signJarsPublication SKIPPED
> Task :solr:solrj-streaming:publishJarsPublicationToBuildRepository
> Task :solr:solrj-zookeeper:processResources NO-SOURCE
> Task :solr:solrj-zookeeper:classes
> Task :solr:solrj-zookeeper:jar
> Task :solr:solrj-zookeeper:generateMetadataFileForJarsPublication SKIPPED
> Task :solr:solrj-zookeeper:generatePomFileForJarsPublication
> Task :solr:solrj-zookeeper:javadoc SKIPPED
> Task :solr:solrj-zookeeper:javadocJar
> Task :solr:solrj-zookeeper:sourcesJar
> Task :solr:solrj-zookeeper:signJarsPublication SKIPPED
> Task :solr:solrj-zookeeper:publishJarsPublicationToBuildRepository

> Task :solr:test-framework:compileJava
Note: Some input files use or override a deprecated API.
Note: Recompile with -Xlint:deprecation for details.

> Task :solr:test-framework:processResources
> Task :solr:test-framework:classes
> Task :solr:test-framework:jar
> Task :solr:test-framework:generateMetadataFileForJarsPublication SKIPPED
> Task :solr:test-framework:generatePomFileForJarsPublication
> Task :solr:test-framework:renderJavadoc
> Task :solr:test-framework:javadoc SKIPPED
> Task :solr:test-framework:javadocJar
> Task :solr:test-framework:sourcesJar
> Task :solr:test-framework:signJarsPublication SKIPPED
> Task :solr:test-framework:publishJarsPublicationToBuildRepository

> Task :solr:modules:analysis-extras:compileJava
Note: /home/jenkins/jenkins-slave/workspace/Solr/Solr-Smoketest-9.x/solr/modules/analysis-extras/src/java/org/apache/solr/schema/ICUCollationField.java uses or overrides a deprecated API.
Note: Recompile with -Xlint:deprecation for details.

> Task :solr:modules:analysis-extras:processResources NO-SOURCE
> Task :solr:modules:analysis-extras:classes
> Task :solr:modules:analysis-extras:jar
> Task :solr:modules:analysis-extras:generateMetadataFileForJarsPublication SKIPPED
> Task :solr:modules:analysis-extras:generatePomFileForJarsPublication
> Task :solr:modules:analysis-extras:renderJavadoc
> Task :solr:modules:analysis-extras:javadoc SKIPPED
> Task :solr:modules:analysis-extras:javadocJar
> Task :solr:modules:analysis-extras:sourcesJar
> Task :solr:modules:analysis-extras:signJarsPublication SKIPPED
> Task :solr:modules:analysis-extras:publishJarsPublicationToBuildRepository

> Task :solr:modules:analytics:compileJava
Note: Some input files use or override a deprecated API.
Note: Recompile with -Xlint:deprecation for details.

> Task :solr:modules:analytics:processResources NO-SOURCE
> Task :solr:modules:analytics:classes
> Task :solr:modules:analytics:jar
> Task :solr:modules:analytics:generateMetadataFileForJarsPublication SKIPPED
> Task :solr:modules:analytics:generatePomFileForJarsPublication
> Task :solr:modules:analytics:renderJavadoc
> Task :solr:modules:analytics:javadoc SKIPPED
> Task :solr:modules:analytics:javadocJar
> Task :solr:modules:analytics:sourcesJar
> Task :solr:modules:analytics:signJarsPublication SKIPPED
> Task :solr:modules:analytics:publishJarsPublicationToBuildRepository
> Task :solr:modules:clustering:compileJava
> Task :solr:modules:clustering:processResources NO-SOURCE
> Task :solr:modules:clustering:classes
> Task :solr:modules:clustering:jar
> Task :solr:modules:clustering:generateMetadataFileForJarsPublication SKIPPED
> Task :solr:modules:clustering:generatePomFileForJarsPublication
> Task :solr:modules:clustering:renderJavadoc
> Task :solr:modules:clustering:javadoc SKIPPED
> Task :solr:modules:clustering:javadocJar
> Task :solr:modules:clustering:sourcesJar
> Task :solr:modules:clustering:signJarsPublication SKIPPED
> Task :solr:modules:clustering:publishJarsPublicationToBuildRepository

> Task :solr:modules:extraction:compileJava
Note: /home/jenkins/jenkins-slave/workspace/Solr/Solr-Smoketest-9.x/solr/modules/extraction/src/java/org/apache/solr/handler/extraction/ExtractingDocumentLoader.java uses or overrides a deprecated API.
Note: Recompile with -Xlint:deprecation for details.

> Task :solr:modules:extraction:processResources
> Task :solr:modules:extraction:classes
> Task :solr:modules:extraction:jar
> Task :solr:modules:extraction:generateMetadataFileForJarsPublication SKIPPED
> Task :solr:modules:extraction:generatePomFileForJarsPublication
> Task :solr:modules:extraction:renderJavadoc
> Task :solr:modules:extraction:javadoc SKIPPED
> Task :solr:modules:extraction:javadocJar
> Task :solr:modules:extraction:sourcesJar
> Task :solr:modules:extraction:signJarsPublication SKIPPED
> Task :solr:modules:extraction:publishJarsPublicationToBuildRepository

> Task :solr:modules:gcs-repository:compileJava
Note: /home/jenkins/jenkins-slave/workspace/Solr/Solr-Smoketest-9.x/solr/modules/gcs-repository/src/java/org/apache/solr/gcs/GCSConfigParser.java uses or overrides a deprecated API.
Note: Recompile with -Xlint:deprecation for details.

> Task :solr:modules:gcs-repository:processResources NO-SOURCE
> Task :solr:modules:gcs-repository:classes
> Task :solr:modules:gcs-repository:jar
> Task :solr:modules:gcs-repository:generateMetadataFileForJarsPublication SKIPPED
> Task :solr:modules:gcs-repository:generatePomFileForJarsPublication
> Task :solr:modules:gcs-repository:renderJavadoc
> Task :solr:modules:gcs-repository:javadoc SKIPPED
> Task :solr:modules:gcs-repository:javadocJar
> Task :solr:modules:gcs-repository:sourcesJar
> Task :solr:modules:gcs-repository:signJarsPublication SKIPPED
> Task :solr:modules:gcs-repository:publishJarsPublicationToBuildRepository

> Task :solr:modules:hadoop-auth:compileJava
Note: Some input files use or override a deprecated API.
Note: Recompile with -Xlint:deprecation for details.

> Task :solr:modules:hadoop-auth:processResources NO-SOURCE
> Task :solr:modules:hadoop-auth:classes
> Task :solr:modules:hadoop-auth:jar
> Task :solr:modules:hadoop-auth:generateMetadataFileForJarsPublication SKIPPED
> Task :solr:modules:hadoop-auth:generatePomFileForJarsPublication
> Task :solr:modules:hadoop-auth:renderJavadoc
> Task :solr:modules:hadoop-auth:javadoc SKIPPED
> Task :solr:modules:hadoop-auth:javadocJar
> Task :solr:modules:hadoop-auth:sourcesJar
> Task :solr:modules:hadoop-auth:signJarsPublication SKIPPED
> Task :solr:modules:hadoop-auth:publishJarsPublicationToBuildRepository

> Task :solr:modules:hdfs:compileJava
Note: Some input files use or override a deprecated API.
Note: Recompile with -Xlint:deprecation for details.

> Task :solr:modules:hdfs:processResources NO-SOURCE
> Task :solr:modules:hdfs:classes
> Task :solr:modules:hdfs:jar
> Task :solr:modules:hdfs:generateMetadataFileForJarsPublication SKIPPED
> Task :solr:modules:hdfs:generatePomFileForJarsPublication
> Task :solr:modules:hdfs:renderJavadoc
> Task :solr:modules:hdfs:javadoc SKIPPED
> Task :solr:modules:hdfs:javadocJar
> Task :solr:modules:hdfs:sourcesJar
> Task :solr:modules:hdfs:signJarsPublication SKIPPED
> Task :solr:modules:hdfs:publishJarsPublicationToBuildRepository
> Task :solr:modules:jaegertracer-configurator:compileJava
> Task :solr:modules:jaegertracer-configurator:processResources NO-SOURCE
> Task :solr:modules:jaegertracer-configurator:classes
> Task :solr:modules:jaegertracer-configurator:jar
> Task :solr:modules:jaegertracer-configurator:generateMetadataFileForJarsPublication SKIPPED
> Task :solr:modules:jaegertracer-configurator:generatePomFileForJarsPublication
> Task :solr:modules:jaegertracer-configurator:renderJavadoc
> Task :solr:modules:jaegertracer-configurator:javadoc SKIPPED
> Task :solr:modules:jaegertracer-configurator:javadocJar
> Task :solr:modules:jaegertracer-configurator:sourcesJar
> Task :solr:modules:jaegertracer-configurator:signJarsPublication SKIPPED
> Task :solr:modules:jaegertracer-configurator:publishJarsPublicationToBuildRepository
> Task :solr:modules:jwt-auth:compileJava
> Task :solr:modules:jwt-auth:processResources NO-SOURCE
> Task :solr:modules:jwt-auth:classes
> Task :solr:modules:jwt-auth:jar
> Task :solr:modules:jwt-auth:generateMetadataFileForJarsPublication SKIPPED
> Task :solr:modules:jwt-auth:generatePomFileForJarsPublication
> Task :solr:modules:jwt-auth:renderJavadoc
> Task :solr:modules:jwt-auth:javadoc SKIPPED
> Task :solr:modules:jwt-auth:javadocJar
> Task :solr:modules:jwt-auth:sourcesJar
> Task :solr:modules:jwt-auth:signJarsPublication SKIPPED
> Task :solr:modules:jwt-auth:publishJarsPublicationToBuildRepository

> Task :solr:modules:langid:compileJava
Note: Some input files use or override a deprecated API.
Note: Recompile with -Xlint:deprecation for details.

> Task :solr:modules:langid:processResources
> Task :solr:modules:langid:classes
> Task :solr:modules:langid:jar
> Task :solr:modules:langid:generateMetadataFileForJarsPublication SKIPPED
> Task :solr:modules:langid:generatePomFileForJarsPublication
> Task :solr:modules:langid:renderJavadoc
> Task :solr:modules:langid:javadoc SKIPPED
> Task :solr:modules:langid:javadocJar
> Task :solr:modules:langid:sourcesJar
> Task :solr:modules:langid:signJarsPublication SKIPPED
> Task :solr:modules:langid:publishJarsPublicationToBuildRepository

> Task :solr:modules:ltr:compileJava
Note: Some input files use or override a deprecated API.
Note: Recompile with -Xlint:deprecation for details.

> Task :solr:modules:ltr:processResources NO-SOURCE
> Task :solr:modules:ltr:classes
> Task :solr:modules:ltr:jar
> Task :solr:modules:ltr:generateMetadataFileForJarsPublication SKIPPED
> Task :solr:modules:ltr:generatePomFileForJarsPublication
> Task :solr:modules:ltr:renderJavadoc
> Task :solr:modules:ltr:javadoc SKIPPED
> Task :solr:modules:ltr:javadocJar
> Task :solr:modules:ltr:sourcesJar
> Task :solr:modules:ltr:signJarsPublication SKIPPED
> Task :solr:modules:ltr:publishJarsPublicationToBuildRepository
> Task :solr:modules:opentelemetry:compileJava
> Task :solr:modules:opentelemetry:processResources NO-SOURCE
> Task :solr:modules:opentelemetry:classes
> Task :solr:modules:opentelemetry:jar
> Task :solr:modules:opentelemetry:generateMetadataFileForJarsPublication SKIPPED
> Task :solr:modules:opentelemetry:generatePomFileForJarsPublication
> Task :solr:modules:opentelemetry:renderJavadoc
> Task :solr:modules:opentelemetry:javadoc SKIPPED
> Task :solr:modules:opentelemetry:javadocJar
> Task :solr:modules:opentelemetry:sourcesJar
> Task :solr:modules:opentelemetry:signJarsPublication SKIPPED
> Task :solr:modules:opentelemetry:publishJarsPublicationToBuildRepository
> Task :solr:modules:s3-repository:compileJava
> Task :solr:modules:s3-repository:processResources NO-SOURCE
> Task :solr:modules:s3-repository:classes
> Task :solr:modules:s3-repository:jar
> Task :solr:modules:s3-repository:generateMetadataFileForJarsPublication SKIPPED
> Task :solr:modules:s3-repository:generatePomFileForJarsPublication
> Task :solr:modules:s3-repository:renderJavadoc
> Task :solr:modules:s3-repository:javadoc SKIPPED
> Task :solr:modules:s3-repository:javadocJar
> Task :solr:modules:s3-repository:sourcesJar
> Task :solr:modules:s3-repository:signJarsPublication SKIPPED
> Task :solr:modules:s3-repository:publishJarsPublicationToBuildRepository

> Task :solr:modules:scripting:compileJava
Note: /home/jenkins/jenkins-slave/workspace/Solr/Solr-Smoketest-9.x/solr/modules/scripting/src/java/org/apache/solr/scripting/xslt/XSLTUpdateRequestHandler.java uses or overrides a deprecated API.
Note: Recompile with -Xlint:deprecation for details.

> Task :solr:modules:scripting:processResources NO-SOURCE
> Task :solr:modules:scripting:classes
> Task :solr:modules:scripting:jar
> Task :solr:modules:scripting:generateMetadataFileForJarsPublication SKIPPED
> Task :solr:modules:scripting:generatePomFileForJarsPublication
> Task :solr:modules:scripting:renderJavadoc
> Task :solr:modules:scripting:javadoc SKIPPED
> Task :solr:modules:scripting:javadocJar
> Task :solr:modules:scripting:sourcesJar
> Task :solr:modules:scripting:signJarsPublication SKIPPED
> Task :solr:modules:scripting:publishJarsPublicationToBuildRepository

> Task :solr:modules:sql:compileJava
Note: Some input files use or override a deprecated API.
Note: Recompile with -Xlint:deprecation for details.

> Task :solr:modules:sql:processResources
> Task :solr:modules:sql:classes
> Task :solr:modules:sql:jar
> Task :solr:modules:sql:generateMetadataFileForJarsPublication SKIPPED
> Task :solr:modules:sql:generatePomFileForJarsPublication
> Task :solr:modules:sql:renderJavadoc
> Task :solr:modules:sql:javadoc SKIPPED
> Task :solr:modules:sql:javadocJar
> Task :solr:modules:sql:sourcesJar
> Task :solr:modules:sql:signJarsPublication SKIPPED
> Task :solr:modules:sql:publishJarsPublicationToBuildRepository

> Task :mavenToLocalFolder
Local maven artifacts (poms, jars) created at: /home/jenkins/jenkins-slave/workspace/Solr/Solr-Smoketest-9.x/build/maven-local

> Task :checkWorkingCopyClean
> Task :solr:distribution:assembleSourceTgz
> Task :solr:docker:createBodySnippetDockerfile
> Task :solr:docker:createDockerfileLocal
> Task :solr:docker:assemblePackaging
> Task :solr:documentation:changesToHtml
> Task :solr:documentation:copyDocumentationAssets
> Task :solr:documentation:markdownToHtml
> Task :solr:documentation:copyChangesToHtmlForMiniSite
> Task :solr:documentation:copyMiniDocumentationAssets
> Task :solr:documentation:createMiniDocumentationIndex
> Task :solr:documentation:documentationMinimal
> Task :solr:core:assemblePostJar
> Task :solr:example:assemblePackaging
> Task :solr:prometheus-exporter:assemblePackaging
> Task :solr:webapp:compileJava NO-SOURCE
> Task :solr:webapp:processResources NO-SOURCE
> Task :solr:webapp:classes UP-TO-DATE

> Task :solr:api:buildJSClient
################################################################################
# Thanks for using OpenAPI Generator.                                          #
# Please consider donation to help us maintain this project 🙏                 #
# https://opencollective.com/openapi_generator/donate                          #
################################################################################
Successfully generated code to /home/jenkins/jenkins-slave/workspace/Solr/Solr-Smoketest-9.x/solr/api/build/generated/js

> Task :solr:webapp:nodeSetup
> Task :solr:webapp:npmSetup SKIPPED

> Task :solr:webapp:downloadBrowserify

added 163 packages, changed 1 package, and audited 165 packages in 3s

30 packages are looking for funding
  run `npm fund` for details

found 0 vulnerabilities

> Task :solr:webapp:syncJSClientSourceCode

> Task :solr:webapp:jsClientDownloadDeps
npm WARN deprecated @babel/plugin-proposal-numeric-separator@7.18.6: This proposal has been merged to the ECMAScript standard and thus this plugin is no longer maintained. Please use @babel/plugin-transform-numeric-separator instead.
npm WARN deprecated @babel/plugin-proposal-nullish-coalescing-operator@7.18.6: This proposal has been merged to the ECMAScript standard and thus this plugin is no longer maintained. Please use @babel/plugin-transform-nullish-coalescing-operator instead.
npm WARN deprecated @babel/plugin-proposal-json-strings@7.18.6: This proposal has been merged to the ECMAScript standard and thus this plugin is no longer maintained. Please use @babel/plugin-transform-json-strings instead.
npm WARN deprecated @babel/plugin-proposal-export-namespace-from@7.18.9: This proposal has been merged to the ECMAScript standard and thus this plugin is no longer maintained. Please use @babel/plugin-transform-export-namespace-from instead.
npm WARN deprecated @babel/plugin-proposal-class-properties@7.18.6: This proposal has been merged to the ECMAScript standard and thus this plugin is no longer maintained. Please use @babel/plugin-transform-class-properties instead.
npm WARN deprecated @babel/plugin-proposal-logical-assignment-operators@7.20.7: This proposal has been merged to the ECMAScript standard and thus this plugin is no longer maintained. Please use @babel/plugin-transform-logical-assignment-operators instead.
npm WARN deprecated @babel/plugin-proposal-optional-chaining@7.21.0: This proposal has been merged to the ECMAScript standard and thus this plugin is no longer maintained. Please use @babel/plugin-transform-optional-chaining instead.
npm WARN deprecated formidable@1.2.6: Please upgrade to latest, formidable@v2 or formidable@v3! Check these notes: https://bit.ly/2ZEqIau
npm WARN deprecated superagent@5.3.1: Please upgrade to v7.0.2+ of superagent.  We have fixed numerous issues with streams, form-data, attach(), filesystem errors not bubbling up (ENOENT on attach()), and all tests are now passing.  See the releases tab for more information at <https://github.com/visionmedia/superagent/releases>.
npm WARN deprecated sinon@7.5.0: 16.1.1

> v2_api@9.5.0 prepare
> npm run build


> v2_api@9.5.0 build
> babel src -d dist

Successfully compiled 78 files with Babel (1958ms).

added 354 packages, and audited 355 packages in 11s

40 packages are looking for funding
  run `npm fund` for details

3 vulnerabilities (1 moderate, 2 high)

To address all issues (including breaking changes), run:
  npm audit fix --force

Run `npm audit` for details.

> Task :solr:webapp:jsClientBuild

> v2_api@9.5.0 build
> babel src -d dist

Successfully compiled 78 files with Babel (1972ms).

> Task :solr:webapp:generateJsClientBundle
> Task :solr:webapp:finalizeJsBundleDir
> Task :solr:webapp:war
> Task :solr:server:assemblePackaging
> Task :solr:modules:analysis-extras:assemblePackaging
> Task :solr:modules:analytics:assemblePackaging
> Task :solr:modules:clustering:assemblePackaging
> Task :solr:modules:extraction:assemblePackaging
> Task :solr:modules:gcs-repository:assemblePackaging
> Task :solr:modules:hadoop-auth:assemblePackaging
> Task :solr:modules:hdfs:assemblePackaging
> Task :solr:modules:jaegertracer-configurator:assemblePackaging
> Task :solr:modules:jwt-auth:assemblePackaging
> Task :solr:modules:langid:assemblePackaging
> Task :solr:modules:ltr:assemblePackaging
> Task :solr:modules:opentelemetry:assemblePackaging
> Task :solr:modules:s3-repository:assemblePackaging
> Task :solr:modules:scripting:assemblePackaging
> Task :solr:modules:sql:assemblePackaging
> Task :solr:packaging:fullDistTar
> Task :solr:packaging:slimDistTar
> Task :solr:distribution:computeChecksums
> Task :solr:distribution:prepareGitRev
> Task :solr:docker:createDockerfileOfficialFull
> Task :solr:docker:createDockerfileOfficialSlim
> Task :solr:distribution:assembleRelease

Deprecated Gradle features were used in this build, making it incompatible with Gradle 9.0.

You can use '--warning-mode all' to show the individual deprecation warnings and determine if they come from your own scripts or plugins.

For more on this, please refer to https://docs.gradle.org/8.4/userguide/command_line_interface.html#sec:command_line_warnings in the Gradle documentation.

BUILD SUCCESSFUL in 5m 4s
254 actionable tasks: 246 executed, 8 up-to-date
Build step 'Invoke Gradle script' changed build result to SUCCESS
Run condition [Always] enabling perform for step [Execute shell]
[Solr-Smoketest-9.x] $ /bin/bash /tmp/jenkins3967276784733049841.sh
Installing Python script requirements
Defaulting to user installation because normal site-packages is not writeable
Collecting six~=1.16.0
  Using cached six-1.16.0-py2.py3-none-any.whl (11 kB)
ERROR: Could not find a version that satisfies the requirement Jinja2~=3.1.1 (from versions: 2.0rc1, 2.0, 2.1, 2.1.1, 2.2, 2.2.1, 2.3, 2.3.1, 2.4, 2.4.1, 2.5, 2.5.1, 2.5.2, 2.5.3, 2.5.4, 2.5.5, 2.6, 2.7, 2.7.1, 2.7.2, 2.7.3, 2.8, 2.8.1, 2.9, 2.9.1, 2.9.2, 2.9.3, 2.9.4, 2.9.5, 2.9.6, 2.10, 2.10.1, 2.10.2, 2.10.3, 2.11.0, 2.11.1, 2.11.2, 2.11.3, 3.0.0a1, 3.0.0rc1, 3.0.0rc2, 3.0.0, 3.0.1, 3.0.2, 3.0.3)
ERROR: No matching distribution found for Jinja2~=3.1.1
Starting Smoke tester in folder /home/jenkins/jenkins-slave/workspace/Solr/Solr-Smoketest-9.x
Java 11 JAVA_HOME=/home/jenkins/tools/java/latest11
NOTE: output encoding is UTF-8
NOTE: Not running @Nightly or @BadApple tests. Please verify that recent Jenkins runs have passed.

Load release URL "file:///home/jenkins/jenkins-slave/workspace/Solr/Solr-Smoketest-9.x/solr/distribution/build/release"...

Get KEYS...
    Downloading online KEYS file https://archive.apache.org/dist/solr/KEYS
Downloading https://archive.apache.org/dist/solr/KEYS
    0.3 MB in 1.17 sec (0.3 MB/sec)

Test Solr...
  test basics...
  check changes HTML...
  check OpenAPI specification...
  download solr-9.5.0-slim.tgz...
Downloading file:///home/jenkins/jenkins-slave/workspace/Solr/Solr-Smoketest-9.x/solr/distribution/build/release/solr-9.5.0-slim.tgz
    61.1 MB in 0.05 sec (1235.2 MB/sec)
    verify sha512 digest
  download solr-9.5.0-src.tgz...
Downloading file:///home/jenkins/jenkins-slave/workspace/Solr/Solr-Smoketest-9.x/solr/distribution/build/release/solr-9.5.0-src.tgz
    86.0 MB in 0.07 sec (1275.5 MB/sec)
    verify sha512 digest
  download solr-9.5.0.tgz...
Downloading file:///home/jenkins/jenkins-slave/workspace/Solr/Solr-Smoketest-9.x/solr/distribution/build/release/solr-9.5.0.tgz
    268.2 MB in 0.21 sec (1249.7 MB/sec)
    verify sha512 digest
  unpack solr-9.5.0.tgz...
  solr-9.5.0.tgz
    Checking LICENSE.txt
    Checking NOTICE.txt
    Checking README.txt
    Checking CHANGES.txt
    Checking bin
    Checking modules
    Checking docker
    Checking prometheus-exporter
    Checking docs
    Checking example
    Checking licenses
    Checking server
    Checking lib
    verify JAR metadata/identity/no javax.* or java.* classes...
      **WARNING**: skipping check of /home/jenkins/jenkins-slave/workspace/Solr/Solr-Smoketest-9.x/_tmp/smoke_1702969630/unpack/solr-9.5.0/server/solr-webapp/webapp/WEB-INF/lib/jakarta.xml.bind-api-2.3.3.jar: it has javax.* classes
      **WARNING**: skipping check of /home/jenkins/jenkins-slave/workspace/Solr/Solr-Smoketest-9.x/_tmp/smoke_1702969630/unpack/solr-9.5.0/server/solr-webapp/webapp/WEB-INF/lib/jakarta.annotation-api-1.3.5.jar: it has javax.* classes
      **WARNING**: skipping check of /home/jenkins/jenkins-slave/workspace/Solr/Solr-Smoketest-9.x/_tmp/smoke_1702969630/unpack/solr-9.5.0/server/solr-webapp/webapp/WEB-INF/lib/jakarta.ws.rs-api-2.1.6.jar: it has javax.* classes
      **WARNING**: skipping check of /home/jenkins/jenkins-slave/workspace/Solr/Solr-Smoketest-9.x/_tmp/smoke_1702969630/unpack/solr-9.5.0/server/solr-webapp/webapp/WEB-INF/lib/jakarta.inject-2.6.1.jar: it has javax.* classes
      **WARNING**: skipping check of /home/jenkins/jenkins-slave/workspace/Solr/Solr-Smoketest-9.x/_tmp/smoke_1702969630/unpack/solr-9.5.0/server/solr-webapp/webapp/WEB-INF/lib/jakarta.validation-api-2.0.2.jar: it has javax.* classes
      **WARNING**: skipping check of /home/jenkins/jenkins-slave/workspace/Solr/Solr-Smoketest-9.x/_tmp/smoke_1702969630/unpack/solr-9.5.0/server/lib/ext/jetty-servlet-api-4.0.6.jar: it has javax.* classes
      **WARNING**: skipping check of /home/jenkins/jenkins-slave/workspace/Solr/Solr-Smoketest-9.x/_tmp/smoke_1702969630/unpack/solr-9.5.0/modules/extraction/lib/jakarta.activation-1.2.2.jar: it has javax.* classes
      **WARNING**: skipping check of /home/jenkins/jenkins-slave/workspace/Solr/Solr-Smoketest-9.x/_tmp/smoke_1702969630/unpack/solr-9.5.0/modules/extraction/lib/jakarta.activation-api-1.2.2.jar: it has javax.* classes
      **WARNING**: skipping check of /home/jenkins/jenkins-slave/workspace/Solr/Solr-Smoketest-9.x/_tmp/smoke_1702969630/unpack/solr-9.5.0/modules/extraction/lib/unit-api-1.0.jar: it has javax.* classes
    copying unpacked distribution for Java 11 ...
    test solr example w/ Java 11...
      start Solr instance (log=/home/jenkins/jenkins-slave/workspace/Solr/Solr-Smoketest-9.x/_tmp/smoke_1702969630/unpack/solr-9.5.0-java11/solr-example.log)...
No process found for Solr node running on port 8983
      Running techproducts example on port 8983 from /home/jenkins/jenkins-slave/workspace/Solr/Solr-Smoketest-9.x/_tmp/smoke_1702969630/unpack/solr-9.5.0-java11
*** [WARN] *** Your open file limit is currently 60000.  
 It should be set to 65000 to avoid operational disruption. 
 If you no longer wish to see this warning, set SOLR_ULIMIT_CHECKS to false in your profile or solr.in.sh
*** [WARN] ***  Your Max Processes Limit is currently 30000. 
 It should be set to 65000 to avoid operational disruption. 
 If you no longer wish to see this warning, set SOLR_ULIMIT_CHECKS to false in your profile or solr.in.sh
Creating Solr home directory /home/jenkins/jenkins-slave/workspace/Solr/Solr-Smoketest-9.x/_tmp/smoke_1702969630/unpack/solr-9.5.0-java11/example/techproducts/solr

Starting up Solr on port 8983 using command:
"bin/solr" start -p 8983 -s "example/techproducts/solr"

*** [WARN] *** Your open file limit is currently 60000.  
 It should be set to 65000 to avoid operational disruption. 
 If you no longer wish to see this warning, set SOLR_ULIMIT_CHECKS to false in your profile or solr.in.sh
*** [WARN] ***  Your Max Processes Limit is currently 30000. 
 It should be set to 65000 to avoid operational disruption. 
 If you no longer wish to see this warning, set SOLR_ULIMIT_CHECKS to false in your profile or solr.in.sh
Waiting up to 180 seconds to see Solr running on port 8983 [|]   [/]   [-]   [\]   [|]  
Started Solr server on port 8983 (pid=24291). Happy searching!

    
Created new core 'techproducts'
Indexing tech product example docs from /home/jenkins/jenkins-slave/workspace/Solr/Solr-Smoketest-9.x/_tmp/smoke_1702969630/unpack/solr-9.5.0-java11/example/exampledocs
SimplePostTool version 9.5.0
Posting files to [base] url http://localhost:8983/solr/techproducts/update using content-type application/xml...
POSTing file mp500.xml to [base]
POSTing file ipod_video.xml to [base]
POSTing file monitor2.xml to [base]
POSTing file gb18030-example.xml to [base]
POSTing file vidcard.xml to [base]
POSTing file money.xml to [base]
POSTing file hd.xml to [base]
POSTing file ipod_other.xml to [base]
POSTing file sd500.xml to [base]
POSTing file solr.xml to [base]
POSTing file utf8-example.xml to [base]
POSTing file monitor.xml to [base]
POSTing file manufacturers.xml to [base]
POSTing file mem.xml to [base]
14 files indexed.
COMMITting Solr index changes to http://localhost:8983/solr/techproducts/update...
Time spent: 0:00:01.977
      test utf8...
      run query...
      stop server using: bin/solr stop -p 8983
Sending stop command to Solr running on port 8983 ... waiting up to 180 seconds to allow Jetty process 24291 to stop gracefully.
 [|]   [/]   [-]   [\]   [|]        unpack solr-9.5.0-slim.tgz...
  solr-9.5.0-slim.tgz
    Checking LICENSE.txt
    Checking NOTICE.txt
    Checking README.txt
    Checking CHANGES.txt
    Checking bin
    Checking docker
    Checking docs
    Checking example
    Checking licenses
    Checking server
    Checking lib
    verify JAR metadata/identity/no javax.* or java.* classes...
      **WARNING**: skipping check of /home/jenkins/jenkins-slave/workspace/Solr/Solr-Smoketest-9.x/_tmp/smoke_1702969630/unpack/solr-9.5.0-slim/server/solr-webapp/webapp/WEB-INF/lib/jakarta.xml.bind-api-2.3.3.jar: it has javax.* classes
      **WARNING**: skipping check of /home/jenkins/jenkins-slave/workspace/Solr/Solr-Smoketest-9.x/_tmp/smoke_1702969630/unpack/solr-9.5.0-slim/server/solr-webapp/webapp/WEB-INF/lib/jakarta.annotation-api-1.3.5.jar: it has javax.* classes
      **WARNING**: skipping check of /home/jenkins/jenkins-slave/workspace/Solr/Solr-Smoketest-9.x/_tmp/smoke_1702969630/unpack/solr-9.5.0-slim/server/solr-webapp/webapp/WEB-INF/lib/jakarta.ws.rs-api-2.1.6.jar: it has javax.* classes
      **WARNING**: skipping check of /home/jenkins/jenkins-slave/workspace/Solr/Solr-Smoketest-9.x/_tmp/smoke_1702969630/unpack/solr-9.5.0-slim/server/solr-webapp/webapp/WEB-INF/lib/jakarta.inject-2.6.1.jar: it has javax.* classes
      **WARNING**: skipping check of /home/jenkins/jenkins-slave/workspace/Solr/Solr-Smoketest-9.x/_tmp/smoke_1702969630/unpack/solr-9.5.0-slim/server/solr-webapp/webapp/WEB-INF/lib/jakarta.validation-api-2.0.2.jar: it has javax.* classes
      **WARNING**: skipping check of /home/jenkins/jenkins-slave/workspace/Solr/Solr-Smoketest-9.x/_tmp/smoke_1702969630/unpack/solr-9.5.0-slim/server/lib/ext/jetty-servlet-api-4.0.6.jar: it has javax.* classes
    copying unpacked distribution for Java 11 ...
    test solr example w/ Java 11...
      start Solr instance (log=/home/jenkins/jenkins-slave/workspace/Solr/Solr-Smoketest-9.x/_tmp/smoke_1702969630/unpack/solr-9.5.0-slim-java11/solr-example.log)...
No process found for Solr node running on port 8983
      Running techproducts example on port 8983 from /home/jenkins/jenkins-slave/workspace/Solr/Solr-Smoketest-9.x/_tmp/smoke_1702969630/unpack/solr-9.5.0-slim-java11
*** [WARN] *** Your open file limit is currently 60000.  
 It should be set to 65000 to avoid operational disruption. 
 If you no longer wish to see this warning, set SOLR_ULIMIT_CHECKS to false in your profile or solr.in.sh
*** [WARN] ***  Your Max Processes Limit is currently 30000. 
 It should be set to 65000 to avoid operational disruption. 
 If you no longer wish to see this warning, set SOLR_ULIMIT_CHECKS to false in your profile or solr.in.sh
Creating Solr home directory /home/jenkins/jenkins-slave/workspace/Solr/Solr-Smoketest-9.x/_tmp/smoke_1702969630/unpack/solr-9.5.0-slim-java11/example/techproducts/solr

Starting up Solr on port 8983 using command:
"bin/solr" start -p 8983 -s "example/techproducts/solr"

*** [WARN] *** Your open file limit is currently 60000.  
 It should be set to 65000 to avoid operational disruption. 
 If you no longer wish to see this warning, set SOLR_ULIMIT_CHECKS to false in your profile or solr.in.sh
*** [WARN] ***  Your Max Processes Limit is currently 30000. 
 It should be set to 65000 to avoid operational disruption. 
 If you no longer wish to see this warning, set SOLR_ULIMIT_CHECKS to false in your profile or solr.in.sh
Waiting up to 180 seconds to see Solr running on port 8983 [|]   [/]   [-]   [\]   [|]  
Started Solr server on port 8983 (pid=24751). Happy searching!

    
Created new core 'techproducts'
Indexing tech product example docs from /home/jenkins/jenkins-slave/workspace/Solr/Solr-Smoketest-9.x/_tmp/smoke_1702969630/unpack/solr-9.5.0-slim-java11/example/exampledocs
SimplePostTool version 9.5.0
Posting files to [base] url http://localhost:8983/solr/techproducts/update using content-type application/xml...
POSTing file mp500.xml to [base]
POSTing file ipod_video.xml to [base]
POSTing file monitor2.xml to [base]
POSTing file gb18030-example.xml to [base]
POSTing file vidcard.xml to [base]
POSTing file money.xml to [base]
POSTing file hd.xml to [base]
POSTing file ipod_other.xml to [base]
POSTing file sd500.xml to [base]
POSTing file solr.xml to [base]
POSTing file utf8-example.xml to [base]
POSTing file monitor.xml to [base]
POSTing file manufacturers.xml to [base]
POSTing file mem.xml to [base]
14 files indexed.
COMMITting Solr index changes to http://localhost:8983/solr/techproducts/update...
Time spent: 0:00:00.648
      test utf8...
      run query...
      stop server using: bin/solr stop -p 8983
Sending stop command to Solr running on port 8983 ... waiting up to 180 seconds to allow Jetty process 24751 to stop gracefully.
 [|]   [/]   [-]   [\]        unpack solr-9.5.0-src.tgz...
  solr-9.5.0-src.tgz
    Checking LICENSE.txt
    Checking NOTICE.txt
    Checking README.md
    Checking CONTRIBUTING.md
    Checking CHANGES.txt
    Checking README.adoc
    Checking buildSrc
    Checking dev-docs
    Checking dev-tools
    Checking gradle
    Checking help
    Checking solr
    Checking build.gradle
    Checking gradlew
    Checking gradlew.bat
    Checking settings.gradle
    Checking versions.lock
    Checking versions.props
    Checking benchmark
    Checking bin
    Checking modules
    Checking api
    Checking core
    Checking docker
    Checking documentation
    Checking example
    Checking licenses
    Checking packaging
    Checking distribution
    Checking prometheus-exporter
    Checking server
    Checking solr-ref-guide
    Checking solrj
    Checking solrj-streaming
    Checking solrj-zookeeper
    Checking test-framework
    Checking webapp
    Checking .gitignore
    Checking .gitattributes
    Checking build.gradle
    make sure no JARs/WARs in src dist...
    run "./gradlew --no-daemon check -p solr/documentation"
    run tests w/ Java 11 and testArgs='-Dtests.nightly=false -Dtests.badapples=false '...

command "export JAVA_HOME="/home/jenkins/tools/java/latest11" PATH="/home/jenkins/tools/java/latest11/bin:$PATH" JAVACMD="/home/jenkins/tools/java/latest11/bin/java"; ./gradlew --no-daemon test -Dtests.nightly=false -Dtests.badapples=false " failed:
To honour the JVM settings for this build a single-use Daemon process will be forked. For more on this, please refer to https://docs.gradle.org/8.4/userguide/gradle_daemon.html#sec:disabling_the_daemon in the Gradle documentation.
Daemon will be stopped at the end of the build 
Gradle Enterprise plugins resolution: https://plugins.gradle.org/m2
Applying com.gradle.enterprise.gradleplugin.GradleEnterprisePlugin via init script
Connection to Gradle Enterprise: https://ge.apache.org, allowUntrustedServer: false
Enforcing Gradle Enterprise: https://ge.apache.org, allowUntrustedServer: false
Applying com.gradle.CommonCustomUserDataGradlePlugin via init script
> Task :buildSrc:compileJava UP-TO-DATE
> Task :buildSrc:compileGroovy NO-SOURCE
> Task :buildSrc:processResources NO-SOURCE
> Task :buildSrc:classes UP-TO-DATE
> Task :buildSrc:jar UP-TO-DATE
> Task :solr:api:processResources NO-SOURCE
> Task :solr:api:processTestResources
> Task :solr:core:processResources UP-TO-DATE
> Task :solr:solrj:processResources UP-TO-DATE
> Task :solr:solrj-streaming:processResources UP-TO-DATE
> Task :solr:solrj-zookeeper:processResources NO-SOURCE
> Task :solr:test-framework:processResources
> Task :solr:benchmark:processResources
> Task :solr:benchmark:processTestResources
> Task :gitStatus
> Task :checkJdkInternalsExportedToGradle
> Task :solr:api:compileJava UP-TO-DATE
> Task :solr:api:classes UP-TO-DATE
> Task :solr:api:jar UP-TO-DATE
> Task :ensureJdkSupported

> Task :randomizationInfo
Running tests with randomization seed: tests.seed=A04AF63069A9B07E

> Task :solr:api:resolve UP-TO-DATE
> Task :solr:core:processTestResources
> Task :solr:modules:analysis-extras:processResources NO-SOURCE
> Task :solr:prometheus-exporter:processResources NO-SOURCE
> Task :solr:prometheus-exporter:processTestResources
> Task :solr:server:compileJava SKIPPED
> Task :solr:server:processResources NO-SOURCE
> Task :solr:server:classes UP-TO-DATE
> Task :solr:server:compileTestJava NO-SOURCE
> Task :solr:server:processTestResources NO-SOURCE
> Task :solr:server:testClasses UP-TO-DATE
> Task :solr:server:test NO-SOURCE
> Task :solr:server:wipeTaskTemp
> Task :solr:solr-ref-guide:compileJava NO-SOURCE
> Task :solr:solr-ref-guide:processResources NO-SOURCE
> Task :solr:solr-ref-guide:classes UP-TO-DATE
> Task :solr:solr-ref-guide:copySolrjTestResources
> Task :solr:solr-ref-guide:processTestResources NO-SOURCE
> Task :solr:solrj-streaming:processTestResources
> Task :solr:modules:sql:processResources
> Task :solr:solrj-zookeeper:processTestResources
> Task :solr:test-framework:processTestResources
> Task :solr:webapp:processResources NO-SOURCE
> Task :solr:webapp:processTestResources NO-SOURCE
> Task :solr:modules:analysis-extras:processTestResources
> Task :solr:modules:analytics:processResources NO-SOURCE
> Task :solr:modules:analytics:processTestResources
> Task :solr:modules:clustering:processResources NO-SOURCE
> Task :solr:modules:clustering:processTestResources
> Task :solr:modules:extraction:processResources
> Task :solr:modules:extraction:processTestResources
> Task :solr:modules:gcs-repository:processResources NO-SOURCE
> Task :solr:modules:gcs-repository:processTestResources
> Task :solr:modules:hadoop-auth:processResources NO-SOURCE
> Task :solr:modules:hadoop-auth:copySolrCoreTestResources
> Task :solr:modules:hadoop-auth:processTestResources
> Task :solr:modules:hdfs:processResources NO-SOURCE
> Task :solr:modules:hdfs:copySolrCoreTestResources
> Task :solr:modules:hdfs:processTestResources
> Task :solr:modules:jaegertracer-configurator:processResources NO-SOURCE
> Task :solr:modules:jaegertracer-configurator:processTestResources
> Task :solr:modules:jwt-auth:processResources NO-SOURCE
> Task :solr:modules:jwt-auth:processTestResources
> Task :solr:modules:langid:processResources
> Task :solr:modules:langid:processTestResources
> Task :solr:modules:ltr:processResources NO-SOURCE
> Task :solr:modules:ltr:processTestResources
> Task :solr:modules:opentelemetry:processResources NO-SOURCE
> Task :solr:modules:opentelemetry:processTestResources
> Task :solr:modules:s3-repository:processResources NO-SOURCE
> Task :solr:modules:s3-repository:processTestResources
> Task :solr:modules:scripting:processResources NO-SOURCE
> Task :solr:modules:scripting:processTestResources
> Task :solr:modules:sql:copySolrCoreTestResources
> Task :solr:modules:sql:processTestResources

> Task :solr:solrj:openApiGenerate
################################################################################
# Thanks for using OpenAPI Generator.                                          #
# Please consider donation to help us maintain this project 🙏                 #
# https://opencollective.com/openapi_generator/donate                          #
################################################################################
Successfully generated code to /home/jenkins/jenkins-slave/workspace/Solr/Solr-Smoketest-9.x/_tmp/smoke_1702969630/unpack/solr-9.5.0/solr/solrj/build/generated/

> Task :spotlessInternalRegisterDependencies UP-TO-DATE
> Task :solr:solrj:compileJava UP-TO-DATE
> Task :solr:solrj-streaming:compileJava UP-TO-DATE
> Task :solr:solrj-zookeeper:compileJava UP-TO-DATE
> Task :solr:core:compileJava UP-TO-DATE
> Task :solr:test-framework:compileJava UP-TO-DATE
> Task :solr:solrj:generatedSpotlessHelper
> Task :solr:solrj:generatedSpotless
> Task :solr:core:classes UP-TO-DATE
> Task :solr:core:jar UP-TO-DATE
> Task :solr:solrj:classes UP-TO-DATE
> Task :solr:solrj:jar UP-TO-DATE
> Task :solr:solrj-streaming:classes UP-TO-DATE
> Task :solr:solrj-streaming:jar UP-TO-DATE
> Task :solr:solrj-zookeeper:classes UP-TO-DATE
> Task :solr:solrj-zookeeper:jar UP-TO-DATE
> Task :solr:test-framework:classes
> Task :solr:test-framework:jar
> Task :solr:api:compileTestJava
> Task :solr:api:testClasses

> Task :solr:benchmark:compileJava
Note: /home/jenkins/jenkins-slave/workspace/Solr/Solr-Smoketest-9.x/_tmp/smoke_1702969630/unpack/solr-9.5.0/solr/benchmark/src/java/org/apache/solr/bench/search/StreamingSearch.java uses or overrides a deprecated API.
Note: Recompile with -Xlint:deprecation for details.

> Task :solr:benchmark:classes
> Task :solr:benchmark:compileTestJava
> Task :solr:benchmark:testClasses

> Task :solr:api:test
:solr:api:test (SUCCESS): 6 test(s)

> Task :solr:api:wipeTaskTemp

> Task :solr:benchmark:test
:solr:benchmark:test (SUCCESS): 11 test(s)

> Task :solr:benchmark:wipeTaskTemp

> Task :solr:modules:analysis-extras:compileJava
Note: /home/jenkins/jenkins-slave/workspace/Solr/Solr-Smoketest-9.x/_tmp/smoke_1702969630/unpack/solr-9.5.0/solr/modules/analysis-extras/src/java/org/apache/solr/schema/ICUCollationField.java uses or overrides a deprecated API.
Note: Recompile with -Xlint:deprecation for details.

> Task :solr:modules:analysis-extras:classes
> Task :solr:modules:analysis-extras:jar

> Task :solr:prometheus-exporter:compileJava
Note: Some input files use or override a deprecated API.
Note: Recompile with -Xlint:deprecation for details.

> Task :solr:prometheus-exporter:classes

> Task :solr:prometheus-exporter:compileTestJava
Note: /home/jenkins/jenkins-slave/workspace/Solr/Solr-Smoketest-9.x/_tmp/smoke_1702969630/unpack/solr-9.5.0/solr/prometheus-exporter/src/test/org/apache/solr/prometheus/exporter/MetricsQueryTemplateTest.java uses or overrides a deprecated API.
Note: Recompile with -Xlint:deprecation for details.

> Task :solr:prometheus-exporter:testClasses
> Task :solr:core:compileTestJava

> Task :solr:prometheus-exporter:test
:solr:prometheus-exporter:test (SUCCESS): 23 test(s)

> Task :solr:prometheus-exporter:wipeTaskTemp

> Task :solr:solr-ref-guide:compileTestJava
Note: Some input files use or override a deprecated API.
Note: Recompile with -Xlint:deprecation for details.

> Task :solr:solr-ref-guide:testClasses

> Task :solr:solr-ref-guide:test
:solr:solr-ref-guide:test (SUCCESS): 32 test(s)

> Task :solr:solr-ref-guide:wipeTaskTemp

> Task :solr:core:compileTestJava
Note: Some input files use or override a deprecated API.
Note: Recompile with -Xlint:deprecation for details.

> Task :solr:core:testClasses

> Task :solr:solrj:compileTestJava
Note: Some input files use or override a deprecated API.
Note: Recompile with -Xlint:deprecation for details.

> Task :solr:solrj:processTestResources
> Task :solr:solrj:testClasses
> Task :solr:core:test
> Task :solr:solrj:test

> Task :solr:core:test
WARNING: Test org.apache.solr.TestRandomFaceting wrote 14,153,136 bytes of output.

org.apache.solr.cloud.TestQueryingOnDownCollection > testQueryToDownCollectionShouldFailFast FAILED
    junit.framework.AssertionFailedError: Request should fail after trying all replica nodes once
        at __randomizedtesting.SeedInfo.seed([A04AF63069A9B07E:7397DF9ACE98D902]:0)
        at org.apache.lucene.tests.util.LuceneTestCase.expectThrows(LuceneTestCase.java:2864)
        at org.apache.solr.cloud.TestQueryingOnDownCollection.testQueryToDownCollectionShouldFailFast(TestQueryingOnDownCollection.java:93)
        at java.base/jdk.internal.reflect.NativeMethodAccessorImpl.invoke0(Native Method)
        at java.base/jdk.internal.reflect.NativeMethodAccessorImpl.invoke(NativeMethodAccessorImpl.java:62)
        at java.base/jdk.internal.reflect.DelegatingMethodAccessorImpl.invoke(DelegatingMethodAccessorImpl.java:43)
        at java.base/java.lang.reflect.Method.invoke(Method.java:566)
        at com.carrotsearch.randomizedtesting.RandomizedRunner.invoke(RandomizedRunner.java:1758)
        at com.carrotsearch.randomizedtesting.RandomizedRunner$8.evaluate(RandomizedRunner.java:946)
        at com.carrotsearch.randomizedtesting.RandomizedRunner$9.evaluate(RandomizedRunner.java:982)
        at com.carrotsearch.randomizedtesting.RandomizedRunner$10.evaluate(RandomizedRunner.java:996)
        at com.carrotsearch.randomizedtesting.rules.SystemPropertiesRestoreRule$1.evaluate(SystemPropertiesRestoreRule.java:80)
        at org.junit.rules.RunRules.evaluate(RunRules.java:20)
        at org.apache.lucene.tests.util.TestRuleSetupTeardownChained$1.evaluate(TestRuleSetupTeardownChained.java:48)
        at org.apache.lucene.tests.util.AbstractBeforeAfterRule$1.evaluate(AbstractBeforeAfterRule.java:43)
        at org.apache.lucene.tests.util.TestRuleThreadAndTestName$1.evaluate(TestRuleThreadAndTestName.java:45)
        at org.apache.lucene.tests.util.TestRuleIgnoreAfterMaxFailures$1.evaluate(TestRuleIgnoreAfterMaxFailures.java:60)
        at org.apache.lucene.tests.util.TestRuleMarkFailure$1.evaluate(TestRuleMarkFailure.java:44)
        at org.junit.rules.RunRules.evaluate(RunRules.java:20)
        at com.carrotsearch.randomizedtesting.rules.StatementAdapter.evaluate(StatementAdapter.java:36)
        at com.carrotsearch.randomizedtesting.ThreadLeakControl$StatementRunner.run(ThreadLeakControl.java:390)
        at com.carrotsearch.randomizedtesting.ThreadLeakControl.forkTimeoutingTask(ThreadLeakControl.java:843)
        at com.carrotsearch.randomizedtesting.ThreadLeakControl$3.evaluate(ThreadLeakControl.java:490)
        at com.carrotsearch.randomizedtesting.RandomizedRunner.runSingleTest(RandomizedRunner.java:955)
        at com.carrotsearch.randomizedtesting.RandomizedRunner$5.evaluate(RandomizedRunner.java:840)
        at com.carrotsearch.randomizedtesting.RandomizedRunner$6.evaluate(RandomizedRunner.java:891)
        at com.carrotsearch.randomizedtesting.RandomizedRunner$7.evaluate(RandomizedRunner.java:902)
        at com.carrotsearch.randomizedtesting.rules.StatementAdapter.evaluate(StatementAdapter.java:36)
        at com.carrotsearch.randomizedtesting.rules.StatementAdapter.evaluate(StatementAdapter.java:36)
        at org.apache.lucene.tests.util.AbstractBeforeAfterRule$1.evaluate(AbstractBeforeAfterRule.java:43)
        at org.apache.lucene.tests.util.AbstractBeforeAfterRule$1.evaluate(AbstractBeforeAfterRule.java:43)
        at com.carrotsearch.randomizedtesting.rules.SystemPropertiesRestoreRule$1.evaluate(SystemPropertiesRestoreRule.java:80)
        at org.junit.rules.RunRules.evaluate(RunRules.java:20)
        at org.apache.lucene.tests.util.AbstractBeforeAfterRule$1.evaluate(AbstractBeforeAfterRule.java:43)
        at com.carrotsearch.randomizedtesting.rules.StatementAdapter.evaluate(StatementAdapter.java:36)
        at org.apache.lucene.tests.util.TestRuleStoreClassName$1.evaluate(TestRuleStoreClassName.java:38)
        at com.carrotsearch.randomizedtesting.rules.NoShadowingOrOverridesOnMethodsRule$1.evaluate(NoShadowingOrOverridesOnMethodsRule.java:40)
        at com.carrotsearch.randomizedtesting.rules.NoShadowingOrOverridesOnMethodsRule$1.evaluate(NoShadowingOrOverridesOnMethodsRule.java:40)
        at com.carrotsearch.randomizedtesting.rules.StatementAdapter.evaluate(StatementAdapter.java:36)
        at com.carrotsearch.randomizedtesting.rules.StatementAdapter.evaluate(StatementAdapter.java:36)
        at org.apache.lucene.tests.util.TestRuleAssertionsRequired$1.evaluate(TestRuleAssertionsRequired.java:53)
        at org.apache.lucene.tests.util.AbstractBeforeAfterRule$1.evaluate(AbstractBeforeAfterRule.java:43)
        at org.apache.lucene.tests.util.TestRuleMarkFailure$1.evaluate(TestRuleMarkFailure.java:44)
        at org.apache.lucene.tests.util.TestRuleIgnoreAfterMaxFailures$1.evaluate(TestRuleIgnoreAfterMaxFailures.java:60)
        at org.apache.lucene.tests.util.TestRuleIgnoreTestSuites$1.evaluate(TestRuleIgnoreTestSuites.java:47)
        at org.junit.rules.RunRules.evaluate(RunRules.java:20)
        at com.carrotsearch.randomizedtesting.rules.StatementAdapter.evaluate(StatementAdapter.java:36)
        at com.carrotsearch.randomizedtesting.ThreadLeakControl$StatementRunner.run(ThreadLeakControl.java:390)
        at com.carrotsearch.randomizedtesting.ThreadLeakControl.lambda$forkTimeoutingTask$0(ThreadLeakControl.java:850)
        at java.base/java.lang.Thread.run(Thread.java:829)

org.apache.solr.cloud.TestQueryingOnDownCollection > classMethod FAILED
    java.lang.AssertionError: ObjectTracker found 1 object(s) that were not released!!! [InternalHttpClient]
    org.apache.http.impl.client.InternalHttpClient:org.apache.solr.common.util.ObjectReleaseTracker$ObjectTrackerException: org.apache.http.impl.client.InternalHttpClient
    	at org.apache.solr.common.util.ObjectReleaseTracker.track(ObjectReleaseTracker.java:52)
    	at org.apache.solr.client.solrj.impl.HttpClientUtil.createClient(HttpClientUtil.java:378)
    	at org.apache.solr.client.solrj.impl.HttpClientUtil.createClient(HttpClientUtil.java:387)
    	at org.apache.solr.client.solrj.impl.HttpClientUtil.createClient(HttpClientUtil.java:313)
    	at org.apache.solr.client.solrj.impl.HttpClientUtil.createClient(HttpClientUtil.java:298)
    	at org.apache.solr.client.solrj.impl.HttpSolrClient.<init>(HttpSolrClient.java:180)
    	at org.apache.solr.client.solrj.impl.HttpSolrClient$Builder.build(HttpSolrClient.java:1057)
    	at org.apache.solr.embedded.JettySolrRunner.newClient(JettySolrRunner.java:870)
    	at org.apache.solr.cloud.TestQueryingOnDownCollection.testQueryToDownCollectionShouldFailFast(TestQueryingOnDownCollection.java:82)
    	at java.base/jdk.internal.reflect.NativeMethodAccessorImpl.invoke0(Native Method)
    	at java.base/jdk.internal.reflect.NativeMethodAccessorImpl.invoke(NativeMethodAccessorImpl.java:62)
    	at java.base/jdk.internal.reflect.DelegatingMethodAccessorImpl.invoke(DelegatingMethodAccessorImpl.java:43)
    	at java.base/java.lang.reflect.Method.invoke(Method.java:566)
    	at com.carrotsearch.randomizedtesting.RandomizedRunner.invoke(RandomizedRunner.java:1758)
    	at com.carrotsearch.randomizedtesting.RandomizedRunner$8.evaluate(RandomizedRunner.java:946)
    	at com.carrotsearch.randomizedtesting.RandomizedRunner$9.evaluate(RandomizedRunner.java:982)
    	at com.carrotsearch.randomizedtesting.RandomizedRunner$10.evaluate(RandomizedRunner.java:996)
    	at com.carrotsearch.randomizedtesting.rules.SystemPropertiesRestoreRule$1.evaluate(SystemPropertiesRestoreRule.java:80)
    	at org.junit.rules.RunRules.evaluate(RunRules.java:20)
    	at org.apache.lucene.tests.util.TestRuleSetupTeardownChained$1.evaluate(TestRuleSetupTeardownChained.java:48)
    	at org.apache.lucene.tests.util.AbstractBeforeAfterRule$1.evaluate(AbstractBeforeAfterRule.java:43)
    	at org.apache.lucene.tests.util.TestRuleThreadAndTestName$1.evaluate(TestRuleThreadAndTestName.java:45)
    	at org.apache.lucene.tests.util.TestRuleIgnoreAfterMaxFailures$1.evaluate(TestRuleIgnoreAfterMaxFailures.java:60)
    	at org.apache.lucene.tests.util.TestRuleMarkFailure$1.evaluate(TestRuleMarkFailure.java:44)
    	at org.junit.rules.RunRules.evaluate(RunRules.java:20)
    	at com.carrotsearch.randomizedtesting.rules.StatementAdapter.evaluate(StatementAdapter.java:36)
    	at com.carrotsearch.randomizedtesting.ThreadLeakControl$StatementRunner.run(ThreadLeakControl.java:390)
    	at com.carrotsearch.randomizedtesting.ThreadLeakControl.forkTimeoutingTask(ThreadLeakControl.java:843)
    	at com.carrotsearch.randomizedtesting.ThreadLeakControl$3.evaluate(ThreadLeakControl.java:490)
    	at com.carrotsearch.randomizedtesting.RandomizedRunner.runSingleTest(RandomizedRunner.java:955)
    	at com.carrotsearch.randomizedtesting.RandomizedRunner$5.evaluate(RandomizedRunner.java:840)
    	at com.carrotsearch.randomizedtesting.RandomizedRunner$6.evaluate(RandomizedRunner.java:891)
    	at com.carrotsearch.randomizedtesting.RandomizedRunner$7.evaluate(RandomizedRunner.java:902)
    	at com.carrotsearch.randomizedtesting.rules.StatementAdapter.evaluate(StatementAdapter.java:36)
    	at com.carrotsearch.randomizedtesting.rules.StatementAdapter.evaluate(StatementAdapter.java:36)
    	at org.apache.lucene.tests.util.AbstractBeforeAfterRule$1.evaluate(AbstractBeforeAfterRule.java:43)
    	at org.apache.lucene.tests.util.AbstractBeforeAfterRule$1.evaluate(AbstractBeforeAfterRule.java:43)
    	at com.carrotsearch.randomizedtesting.rules.SystemPropertiesRestoreRule$1.evaluate(SystemPropertiesRestoreRule.java:80)
    	at org.junit.rules.RunRules.evaluate(RunRules.java:20)
    	at org.apache.lucene.tests.util.AbstractBeforeAfterRule$1.evaluate(AbstractBeforeAfterRule.java:43)
    	at com.carrotsearch.randomizedtesting.rules.StatementAdapter.evaluate(StatementAdapter.java:36)
    	at org.apache.lucene.tests.util.TestRuleStoreClassName$1.evaluate(TestRuleStoreClassName.java:38)
    	at com.carrotsearch.randomizedtesting.rules.NoShadowingOrOverridesOnMethodsRule$1.evaluate(NoShadowingOrOverridesOnMethodsRule.java:40)
    	at com.carrotsearch.randomizedtesting.rules.NoShadowingOrOverridesOnMethodsRule$1.evaluate(NoShadowingOrOverridesOnMethodsRule.java:40)
    	at com.carrotsearch.randomizedtesting.rules.StatementAdapter.evaluate(StatementAdapter.java:36)
    	at com.carrotsearch.randomizedtesting.rules.StatementAdapter.evaluate(StatementAdapter.java:36)
    	at org.apache.lucene.tests.util.TestRuleAssertionsRequired$1.evaluate(TestRuleAssertionsRequired.java:53)
    	at org.apache.lucene.tests.util.AbstractBeforeAfterRule$1.evaluate(AbstractBeforeAfterRule.java:43)
    	at org.apache.lucene.tests.util.TestRuleMarkFailure$1.evaluate(TestRuleMarkFailure.java:44)
    	at org.apache.lucene.tests.util.TestRuleIgnoreAfterMaxFailures$1.evaluate(TestRuleIgnoreAfterMaxFailures.java:60)
    	at org.apache.lucene.tests.util.TestRuleIgnoreTestSuites$1.evaluate(TestRuleIgnoreTestSuites.java:47)
    	at org.junit.rules.RunRules.evaluate(RunRules.java:20)
    	at com.carrotsearch.randomizedtesting.rules.StatementAdapter.evaluate(StatementAdapter.java:36)
    	at com.carrotsearch.randomizedtesting.ThreadLeakControl$StatementRunner.run(ThreadLeakControl.java:390)
    	at com.carrotsearch.randomizedtesting.ThreadLeakControl.lambda$forkTimeoutingTask$0(ThreadLeakControl.java:850)
    	at java.base/java.lang.Thread.run(Thread.java:829)

     expected null, but was:<ObjectTracker found 1 object(s) that were not released!!! [InternalHttpClient]
    org.apache.http.impl.client.InternalHttpClient:org.apache.solr.common.util.ObjectReleaseTracker$ObjectTrackerException: org.apache.http.impl.client.InternalHttpClient
    	at org.apache.solr.common.util.ObjectReleaseTracker.track(ObjectReleaseTracker.java:52)
    	at org.apache.solr.client.solrj.impl.HttpClientUtil.createClient(HttpClientUtil.java:378)
    	at org.apache.solr.client.solrj.impl.HttpClientUtil.createClient(HttpClientUtil.java:387)
    	at org.apache.solr.client.solrj.impl.HttpClientUtil.createClient(HttpClientUtil.java:313)
    	at org.apache.solr.client.solrj.impl.HttpClientUtil.createClient(HttpClientUtil.java:298)
    	at org.apache.solr.client.solrj.impl.HttpSolrClient.<init>(HttpSolrClient.java:180)
    	at org.apache.solr.client.solrj.impl.HttpSolrClient$Builder.build(HttpSolrClient.java:1057)
    	at org.apache.solr.embedded.JettySolrRunner.newClient(JettySolrRunner.java:870)
    	at org.apache.solr.cloud.TestQueryingOnDownCollection.testQueryToDownCollectionShouldFailFast(TestQueryingOnDownCollection.java:82)
    	at java.base/jdk.internal.reflect.NativeMethodAccessorImpl.invoke0(Native Method)
    	at java.base/jdk.internal.reflect.NativeMethodAccessorImpl.invoke(NativeMethodAccessorImpl.java:62)
    	at java.base/jdk.internal.reflect.DelegatingMethodAccessorImpl.invoke(DelegatingMethodAccessorImpl.java:43)
    	at java.base/java.lang.reflect.Method.invoke(Method.java:566)
    	at com.carrotsearch.randomizedtesting.RandomizedRunner.invoke(RandomizedRunner.java:1758)
    	at com.carrotsearch.randomizedtesting.RandomizedRunner$8.evaluate(RandomizedRunner.java:946)
    	at com.carrotsearch.randomizedtesting.RandomizedRunner$9.evaluate(RandomizedRunner.java:982)
    	at com.carrotsearch.randomizedtesting.RandomizedRunner$10.evaluate(RandomizedRunner.java:996)
    	at com.carrotsearch.randomizedtesting.rules.SystemPropertiesRestoreRule$1.evaluate(SystemPropertiesRestoreRule.java:80)
    	at org.junit.rules.RunRules.evaluate(RunRules.java:20)
    	at org.apache.lucene.tests.util.TestRuleSetupTeardownChained$1.evaluate(TestRuleSetupTeardownChained.java:48)
    	at org.apache.lucene.tests.util.AbstractBeforeAfterRule$1.evaluate(AbstractBeforeAfterRule.java:43)
    	at org.apache.lucene.tests.util.TestRuleThreadAndTestName$1.evaluate(TestRuleThreadAndTestName.java:45)
    	at org.apache.lucene.tests.util.TestRuleIgnoreAfterMaxFailures$1.evaluate(TestRuleIgnoreAfterMaxFailures.java:60)
    	at org.apache.lucene.tests.util.TestRuleMarkFailure$1.evaluate(TestRuleMarkFailure.java:44)
    	at org.junit.rules.RunRules.evaluate(RunRules.java:20)
    	at com.carrotsearch.randomizedtesting.rules.StatementAdapter.evaluate(StatementAdapter.java:36)
    	at com.carrotsearch.randomizedtesting.ThreadLeakControl$StatementRunner.run(ThreadLeakControl.java:390)
    	at com.carrotsearch.randomizedtesting.ThreadLeakControl.forkTimeoutingTask(ThreadLeakControl.java:843)
    	at com.carrotsearch.randomizedtesting.ThreadLeakControl$3.evaluate(ThreadLeakControl.java:490)
    	at com.carrotsearch.randomizedtesting.RandomizedRunner.runSingleTest(RandomizedRunner.java:955)
    	at com.carrotsearch.randomizedtesting.RandomizedRunner$5.evaluate(RandomizedRunner.java:840)
    	at com.carrotsearch.randomizedtesting.RandomizedRunner$6.evaluate(RandomizedRunner.java:891)
    	at com.carrotsearch.randomizedtesting.RandomizedRunner$7.evaluate(RandomizedRunner.java:902)
    	at com.carrotsearch.randomizedtesting.rules.StatementAdapter.evaluate(StatementAdapter.java:36)
    	at com.carrotsearch.randomizedtesting.rules.StatementAdapter.evaluate(StatementAdapter.java:36)
    	at org.apache.lucene.tests.util.AbstractBeforeAfterRule$1.evaluate(AbstractBeforeAfterRule.java:43)
    	at org.apache.lucene.tests.util.AbstractBeforeAfterRule$1.evaluate(AbstractBeforeAfterRule.java:43)
    	at com.carrotsearch.randomizedtesting.rules.SystemPropertiesRestoreRule$1.evaluate(SystemPropertiesRestoreRule.java:80)
    	at org.junit.rules.RunRules.evaluate(RunRules.java:20)
    	at org.apache.lucene.tests.util.AbstractBeforeAfterRule$1.evaluate(AbstractBeforeAfterRule.java:43)
    	at com.carrotsearch.randomizedtesting.rules.StatementAdapter.evaluate(StatementAdapter.java:36)
    	at org.apache.lucene.tests.util.TestRuleStoreClassName$1.evaluate(TestRuleStoreClassName.java:38)
    	at com.carrotsearch.randomizedtesting.rules.NoShadowingOrOverridesOnMethodsRule$1.evaluate(NoShadowingOrOverridesOnMethodsRule.java:40)
    	at com.carrotsearch.randomizedtesting.rules.NoShadowingOrOverridesOnMethodsRule$1.evaluate(NoShadowingOrOverridesOnMethodsRule.java:40)
    	at com.carrotsearch.randomizedtesting.rules.StatementAdapter.evaluate(StatementAdapter.java:36)
    	at com.carrotsearch.randomizedtesting.rules.StatementAdapter.evaluate(StatementAdapter.java:36)
    	at org.apache.lucene.tests.util.TestRuleAssertionsRequired$1.evaluate(TestRuleAssertionsRequired.java:53)
    	at org.apache.lucene.tests.util.AbstractBeforeAfterRule$1.evaluate(AbstractBeforeAfterRule.java:43)
    	at org.apache.lucene.tests.util.TestRuleMarkFailure$1.evaluate(TestRuleMarkFailure.java:44)
    	at org.apache.lucene.tests.util.TestRuleIgnoreAfterMaxFailures$1.evaluate(TestRuleIgnoreAfterMaxFailures.java:60)
    	at org.apache.lucene.tests.util.TestRuleIgnoreTestSuites$1.evaluate(TestRuleIgnoreTestSuites.java:47)
    	at org.junit.rules.RunRules.evaluate(RunRules.java:20)
    	at com.carrotsearch.randomizedtesting.rules.StatementAdapter.evaluate(StatementAdapter.java:36)
    	at com.carrotsearch.randomizedtesting.ThreadLeakControl$StatementRunner.run(ThreadLeakControl.java:390)
    	at com.carrotsearch.randomizedtesting.ThreadLeakControl.lambda$forkTimeoutingTask$0(ThreadLeakControl.java:850)
    	at java.base/java.lang.Thread.run(Thread.java:829)

    >
        at __randomizedtesting.SeedInfo.seed([A04AF63069A9B07E]:0)
        at org.junit.Assert.fail(Assert.java:89)
        at org.junit.Assert.failNotNull(Assert.java:756)
        at org.junit.Assert.assertNull(Assert.java:738)
        at org.apache.solr.SolrTestCase$1.afterIfSuccessful(SolrTestCase.java:100)
        at com.carrotsearch.randomizedtesting.rules.StatementAdapter.evaluate(StatementAdapter.java:37)
        at com.carrotsearch.randomizedtesting.rules.StatementAdapter.evaluate(StatementAdapter.java:36)
        at org.apache.lucene.tests.util.AbstractBeforeAfterRule$1.evaluate(AbstractBeforeAfterRule.java:43)
        at org.apache.lucene.tests.util.AbstractBeforeAfterRule$1.evaluate(AbstractBeforeAfterRule.java:43)
        at com.carrotsearch.randomizedtesting.rules.SystemPropertiesRestoreRule$1.evaluate(SystemPropertiesRestoreRule.java:80)
        at org.junit.rules.RunRules.evaluate(RunRules.java:20)
        at org.apache.lucene.tests.util.AbstractBeforeAfterRule$1.evaluate(AbstractBeforeAfterRule.java:43)
        at com.carrotsearch.randomizedtesting.rules.StatementAdapter.evaluate(StatementAdapter.java:36)
        at org.apache.lucene.tests.util.TestRuleStoreClassName$1.evaluate(TestRuleStoreClassName.java:38)
        at com.carrotsearch.randomizedtesting.rules.NoShadowingOrOverridesOnMethodsRule$1.evaluate(NoShadowingOrOverridesOnMethodsRule.java:40)
        at com.carrotsearch.randomizedtesting.rules.NoShadowingOrOverridesOnMethodsRule$1.evaluate(NoShadowingOrOverridesOnMethodsRule.java:40)
        at com.carrotsearch.randomizedtesting.rules.StatementAdapter.evaluate(StatementAdapter.java:36)
        at com.carrotsearch.randomizedtesting.rules.StatementAdapter.evaluate(StatementAdapter.java:36)
        at org.apache.lucene.tests.util.TestRuleAssertionsRequired$1.evaluate(TestRuleAssertionsRequired.java:53)
        at org.apache.lucene.tests.util.AbstractBeforeAfterRule$1.evaluate(AbstractBeforeAfterRule.java:43)
        at org.apache.lucene.tests.util.TestRuleMarkFailure$1.evaluate(TestRuleMarkFailure.java:44)
        at org.apache.lucene.tests.util.TestRuleIgnoreAfterMaxFailures$1.evaluate(TestRuleIgnoreAfterMaxFailures.java:60)
        at org.apache.lucene.tests.util.TestRuleIgnoreTestSuites$1.evaluate(TestRuleIgnoreTestSuites.java:47)
        at org.junit.rules.RunRules.evaluate(RunRules.java:20)
        at com.carrotsearch.randomizedtesting.rules.StatementAdapter.evaluate(StatementAdapter.java:36)
        at com.carrotsearch.randomizedtesting.ThreadLeakControl$StatementRunner.run(ThreadLeakControl.java:390)
        at com.carrotsearch.randomizedtesting.ThreadLeakControl.lambda$forkTimeoutingTask$0(ThreadLeakControl.java:850)
        at java.base/java.lang.Thread.run(Thread.java:829)

org.apache.solr.cloud.TestQueryingOnDownCollection > test suite's output saved to /home/jenkins/jenkins-slave/workspace/Solr/Solr-Smoketest-9.x/_tmp/smoke_1702969630/unpack/solr-9.5.0/solr/core/build/test-results/test/outputs/OUTPUT-org.apache.solr.cloud.TestQueryingOnDownCollection.txt, copied below:
  2> 856196 INFO  (SUITE-TestQueryingOnDownCollection-seed#[A04AF63069A9B07E]-worker) [n: c: s: r: x: t:] o.a.s.SolrTestCase Setting 'solr.default.confdir' system property to test-framework derived value of '/home/jenkins/jenkins-slave/workspace/Solr/Solr-Smoketest-9.x/_tmp/smoke_1702969630/unpack/solr-9.5.0/solr/server/solr/configsets/_default/conf'
  2> 856197 INFO  (SUITE-TestQueryingOnDownCollection-seed#[A04AF63069A9B07E]-worker) [n: c: s: r: x: t:] o.a.s.u.ErrorLogMuter Closing ErrorLogMuter-regex-207 after mutting 0 log messages
  2> 856197 INFO  (SUITE-TestQueryingOnDownCollection-seed#[A04AF63069A9B07E]-worker) [n: c: s: r: x: t:] o.a.s.u.ErrorLogMuter Creating ErrorLogMuter-regex-208 for ERROR logs matching regex: ignore_exception
  2> 856198 INFO  (SUITE-TestQueryingOnDownCollection-seed#[A04AF63069A9B07E]-worker) [n: c: s: r: x: t:] o.a.s.SolrTestCaseJ4 Created dataDir: /home/jenkins/jenkins-slave/workspace/Solr/Solr-Smoketest-9.x/_tmp/smoke_1702969630/unpack/solr-9.5.0/solr/core/build/tmp/tests-tmp/solr.cloud.TestQueryingOnDownCollection_A04AF63069A9B07E-001/data-dir-82-001
  2> 856198 WARN  (SUITE-TestQueryingOnDownCollection-seed#[A04AF63069A9B07E]-worker) [n: c: s: r: x: t:] o.a.s.SolrTestCaseJ4 startTrackingSearchers: numOpens=47 numCloses=47
  2> 856198 INFO  (SUITE-TestQueryingOnDownCollection-seed#[A04AF63069A9B07E]-worker) [n: c: s: r: x: t:] o.a.s.SolrTestCaseJ4 Using PointFields (NUMERIC_POINTS_SYSPROP=true) w/NUMERIC_DOCVALUES_SYSPROP=true
  2> 856199 INFO  (SUITE-TestQueryingOnDownCollection-seed#[A04AF63069A9B07E]-worker) [n: c: s: r: x: t:] o.a.s.SolrTestCaseJ4 Randomized ssl (false) and clientAuth (false) via: @org.apache.solr.util.RandomizeSSL(reason="", ssl=0.0/0.0, value=0.0/0.0, clientAuth=0.0/0.0)
  2> 856199 INFO  (SUITE-TestQueryingOnDownCollection-seed#[A04AF63069A9B07E]-worker) [n: c: s: r: x: t:] o.a.s.SolrTestCaseJ4 SecureRandom sanity checks: test.solr.allowed.securerandom=null & java.security.egd=file:/dev/./urandom
  2> 856199 INFO  (SUITE-TestQueryingOnDownCollection-seed#[A04AF63069A9B07E]-worker) [n: c: s: r: x: t:] o.a.s.u.t.SimplePropagator Always-on trace id generation enabled.
  2> 856199 INFO  (SUITE-TestQueryingOnDownCollection-seed#[A04AF63069A9B07E]-worker) [n: c: s: r: x: t:] o.a.s.c.MiniSolrCloudCluster Starting cluster of 3 servers in /home/jenkins/jenkins-slave/workspace/Solr/Solr-Smoketest-9.x/_tmp/smoke_1702969630/unpack/solr-9.5.0/solr/core/build/tmp/tests-tmp/solr.cloud.TestQueryingOnDownCollection_A04AF63069A9B07E-001/tempDir-001
  2> 856199 INFO  (SUITE-TestQueryingOnDownCollection-seed#[A04AF63069A9B07E]-worker) [n: c: s: r: x: t:] o.a.s.c.ZkTestServer STARTING ZK TEST SERVER
  2> 856200 INFO  (ZkTestServer Run Thread) [n: c: s: r: x: t:] o.a.s.c.ZkTestServer client port: /127.0.0.1:0
  2> 856200 INFO  (ZkTestServer Run Thread) [n: c: s: r: x: t:] o.a.s.c.ZkTestServer Starting server
  2> 856201 WARN  (ZkTestServer Run Thread) [n: c: s: r: x: t:] o.a.z.s.ServerCnxnFactory maxCnxns is not configured, using default value 0.
  2> 856300 INFO  (SUITE-TestQueryingOnDownCollection-seed#[A04AF63069A9B07E]-worker) [n: c: s: r: x: t:] o.a.s.c.ZkTestServer start zk server on port: 37609
  2> 856301 WARN  (SUITE-TestQueryingOnDownCollection-seed#[A04AF63069A9B07E]-worker) [n: c: s: r: x: t:] o.a.s.c.c.SolrZkClient Using default ZkCredentialsInjector. ZkCredentialsInjector is not secure, it creates an empty list of credentials which leads to 'OPEN_ACL_UNSAFE' ACLs to Zookeeper nodes
  2> 856301 INFO  (SUITE-TestQueryingOnDownCollection-seed#[A04AF63069A9B07E]-worker) [n: c: s: r: x: t:] o.a.s.c.c.ConnectionManager Waiting up to 30000ms for client to connect to ZooKeeper
  2> 856302 INFO  (zkConnectionManagerCallback-12718-thread-1) [n: c: s: r: x: t:] o.a.s.c.c.ConnectionManager zkClient has connected
  2> 856303 INFO  (SUITE-TestQueryingOnDownCollection-seed#[A04AF63069A9B07E]-worker) [n: c: s: r: x: t:] o.a.s.c.c.ConnectionManager Client is connected to ZooKeeper
  2> 856303 WARN  (SUITE-TestQueryingOnDownCollection-seed#[A04AF63069A9B07E]-worker) [n: c: s: r: x: t:] o.a.s.c.c.SolrZkClient Using default ZkACLProvider. DefaultZkACLProvider is not secure, it creates 'OPEN_ACL_UNSAFE' ACLs to Zookeeper nodes
  2> 856304 WARN  (SUITE-TestQueryingOnDownCollection-seed#[A04AF63069A9B07E]-worker) [n: c: s: r: x: t:] o.a.s.c.c.SolrZkClient Using default ZkCredentialsInjector. ZkCredentialsInjector is not secure, it creates an empty list of credentials which leads to 'OPEN_ACL_UNSAFE' ACLs to Zookeeper nodes
  2> 856304 INFO  (SUITE-TestQueryingOnDownCollection-seed#[A04AF63069A9B07E]-worker) [n: c: s: r: x: t:] o.a.s.c.c.ConnectionManager Waiting up to 30000ms for client to connect to ZooKeeper
  2> 856305 INFO  (zkConnectionManagerCallback-12720-thread-1) [n: c: s: r: x: t:] o.a.s.c.c.ConnectionManager zkClient has connected
  2> 856305 INFO  (SUITE-TestQueryingOnDownCollection-seed#[A04AF63069A9B07E]-worker) [n: c: s: r: x: t:] o.a.s.c.c.ConnectionManager Client is connected to ZooKeeper
  2> 856305 WARN  (SUITE-TestQueryingOnDownCollection-seed#[A04AF63069A9B07E]-worker) [n: c: s: r: x: t:] o.a.s.c.c.SolrZkClient Using default ZkACLProvider. DefaultZkACLProvider is not secure, it creates 'OPEN_ACL_UNSAFE' ACLs to Zookeeper nodes
  2> 856305 WARN  (SUITE-TestQueryingOnDownCollection-seed#[A04AF63069A9B07E]-worker) [n: c: s: r: x: t:] o.a.s.c.c.SolrZkClient Using default ZkCredentialsInjector. ZkCredentialsInjector is not secure, it creates an empty list of credentials which leads to 'OPEN_ACL_UNSAFE' ACLs to Zookeeper nodes
  2> 856306 INFO  (SUITE-TestQueryingOnDownCollection-seed#[A04AF63069A9B07E]-worker) [n: c: s: r: x: t:] o.a.s.c.c.ConnectionManager Waiting up to 15000ms for client to connect to ZooKeeper
  2> 856306 INFO  (zkConnectionManagerCallback-12722-thread-1) [n: c: s: r: x: t:] o.a.s.c.c.ConnectionManager zkClient has connected
  2> 856306 INFO  (SUITE-TestQueryingOnDownCollection-seed#[A04AF63069A9B07E]-worker) [n: c: s: r: x: t:] o.a.s.c.c.ConnectionManager Client is connected to ZooKeeper
  2> 856306 WARN  (SUITE-TestQueryingOnDownCollection-seed#[A04AF63069A9B07E]-worker) [n: c: s: r: x: t:] o.a.s.c.c.SolrZkClient Using default ZkACLProvider. DefaultZkACLProvider is not secure, it creates 'OPEN_ACL_UNSAFE' ACLs to Zookeeper nodes
  2> 856409 INFO  (jetty-launcher-12723-thread-3) [n: c: s: r: x: t:] o.a.s.e.JettySolrRunner Start Jetty (configured port=0, binding port=0)
  2> 856409 INFO  (jetty-launcher-12723-thread-1) [n: c: s: r: x: t:] o.a.s.e.JettySolrRunner Start Jetty (configured port=0, binding port=0)
  2> 856409 INFO  (jetty-launcher-12723-thread-2) [n: c: s: r: x: t:] o.a.s.e.JettySolrRunner Start Jetty (configured port=0, binding port=0)
  2> 856409 INFO  (jetty-launcher-12723-thread-1) [n: c: s: r: x: t:] o.a.s.e.JettySolrRunner Trying to start Jetty on port 0 try number 2 ...
  2> 856409 INFO  (jetty-launcher-12723-thread-2) [n: c: s: r: x: t:] o.a.s.e.JettySolrRunner Trying to start Jetty on port 0 try number 2 ...
  2> 856409 INFO  (jetty-launcher-12723-thread-3) [n: c: s: r: x: t:] o.a.s.e.JettySolrRunner Trying to start Jetty on port 0 try number 2 ...
  2> 856410 INFO  (jetty-launcher-12723-thread-1) [n: c: s: r: x: t:] o.e.j.s.Server jetty-10.0.18; built: 2023-10-27T01:59:58.245Z; git: 8545fd9bf4cd0d0838f626b405fd4963441546b7; jvm 11.0.16.1+1
  2> 856410 INFO  (jetty-launcher-12723-thread-2) [n: c: s: r: x: t:] o.e.j.s.Server jetty-10.0.18; built: 2023-10-27T01:59:58.245Z; git: 8545fd9bf4cd0d0838f626b405fd4963441546b7; jvm 11.0.16.1+1
  2> 856410 INFO  (jetty-launcher-12723-thread-3) [n: c: s: r: x: t:] o.e.j.s.Server jetty-10.0.18; built: 2023-10-27T01:59:58.245Z; git: 8545fd9bf4cd0d0838f626b405fd4963441546b7; jvm 11.0.16.1+1
  2> 856411 INFO  (jetty-launcher-12723-thread-3) [n: c: s: r: x: t:] o.e.j.s.s.DefaultSessionIdManager Session workerName=node0
  2> 856411 INFO  (jetty-launcher-12723-thread-3) [n: c: s: r: x: t:] o.e.j.s.h.ContextHandler Started o.e.j.s.ServletContextHandler@eaaec35{/solr,file:///home/jenkins/jenkins-slave/workspace/Solr/Solr-Smoketest-9.x/_tmp/smoke_1702969630/unpack/solr-9.5.0/solr/core/build/tmp/tests-cwd/,AVAILABLE}
  2> 856412 INFO  (jetty-launcher-12723-thread-3) [n: c: s: r: x: t:] o.e.j.s.AbstractConnector Started ServerConnector@2d5f4c43{HTTP/1.1, (http/1.1, h2c)}{127.0.0.1:44555}
  2> 856412 INFO  (jetty-launcher-12723-thread-1) [n: c: s: r: x: t:] o.e.j.s.s.DefaultSessionIdManager Session workerName=node0
  2> 856412 INFO  (jetty-launcher-12723-thread-3) [n: c: s: r: x: t:] o.e.j.s.Server Started Server@5dc4af40{STARTING}[10.0.18,sto=0] @856437ms
  2> 856412 ERROR (jetty-launcher-12723-thread-3) [n: c: s: r: x: t:] o.a.s.u.StartupLoggingUtils Missing Java Option solr.log.dir. Logging may be missing or incomplete.
  2> 856412 INFO  (jetty-launcher-12723-thread-3) [n: c: s: r: x: t:] o.a.s.s.CoreContainerProvider Using logger factory org.apache.logging.slf4j.Log4jLoggerFactory
  2> 856412 INFO  (jetty-launcher-12723-thread-2) [n: c: s: r: x: t:] o.e.j.s.s.DefaultSessionIdManager Session workerName=node0
  2> 856412 INFO  (jetty-launcher-12723-thread-3) [n: c: s: r: x: t:] o.a.s.s.CoreContainerProvider  ___      _       Welcome to Apache Solr™ version 9.5.0
  2> 856412 INFO  (jetty-launcher-12723-thread-3) [n: c: s: r: x: t:] o.a.s.s.CoreContainerProvider / __| ___| |_ _   Starting in cloud mode on port null
  2> 856412 INFO  (jetty-launcher-12723-thread-3) [n: c: s: r: x: t:] o.a.s.s.CoreContainerProvider \__ \/ _ \ | '_|  Install dir: /home/jenkins/jenkins-slave/workspace/Solr/Solr-Smoketest-9.x/_tmp/smoke_1702969630/unpack/solr-9.5.0/solr
  2> 856412 INFO  (jetty-launcher-12723-thread-3) [n: c: s: r: x: t:] o.a.s.s.CoreContainerProvider |___/\___/_|_|    Start time: 2023-12-19T07:27:05.735407Z
  2> 856412 INFO  (jetty-launcher-12723-thread-3) [n: c: s: r: x: t:] o.a.s.s.CoreContainerProvider Solr Home: /home/jenkins/jenkins-slave/workspace/Solr/Solr-Smoketest-9.x/_tmp/smoke_1702969630/unpack/solr-9.5.0/solr/core/build/tmp/tests-tmp/solr.cloud.TestQueryingOnDownCollection_A04AF63069A9B07E-001/tempDir-001/node3 (source: servlet config: solr.solr.home)
  2> 856412 WARN  (jetty-launcher-12723-thread-3) [n: c: s: r: x: t:] o.a.s.c.c.SolrZkClient Using default ZkCredentialsInjector. ZkCredentialsInjector is not secure, it creates an empty list of credentials which leads to 'OPEN_ACL_UNSAFE' ACLs to Zookeeper nodes
  2> 856412 INFO  (jetty-launcher-12723-thread-2) [n: c: s: r: x: t:] o.e.j.s.h.ContextHandler Started o.e.j.s.ServletContextHandler@64594e68{/solr,file:///home/jenkins/jenkins-slave/workspace/Solr/Solr-Smoketest-9.x/_tmp/smoke_1702969630/unpack/solr-9.5.0/solr/core/build/tmp/tests-cwd/,AVAILABLE}
  2> 856412 INFO  (jetty-launcher-12723-thread-2) [n: c: s: r: x: t:] o.e.j.s.AbstractConnector Started ServerConnector@26a241ca{HTTP/1.1, (http/1.1, h2c)}{127.0.0.1:43955}
  2> 856413 INFO  (jetty-launcher-12723-thread-2) [n: c: s: r: x: t:] o.e.j.s.Server Started Server@56324c20{STARTING}[10.0.18,sto=0] @856438ms
  2> 856413 ERROR (jetty-launcher-12723-thread-2) [n: c: s: r: x: t:] o.a.s.u.StartupLoggingUtils Missing Java Option solr.log.dir. Logging may be missing or incomplete.
  2> 856413 INFO  (jetty-launcher-12723-thread-2) [n: c: s: r: x: t:] o.a.s.s.CoreContainerProvider Using logger factory org.apache.logging.slf4j.Log4jLoggerFactory
  2> 856413 INFO  (jetty-launcher-12723-thread-2) [n: c: s: r: x: t:] o.a.s.s.CoreContainerProvider  ___      _       Welcome to Apache Solr™ version 9.5.0
  2> 856413 INFO  (jetty-launcher-12723-thread-2) [n: c: s: r: x: t:] o.a.s.s.CoreContainerProvider / __| ___| |_ _   Starting in cloud mode on port null
  2> 856413 INFO  (jetty-launcher-12723-thread-2) [n: c: s: r: x: t:] o.a.s.s.CoreContainerProvider \__ \/ _ \ | '_|  Install dir: /home/jenkins/jenkins-slave/workspace/Solr/Solr-Smoketest-9.x/_tmp/smoke_1702969630/unpack/solr-9.5.0/solr
  2> 856413 INFO  (jetty-launcher-12723-thread-2) [n: c: s: r: x: t:] o.a.s.s.CoreContainerProvider |___/\___/_|_|    Start time: 2023-12-19T07:27:05.736207Z
  2> 856413 INFO  (jetty-launcher-12723-thread-2) [n: c: s: r: x: t:] o.a.s.s.CoreContainerProvider Solr Home: /home/jenkins/jenkins-slave/workspace/Solr/Solr-Smoketest-9.x/_tmp/smoke_1702969630/unpack/solr-9.5.0/solr/core/build/tmp/tests-tmp/solr.cloud.TestQueryingOnDownCollection_A04AF63069A9B07E-001/tempDir-001/node2 (source: servlet config: solr.solr.home)
  2> 856413 INFO  (jetty-launcher-12723-thread-1) [n: c: s: r: x: t:] o.e.j.s.h.ContextHandler Started o.e.j.s.ServletContextHandler@7071d21c{/solr,file:///home/jenkins/jenkins-slave/workspace/Solr/Solr-Smoketest-9.x/_tmp/smoke_1702969630/unpack/solr-9.5.0/solr/core/build/tmp/tests-cwd/,AVAILABLE}
  2> 856413 WARN  (jetty-launcher-12723-thread-2) [n: c: s: r: x: t:] o.a.s.c.c.SolrZkClient Using default ZkCredentialsInjector. ZkCredentialsInjector is not secure, it creates an empty list of credentials which leads to 'OPEN_ACL_UNSAFE' ACLs to Zookeeper nodes
  2> 856413 INFO  (jetty-launcher-12723-thread-3) [n: c: s: r: x: t:] o.a.s.c.c.ConnectionManager Waiting up to 30000ms for client to connect to ZooKeeper
  2> 856413 INFO  (jetty-launcher-12723-thread-1) [n: c: s: r: x: t:] o.e.j.s.AbstractConnector Started ServerConnector@5e6c5e1b{HTTP/1.1, (http/1.1, h2c)}{127.0.0.1:38467}
  2> 856414 INFO  (jetty-launcher-12723-thread-1) [n: c: s: r: x: t:] o.e.j.s.Server Started Server@2e84ed27{STARTING}[10.0.18,sto=0] @856439ms
  2> 856414 ERROR (jetty-launcher-12723-thread-1) [n: c: s: r: x: t:] o.a.s.u.StartupLoggingUtils Missing Java Option solr.log.dir. Logging may be missing or incomplete.
  2> 856414 INFO  (jetty-launcher-12723-thread-1) [n: c: s: r: x: t:] o.a.s.s.CoreContainerProvider Using logger factory org.apache.logging.slf4j.Log4jLoggerFactory
  2> 856414 INFO  (jetty-launcher-12723-thread-1) [n: c: s: r: x: t:] o.a.s.s.CoreContainerProvider  ___      _       Welcome to Apache Solr™ version 9.5.0
  2> 856414 INFO  (jetty-launcher-12723-thread-1) [n: c: s: r: x: t:] o.a.s.s.CoreContainerProvider / __| ___| |_ _   Starting in cloud mode on port null
  2> 856414 INFO  (jetty-launcher-12723-thread-1) [n: c: s: r: x: t:] o.a.s.s.CoreContainerProvider \__ \/ _ \ | '_|  Install dir: /home/jenkins/jenkins-slave/workspace/Solr/Solr-Smoketest-9.x/_tmp/smoke_1702969630/unpack/solr-9.5.0/solr
  2> 856414 INFO  (jetty-launcher-12723-thread-1) [n: c: s: r: x: t:] o.a.s.s.CoreContainerProvider |___/\___/_|_|    Start time: 2023-12-19T07:27:05.737217Z
  2> 856414 INFO  (jetty-launcher-12723-thread-2) [n: c: s: r: x: t:] o.a.s.c.c.ConnectionManager Waiting up to 30000ms for client to connect to ZooKeeper
  2> 856414 INFO  (jetty-launcher-12723-thread-1) [n: c: s: r: x: t:] o.a.s.s.CoreContainerProvider Solr Home: /home/jenkins/jenkins-slave/workspace/Solr/Solr-Smoketest-9.x/_tmp/smoke_1702969630/unpack/solr-9.5.0/solr/core/build/tmp/tests-tmp/solr.cloud.TestQueryingOnDownCollection_A04AF63069A9B07E-001/tempDir-001/node1 (source: servlet config: solr.solr.home)
  2> 856414 WARN  (jetty-launcher-12723-thread-1) [n: c: s: r: x: t:] o.a.s.c.c.SolrZkClient Using default ZkCredentialsInjector. ZkCredentialsInjector is not secure, it creates an empty list of credentials which leads to 'OPEN_ACL_UNSAFE' ACLs to Zookeeper nodes
  2> 856415 INFO  (jetty-launcher-12723-thread-1) [n: c: s: r: x: t:] o.a.s.c.c.ConnectionManager Waiting up to 30000ms for client to connect to ZooKeeper
  2> 856415 INFO  (zkConnectionManagerCallback-12725-thread-1) [n: c: s: r: x: t:] o.a.s.c.c.ConnectionManager zkClient has connected
  2> 856415 INFO  (jetty-launcher-12723-thread-3) [n: c: s: r: x: t:] o.a.s.c.c.ConnectionManager Client is connected to ZooKeeper
  2> 856415 INFO  (zkConnectionManagerCallback-12727-thread-1) [n: c: s: r: x: t:] o.a.s.c.c.ConnectionManager zkClient has connected
  2> 856415 WARN  (jetty-launcher-12723-thread-3) [n: c: s: r: x: t:] o.a.s.c.c.SolrZkClient Using default ZkACLProvider. DefaultZkACLProvider is not secure, it creates 'OPEN_ACL_UNSAFE' ACLs to Zookeeper nodes
  2> 856415 INFO  (jetty-launcher-12723-thread-2) [n: c: s: r: x: t:] o.a.s.c.c.ConnectionManager Client is connected to ZooKeeper
  2> 856415 INFO  (zkConnectionManagerCallback-12729-thread-1) [n: c: s: r: x: t:] o.a.s.c.c.ConnectionManager zkClient has connected
  2> 856415 WARN  (jetty-launcher-12723-thread-2) [n: c: s: r: x: t:] o.a.s.c.c.SolrZkClient Using default ZkACLProvider. DefaultZkACLProvider is not secure, it creates 'OPEN_ACL_UNSAFE' ACLs to Zookeeper nodes
  2> 856415 INFO  (jetty-launcher-12723-thread-1) [n: c: s: r: x: t:] o.a.s.c.c.ConnectionManager Client is connected to ZooKeeper
  2> 856415 WARN  (jetty-launcher-12723-thread-1) [n: c: s: r: x: t:] o.a.s.c.c.SolrZkClient Using default ZkACLProvider. DefaultZkACLProvider is not secure, it creates 'OPEN_ACL_UNSAFE' ACLs to Zookeeper nodes
  2> 856416 INFO  (jetty-launcher-12723-thread-3) [n: c: s: r: x: t:] o.a.s.c.NodeConfig solr.xml found in ZooKeeper. Loading...
  2> 856416 INFO  (jetty-launcher-12723-thread-2) [n: c: s: r: x: t:] o.a.s.c.NodeConfig solr.xml found in ZooKeeper. Loading...
  2> 856416 INFO  (jetty-launcher-12723-thread-1) [n: c: s: r: x: t:] o.a.s.c.NodeConfig solr.xml found in ZooKeeper. Loading...
  2> 856417 INFO  (jetty-launcher-12723-thread-3) [n: c: s: r: x: t:] o.a.s.c.SolrXmlConfig Metrics collection is disabled.
  2> 856417 INFO  (jetty-launcher-12723-thread-2) [n: c: s: r: x: t:] o.a.s.c.SolrXmlConfig Metrics collection is disabled.
  2> 856418 INFO  (jetty-launcher-12723-thread-1) [n: c: s: r: x: t:] o.a.s.c.SolrXmlConfig Metrics collection is disabled.
  2> 856530 INFO  (jetty-launcher-12723-thread-1) [n: c: s: r: x: t:] o.a.s.c.ZkContainer Zookeeper client=127.0.0.1:37609/solr
  2> 856530 INFO  (jetty-launcher-12723-thread-1) [n: c: s: r: x: t:] o.a.s.c.DistributedClusterStateUpdater Creating DistributedClusterStateUpdater with useDistributedStateUpdate=false. Solr will be using Overseer based cluster state updates.
  2> 856531 INFO  (jetty-launcher-12723-thread-3) [n: c: s: r: x: t:] o.a.s.c.ZkContainer Zookeeper client=127.0.0.1:37609/solr
  2> 856531 INFO  (jetty-launcher-12723-thread-3) [n: c: s: r: x: t:] o.a.s.c.DistributedClusterStateUpdater Creating DistributedClusterStateUpdater with useDistributedStateUpdate=false. Solr will be using Overseer based cluster state updates.
  2> 856531 INFO  (jetty-launcher-12723-thread-1) [n:127.0.0.1:38467_solr c: s: r: x: t:] o.a.s.c.c.ConnectionManager Waiting up to 15000ms for client to connect to ZooKeeper
  2> 856533 INFO  (jetty-launcher-12723-thread-3) [n:127.0.0.1:44555_solr c: s: r: x: t:] o.a.s.c.c.ConnectionManager Waiting up to 15000ms for client to connect to ZooKeeper
  2> 856534 INFO  (zkConnectionManagerCallback-12752-thread-1) [n: c: s: r: x: t:] o.a.s.c.c.ConnectionManager zkClient has connected
  2> 856534 INFO  (jetty-launcher-12723-thread-1) [n:127.0.0.1:38467_solr c: s: r: x: t:] o.a.s.c.c.ConnectionManager Client is connected to ZooKeeper
  2> 856535 INFO  (jetty-launcher-12723-thread-2) [n: c: s: r: x: t:] o.a.s.c.ZkContainer Zookeeper client=127.0.0.1:37609/solr
  2> 856535 INFO  (jetty-launcher-12723-thread-2) [n: c: s: r: x: t:] o.a.s.c.DistributedClusterStateUpdater Creating DistributedClusterStateUpdater with useDistributedStateUpdate=false. Solr will be using Overseer based cluster state updates.
  2> 856535 INFO  (zkConnectionManagerCallback-12755-thread-1) [n: c: s: r: x: t:] o.a.s.c.c.ConnectionManager zkClient has connected
  2> 856535 INFO  (jetty-launcher-12723-thread-3) [n:127.0.0.1:44555_solr c: s: r: x: t:] o.a.s.c.c.ConnectionManager Client is connected to ZooKeeper
  2> 856536 INFO  (jetty-launcher-12723-thread-2) [n:127.0.0.1:43955_solr c: s: r: x: t:] o.a.s.c.c.ConnectionManager Waiting up to 15000ms for client to connect to ZooKeeper
  2> 856554 INFO  (zkConnectionManagerCallback-12759-thread-1) [n: c: s: r: x: t:] o.a.s.c.c.ConnectionManager zkClient has connected
  2> 856554 INFO  (jetty-launcher-12723-thread-2) [n:127.0.0.1:43955_solr c: s: r: x: t:] o.a.

[...truncated too long message...]

readLeakControl.lambda$forkTimeoutingTask$0(ThreadLeakControl.java:850)
   >     	at java.base/java.lang.Thread.run(Thread.java:829)
   > 
   >     >
   >         at __randomizedtesting.SeedInfo.seed([A04AF63069A9B07E]:0)
   >         at org.junit.Assert.fail(Assert.java:89)
   >         at org.junit.Assert.failNotNull(Assert.java:756)
   >         at org.junit.Assert.assertNull(Assert.java:738)
   >         at org.apache.solr.SolrTestCase$1.afterIfSuccessful(SolrTestCase.java:100)
   >         at com.carrotsearch.randomizedtesting.rules.StatementAdapter.evaluate(StatementAdapter.java:37)
   >         at com.carrotsearch.randomizedtesting.rules.StatementAdapter.evaluate(StatementAdapter.java:36)
   >         at org.apache.lucene.tests.util.AbstractBeforeAfterRule$1.evaluate(AbstractBeforeAfterRule.java:43)
   >         at org.apache.lucene.tests.util.AbstractBeforeAfterRule$1.evaluate(AbstractBeforeAfterRule.java:43)
   >         at com.carrotsearch.randomizedtesting.rules.SystemPropertiesRestoreRule$1.evaluate(SystemPropertiesRestoreRule.java:80)
   >         at org.junit.rules.RunRules.evaluate(RunRules.java:20)
   >         at org.apache.lucene.tests.util.AbstractBeforeAfterRule$1.evaluate(AbstractBeforeAfterRule.java:43)
   >         at com.carrotsearch.randomizedtesting.rules.StatementAdapter.evaluate(StatementAdapter.java:36)
   >         at org.apache.lucene.tests.util.TestRuleStoreClassName$1.evaluate(TestRuleStoreClassName.java:38)
   >         at com.carrotsearch.randomizedtesting.rules.NoShadowingOrOverridesOnMethodsRule$1.evaluate(NoShadowingOrOverridesOnMethodsRule.java:40)
   >         at com.carrotsearch.randomizedtesting.rules.NoShadowingOrOverridesOnMethodsRule$1.evaluate(NoShadowingOrOverridesOnMethodsRule.java:40)
   >         at com.carrotsearch.randomizedtesting.rules.StatementAdapter.evaluate(StatementAdapter.java:36)
   >         at com.carrotsearch.randomizedtesting.rules.StatementAdapter.evaluate(StatementAdapter.java:36)
   >         at org.apache.lucene.tests.util.TestRuleAssertionsRequired$1.evaluate(TestRuleAssertionsRequired.java:53)
   >         at org.apache.lucene.tests.util.AbstractBeforeAfterRule$1.evaluate(AbstractBeforeAfterRule.java:43)
   >         at org.apache.lucene.tests.util.TestRuleMarkFailure$1.evaluate(TestRuleMarkFailure.java:44)
   >         at org.apache.lucene.tests.util.TestRuleIgnoreAfterMaxFailures$1.evaluate(TestRuleIgnoreAfterMaxFailures.java:60)
   >         at org.apache.lucene.tests.util.TestRuleIgnoreTestSuites$1.evaluate(TestRuleIgnoreTestSuites.java:47)
   >         at org.junit.rules.RunRules.evaluate(RunRules.java:20)
   >         at com.carrotsearch.randomizedtesting.rules.StatementAdapter.evaluate(StatementAdapter.java:36)
   >         at com.carrotsearch.randomizedtesting.ThreadLeakControl$StatementRunner.run(ThreadLeakControl.java:390)
   >         at com.carrotsearch.randomizedtesting.ThreadLeakControl.lambda$forkTimeoutingTask$0(ThreadLeakControl.java:850)
   >         at java.base/java.lang.Thread.run(Thread.java:829)
  2> NOTE: test params are: codec=FastDecompressionCompressingStoredFieldsData(storedFieldsFormat=Lucene90CompressingStoredFieldsFormat(compressionMode=FAST_DECOMPRESSION, chunkSize=31, maxDocsPerChunk=9, blockShift=5), termVectorsFormat=Lucene90CompressingTermVectorsFormat(compressionMode=FAST_DECOMPRESSION, chunkSize=31, maxDocsPerChunk=9, blockSize=5)), sim=Asserting(RandomSimilarity(queryNorm=true): {}), locale=fy-NL, timezone=MST
  2> NOTE: Linux 4.15.0-213-generic amd64/Eclipse Adoptium 11.0.16.1 (64-bit)/cpus=1,threads=3,free=93911616,total=511180800
  2> NOTE: All tests run in this JVM: [BasicFunctionalityTest, CursorPagingTest, DistributedIntervalFacetingTest, HelloWorldSolrCloudTestCase, OutputWriterTest, SolrInfoBeanTest, SolrTestCaseJ4Test, TestCursorMarkWithoutUniqueKey, TestDistributedMissingSort, TestDocumentBuilder, TestHighlightDedupGrouping, TestRandomDVFaceting, TestSimpleTrackingShardHandler, TestTolerantSearch, CommonGramsPhraseQueryTest, ProtectedTermFilterFactoryTest, TestDeprecatedFilters, TestReversedWildcardFilterFactory, TokenizerChainTest, ApiToolTest, HealthcheckToolTest, PostToolTest, SolrCliUptimeTest, TestSolrCLIRunExample, TestEmbeddedSolrServerConstructors, ConnectionReuseTest, AddReplicaTest, AssignBackwardCompatibilityTest, BasicDistributedZk2Test, ChaosMonkeyNothingIsSafeTest, ChaosMonkeySafeLeaderTest, CloudExitableDirectoryReaderTest, ClusterStateTest, CollectionPropsTest, CollectionsAPISolrJTest, ConfigSetApiLockingTest, CreateCollectionCleanupTest, CreateRoutedAliasTest, DeleteLastCustomShardedReplicaTest, DeleteReplicaTest, DeleteStatusTest, DistribDocExpirationUpdateProcessorTest, DistributedApiAsyncTrackerTest, DistributedVersionInfoTest, ForceLeaderTest, FullSolrCloudDistribCmdsTest, HttpPartitionTest, LeaderElectionContextKeyTest, LeaderElectionTest, LeaderFailureAfterFreshStartTest, LeaderVoteWaitTimeoutTest, MigrateRouteKeyTest, MoveReplicaTest, MultiThreadedOCPTest, NodeMutatorTest, OutOfBoxZkACLAndCredentialsProvidersTest, OverseerCollectionConfigSetProcessorTest, OverseerRolesTest, OverseerStatusTest, OverseerTest, ParallelCommitExecutionTest, RecoveryAfterSoftCommitTest, ReindexCollectionTest, ReplaceNodeTest, ReplicationFactorTest, RollingRestartTest, SSLMigrationTest, ShardRoutingTest, SliceStateTest, SolrCloudExampleTest, SplitShardTest, SyncSliceTest, TestAuthenticationFramework, TestCloudDeleteByQuery, TestCloudPhrasesIdentificationComponent, TestCloudPseudoReturnFields, TestCloudRecovery2, TestClusterProperties, TestConfigSetsAPIExclusivity, TestConfigSetsAPIZkFailure, TestDistribDocBasedVersion, TestDownShardTolerantSearch, TestExactSharedStatsCacheCloud, TestExclusionRuleCollectionAccess, TestLRUStatsCacheCloud, TestLeaderElectionWithEmptyReplica, TestLocalStatsCacheCloud, TestMiniSolrCloudClusterSSL, TestPrepRecovery, TestPullReplicaErrorHandling, TestQueryingOnDownCollection]
  2> NOTE: reproduce with: gradlew test --tests TestQueryingOnDownCollection -Dtests.seed=A04AF63069A9B07E -Dtests.locale=fy-NL -Dtests.timezone=MST -Dtests.asserts=true -Dtests.file.encoding=UTF-8

WARNING: Test org.apache.solr.schema.DocValuesTest wrote 11,010,548 bytes of output.
WARNING: Test org.apache.solr.schema.TestCloudSchemaless wrote 13,050,429 bytes of output.
WARNING: Test org.apache.solr.search.facet.TestCloudJSONFacetSKG wrote 21,358,337 bytes of output.
:solr:core:test (FAILURE): 4931 test(s), 2 failure(s), 218 skipped

4931 tests completed, 2 failed, 218 skipped

> Task :solr:core:test FAILED
> Task :solr:core:wipeTaskTemp

> Task :solr:solrj:test
:solr:solrj:test (SUCCESS): 1155 test(s), 40 skipped

> Task :solr:solrj:wipeTaskTemp

ERROR: The following test(s) have failed:
  - org.apache.solr.cloud.TestQueryingOnDownCollection.testQueryToDownCollectionShouldFailFast (:solr:core)
    Test output: /home/jenkins/jenkins-slave/workspace/Solr/Solr-Smoketest-9.x/_tmp/smoke_1702969630/unpack/solr-9.5.0/solr/core/build/test-results/test/outputs/OUTPUT-org.apache.solr.cloud.TestQueryingOnDownCollection.txt
    Reproduce with: gradlew :solr:core:test --tests "org.apache.solr.cloud.TestQueryingOnDownCollection.testQueryToDownCollectionShouldFailFast" -Ptests.jvms=2 "-Ptests.jvmargs=-XX:TieredStopAtLevel=1 -XX:+UseParallelGC -XX:ActiveProcessorCount=1 -XX:ReservedCodeCacheSize=120m" -Ptests.seed=A04AF63069A9B07E -Ptests.badapples=false -Ptests.file.encoding=UTF-8

  - org.apache.solr.cloud.TestQueryingOnDownCollection.classMethod (:solr:core)
    Test output: /home/jenkins/jenkins-slave/workspace/Solr/Solr-Smoketest-9.x/_tmp/smoke_1702969630/unpack/solr-9.5.0/solr/core/build/test-results/test/outputs/OUTPUT-org.apache.solr.cloud.TestQueryingOnDownCollection.txt
    Reproduce with: gradlew :solr:core:test --tests "org.apache.solr.cloud.TestQueryingOnDownCollection.classMethod" -Ptests.jvms=2 "-Ptests.jvmargs=-XX:TieredStopAtLevel=1 -XX:+UseParallelGC -XX:ActiveProcessorCount=1 -XX:ReservedCodeCacheSize=120m" -Ptests.seed=A04AF63069A9B07E -Ptests.badapples=false -Ptests.file.encoding=UTF-8


FAILURE: Build failed with an exception.

* What went wrong:
Execution failed for task ':solr:core:test'.
> There were failing tests. See the results at: file:///home/jenkins/jenkins-slave/workspace/Solr/Solr-Smoketest-9.x/_tmp/smoke_1702969630/unpack/solr-9.5.0/solr/core/build/test-results/test/

BUILD FAILED in 41m 29s
81 actionable tasks: 63 executed, 18 up-to-date

Publishing build scan...
https://ge.apache.org/s/yyijqz2jaukgg



Traceback (most recent call last):
  File "dev-tools/scripts/smokeTestRelease.py", line 1196, in <module>
    main()
  File "dev-tools/scripts/smokeTestRelease.py", line 1123, in main
    downloadOnly=c.download_only)
  File "dev-tools/scripts/smokeTestRelease.py", line 1184, in smokeTest
    unpackAndVerify(java, tmpDir, 'solr-%s-src.tgz' % version, gitRevision, version, testArgs)
  File "dev-tools/scripts/smokeTestRelease.py", line 575, in unpackAndVerify
    verifyUnpacked(java, artifact, unpackPath, gitRevision, version, testArgs)
  File "dev-tools/scripts/smokeTestRelease.py", line 666, in verifyUnpacked
    java.run_java11('./gradlew --no-daemon test %s' % testArgs, '%s/test.log' % unpackPath)
  File "dev-tools/scripts/smokeTestRelease.py", line 1032, in run_java
    run('%s; %s' % (cmd_prefix, cmd), logfile)
  File "dev-tools/scripts/smokeTestRelease.py", line 505, in run
    raise RuntimeError('command "%s" failed; see log file %s' % (command, logPath))
RuntimeError: command "export JAVA_HOME="/home/jenkins/tools/java/latest11" PATH="/home/jenkins/tools/java/latest11/bin:$PATH" JAVACMD="/home/jenkins/tools/java/latest11/bin/java"; ./gradlew --no-daemon test -Dtests.nightly=false -Dtests.badapples=false " failed; see log file /home/jenkins/jenkins-slave/workspace/Solr/Solr-Smoketest-9.x/_tmp/smoke_1702969630/unpack/solr-9.5.0/test.log
Build step 'Run with timeout' marked build as failure
Email was triggered for: Failure - Any
Sending email for trigger: Failure - Any