You are viewing a plain text version of this content. The canonical link for it is here.
Posted to dev@lucene.apache.org by Policeman Jenkins Server <je...@thetaphi.de> on 2016/04/11 22:47:02 UTC
[JENKINS] Lucene-Solr-6.x-Linux (64bit/jdk1.8.0_72) - Build # 398 -
Failure!
Build: http://jenkins.thetaphi.de/job/Lucene-Solr-6.x-Linux/398/
Java: 64bit/jdk1.8.0_72 -XX:+UseCompressedOops -XX:+UseG1GC
1 tests failed.
FAILED: junit.framework.TestSuite.org.apache.solr.handler.TestReplicationHandler
Error Message:
ObjectTracker found 3 object(s) that were not released!!! [NRTCachingDirectory, NRTCachingDirectory, NRTCachingDirectory]
Stack Trace:
java.lang.AssertionError: ObjectTracker found 3 object(s) that were not released!!! [NRTCachingDirectory, NRTCachingDirectory, NRTCachingDirectory]
at __randomizedtesting.SeedInfo.seed([EA53F3A6E0853F14]:0)
at org.junit.Assert.fail(Assert.java:93)
at org.junit.Assert.assertTrue(Assert.java:43)
at org.junit.Assert.assertNull(Assert.java:551)
at org.apache.solr.SolrTestCaseJ4.afterClass(SolrTestCaseJ4.java:256)
at sun.reflect.GeneratedMethodAccessor20.invoke(Unknown Source)
at sun.reflect.DelegatingMethodAccessorImpl.invoke(DelegatingMethodAccessorImpl.java:43)
at java.lang.reflect.Method.invoke(Method.java:498)
at com.carrotsearch.randomizedtesting.RandomizedRunner.invoke(RandomizedRunner.java:1764)
at com.carrotsearch.randomizedtesting.RandomizedRunner$7.evaluate(RandomizedRunner.java:834)
at com.carrotsearch.randomizedtesting.rules.StatementAdapter.evaluate(StatementAdapter.java:36)
at com.carrotsearch.randomizedtesting.rules.SystemPropertiesRestoreRule$1.evaluate(SystemPropertiesRestoreRule.java:57)
at org.apache.lucene.util.AbstractBeforeAfterRule$1.evaluate(AbstractBeforeAfterRule.java:45)
at com.carrotsearch.randomizedtesting.rules.StatementAdapter.evaluate(StatementAdapter.java:36)
at org.apache.lucene.util.TestRuleStoreClassName$1.evaluate(TestRuleStoreClassName.java:41)
at com.carrotsearch.randomizedtesting.rules.NoShadowingOrOverridesOnMethodsRule$1.evaluate(NoShadowingOrOverridesOnMethodsRule.java:40)
at com.carrotsearch.randomizedtesting.rules.NoShadowingOrOverridesOnMethodsRule$1.evaluate(NoShadowingOrOverridesOnMethodsRule.java:40)
at com.carrotsearch.randomizedtesting.rules.StatementAdapter.evaluate(StatementAdapter.java:36)
at com.carrotsearch.randomizedtesting.rules.StatementAdapter.evaluate(StatementAdapter.java:36)
at com.carrotsearch.randomizedtesting.rules.StatementAdapter.evaluate(StatementAdapter.java:36)
at org.apache.lucene.util.TestRuleAssertionsRequired$1.evaluate(TestRuleAssertionsRequired.java:53)
at org.apache.lucene.util.TestRuleMarkFailure$1.evaluate(TestRuleMarkFailure.java:47)
at org.apache.lucene.util.TestRuleIgnoreAfterMaxFailures$1.evaluate(TestRuleIgnoreAfterMaxFailures.java:64)
at org.apache.lucene.util.TestRuleIgnoreTestSuites$1.evaluate(TestRuleIgnoreTestSuites.java:54)
at com.carrotsearch.randomizedtesting.rules.StatementAdapter.evaluate(StatementAdapter.java:36)
at com.carrotsearch.randomizedtesting.ThreadLeakControl$StatementRunner.run(ThreadLeakControl.java:367)
at java.lang.Thread.run(Thread.java:745)
Build Log:
[...truncated 11597 lines...]
[junit4] Suite: org.apache.solr.handler.TestReplicationHandler
[junit4] 2> Creating dataDir: /home/jenkins/workspace/Lucene-Solr-6.x-Linux/solr/build/solr-core/test/J0/temp/solr.handler.TestReplicationHandler_EA53F3A6E0853F14-001/init-core-data-001
[junit4] 2> 965587 INFO (TEST-TestReplicationHandler.doTestRepeater-seed#[EA53F3A6E0853F14]) [ ] o.a.s.SolrTestCaseJ4 ###Starting doTestRepeater
[junit4] 2> 965587 INFO (TEST-TestReplicationHandler.doTestRepeater-seed#[EA53F3A6E0853F14]) [ ] o.a.s.SolrTestCaseJ4 Writing core.properties file to /home/jenkins/workspace/Lucene-Solr-6.x-Linux/solr/build/solr-core/test/J0/temp/solr.handler.TestReplicationHandler_EA53F3A6E0853F14-001/solr-instance-001/collection1
[junit4] 2> 965590 INFO (TEST-TestReplicationHandler.doTestRepeater-seed#[EA53F3A6E0853F14]) [ ] o.e.j.s.Server jetty-9.3.8.v20160314
[junit4] 2> 965590 INFO (TEST-TestReplicationHandler.doTestRepeater-seed#[EA53F3A6E0853F14]) [ ] o.e.j.s.h.ContextHandler Started o.e.j.s.ServletContextHandler@16ee715e{/solr,null,AVAILABLE}
[junit4] 2> 965591 INFO (TEST-TestReplicationHandler.doTestRepeater-seed#[EA53F3A6E0853F14]) [ ] o.e.j.s.ServerConnector Started ServerConnector@723729ab{HTTP/1.1,[http/1.1]}{127.0.0.1:38242}
[junit4] 2> 965591 INFO (TEST-TestReplicationHandler.doTestRepeater-seed#[EA53F3A6E0853F14]) [ ] o.e.j.s.Server Started @967179ms
[junit4] 2> 965591 INFO (TEST-TestReplicationHandler.doTestRepeater-seed#[EA53F3A6E0853F14]) [ ] o.a.s.c.s.e.JettySolrRunner Jetty properties: {solr.data.dir=/home/jenkins/workspace/Lucene-Solr-6.x-Linux/solr/build/solr-core/test/J0/temp/solr.handler.TestReplicationHandler_EA53F3A6E0853F14-001/solr-instance-001/collection1/data, hostContext=/solr, hostPort=38242}
[junit4] 2> 965591 INFO (TEST-TestReplicationHandler.doTestRepeater-seed#[EA53F3A6E0853F14]) [ ] o.a.s.s.SolrDispatchFilter SolrDispatchFilter.init(): sun.misc.Launcher$AppClassLoader@73d16e93
[junit4] 2> 965592 INFO (TEST-TestReplicationHandler.doTestRepeater-seed#[EA53F3A6E0853F14]) [ ] o.a.s.c.SolrResourceLoader new SolrResourceLoader for directory: '/home/jenkins/workspace/Lucene-Solr-6.x-Linux/solr/build/solr-core/test/J0/temp/solr.handler.TestReplicationHandler_EA53F3A6E0853F14-001/solr-instance-001'
[junit4] 2> 965592 INFO (TEST-TestReplicationHandler.doTestRepeater-seed#[EA53F3A6E0853F14]) [ ] o.a.s.c.SolrResourceLoader JNDI not configured for solr (NoInitialContextEx)
[junit4] 2> 965592 INFO (TEST-TestReplicationHandler.doTestRepeater-seed#[EA53F3A6E0853F14]) [ ] o.a.s.c.SolrResourceLoader solr home defaulted to 'solr/' (could not find system property or JNDI)
[junit4] 2> 965592 INFO (TEST-TestReplicationHandler.doTestRepeater-seed#[EA53F3A6E0853F14]) [ ] o.a.s.c.SolrXmlConfig Loading container configuration from /home/jenkins/workspace/Lucene-Solr-6.x-Linux/solr/build/solr-core/test/J0/temp/solr.handler.TestReplicationHandler_EA53F3A6E0853F14-001/solr-instance-001/solr.xml
[junit4] 2> 965595 INFO (TEST-TestReplicationHandler.doTestRepeater-seed#[EA53F3A6E0853F14]) [ ] o.a.s.c.CorePropertiesLocator Config-defined core root directory: /home/jenkins/workspace/Lucene-Solr-6.x-Linux/solr/build/solr-core/test/J0/temp/solr.handler.TestReplicationHandler_EA53F3A6E0853F14-001/solr-instance-001/.
[junit4] 2> 965595 INFO (TEST-TestReplicationHandler.doTestRepeater-seed#[EA53F3A6E0853F14]) [ ] o.a.s.c.CoreContainer New CoreContainer 914322107
[junit4] 2> 965595 INFO (TEST-TestReplicationHandler.doTestRepeater-seed#[EA53F3A6E0853F14]) [ ] o.a.s.c.CoreContainer Loading cores into CoreContainer [instanceDir=/home/jenkins/workspace/Lucene-Solr-6.x-Linux/solr/build/solr-core/test/J0/temp/solr.handler.TestReplicationHandler_EA53F3A6E0853F14-001/solr-instance-001]
[junit4] 2> 965595 WARN (TEST-TestReplicationHandler.doTestRepeater-seed#[EA53F3A6E0853F14]) [ ] o.a.s.c.CoreContainer Couldn't add files from /home/jenkins/workspace/Lucene-Solr-6.x-Linux/solr/build/solr-core/test/J0/temp/solr.handler.TestReplicationHandler_EA53F3A6E0853F14-001/solr-instance-001/lib to classpath: /home/jenkins/workspace/Lucene-Solr-6.x-Linux/solr/build/solr-core/test/J0/temp/solr.handler.TestReplicationHandler_EA53F3A6E0853F14-001/solr-instance-001/lib
[junit4] 2> 965595 INFO (TEST-TestReplicationHandler.doTestRepeater-seed#[EA53F3A6E0853F14]) [ ] o.a.s.h.c.HttpShardHandlerFactory created with socketTimeout : 90000,urlScheme : ,connTimeout : 15000,maxConnectionsPerHost : 20,maxConnections : 10000,corePoolSize : 0,maximumPoolSize : 2147483647,maxThreadIdleTime : 5,sizeOfQueue : -1,fairnessPolicy : false,useRetries : false,
[junit4] 2> 965596 INFO (TEST-TestReplicationHandler.doTestRepeater-seed#[EA53F3A6E0853F14]) [ ] o.a.s.u.UpdateShardHandler Creating UpdateShardHandler HTTP client with params: socketTimeout=340000&connTimeout=45000&retry=true
[junit4] 2> 965596 INFO (TEST-TestReplicationHandler.doTestRepeater-seed#[EA53F3A6E0853F14]) [ ] o.a.s.l.LogWatcher SLF4J impl is org.slf4j.impl.Log4jLoggerFactory
[junit4] 2> 965596 INFO (TEST-TestReplicationHandler.doTestRepeater-seed#[EA53F3A6E0853F14]) [ ] o.a.s.l.LogWatcher Registering Log Listener [Log4j (org.slf4j.impl.Log4jLoggerFactory)]
[junit4] 2> 965597 INFO (TEST-TestReplicationHandler.doTestRepeater-seed#[EA53F3A6E0853F14]) [ ] o.a.s.c.CoreContainer Security conf doesn't exist. Skipping setup for authorization module.
[junit4] 2> 965597 INFO (TEST-TestReplicationHandler.doTestRepeater-seed#[EA53F3A6E0853F14]) [ ] o.a.s.c.CoreContainer No authentication plugin used.
[junit4] 2> 965597 INFO (TEST-TestReplicationHandler.doTestRepeater-seed#[EA53F3A6E0853F14]) [ ] o.a.s.c.CorePropertiesLocator Looking for core definitions underneath /home/jenkins/workspace/Lucene-Solr-6.x-Linux/solr/build/solr-core/test/J0/temp/solr.handler.TestReplicationHandler_EA53F3A6E0853F14-001/solr-instance-001/.
[junit4] 2> 965598 INFO (TEST-TestReplicationHandler.doTestRepeater-seed#[EA53F3A6E0853F14]) [ ] o.a.s.c.CoreDescriptor Created CoreDescriptor: {name=collection1, config=solrconfig.xml, loadOnStartup=true, schema=schema.xml, configSetProperties=configsetprops.json, transient=false, dataDir=data/}
[junit4] 2> 965598 INFO (TEST-TestReplicationHandler.doTestRepeater-seed#[EA53F3A6E0853F14]) [ ] o.a.s.c.CorePropertiesLocator Found core collection1 in /home/jenkins/workspace/Lucene-Solr-6.x-Linux/solr/build/solr-core/test/J0/temp/solr.handler.TestReplicationHandler_EA53F3A6E0853F14-001/solr-instance-001/./collection1
[junit4] 2> 965598 INFO (TEST-TestReplicationHandler.doTestRepeater-seed#[EA53F3A6E0853F14]) [ ] o.a.s.c.CorePropertiesLocator Found 1 core definitions
[junit4] 2> 965598 INFO (coreLoadExecutor-3854-thread-1) [ ] o.a.s.c.SolrResourceLoader new SolrResourceLoader for directory: '/home/jenkins/workspace/Lucene-Solr-6.x-Linux/solr/build/solr-core/test/J0/temp/solr.handler.TestReplicationHandler_EA53F3A6E0853F14-001/solr-instance-001/collection1'
[junit4] 2> 965598 INFO (TEST-TestReplicationHandler.doTestRepeater-seed#[EA53F3A6E0853F14]) [ ] o.a.s.s.SolrDispatchFilter user.dir=/home/jenkins/workspace/Lucene-Solr-6.x-Linux/solr/build/solr-core/test/J0
[junit4] 2> 965598 INFO (TEST-TestReplicationHandler.doTestRepeater-seed#[EA53F3A6E0853F14]) [ ] o.a.s.s.SolrDispatchFilter SolrDispatchFilter.init() done
[junit4] 2> 965598 INFO (coreLoadExecutor-3854-thread-1) [ ] o.a.s.c.SolrResourceLoader JNDI not configured for solr (NoInitialContextEx)
[junit4] 2> 965598 INFO (coreLoadExecutor-3854-thread-1) [ ] o.a.s.c.SolrResourceLoader solr home defaulted to 'solr/' (could not find system property or JNDI)
[junit4] 2> 965602 INFO (coreLoadExecutor-3854-thread-1) [ ] o.a.s.c.SolrConfig current version of requestparams : -1
[junit4] 2> 965604 INFO (coreLoadExecutor-3854-thread-1) [ ] o.a.s.c.SolrConfig Using Lucene MatchVersion: 6.1.0
[junit4] 2> 965607 INFO (coreLoadExecutor-3854-thread-1) [ ] o.a.s.c.SolrConfig Loaded SolrConfig: solrconfig.xml
[junit4] 2> 965609 INFO (coreLoadExecutor-3854-thread-1) [ ] o.a.s.s.IndexSchema [collection1] Schema name=test
[junit4] 2> 965610 INFO (coreLoadExecutor-3854-thread-1) [ ] o.a.s.s.IndexSchema unique key field: id
[junit4] 2> 965611 INFO (coreLoadExecutor-3854-thread-1) [ ] o.a.s.c.ConfigSetProperties Did not find ConfigSet properties, assuming default properties: Can't find resource 'configsetprops.json' in classpath or '/home/jenkins/workspace/Lucene-Solr-6.x-Linux/solr/build/solr-core/test/J0/temp/solr.handler.TestReplicationHandler_EA53F3A6E0853F14-001/solr-instance-001/collection1'
[junit4] 2> 965611 INFO (coreLoadExecutor-3854-thread-1) [ ] o.a.s.c.CoreContainer Creating SolrCore 'collection1' using configuration from instancedir /home/jenkins/workspace/Lucene-Solr-6.x-Linux/solr/build/solr-core/test/J0/temp/solr.handler.TestReplicationHandler_EA53F3A6E0853F14-001/solr-instance-001/./collection1
[junit4] 2> 965612 INFO (coreLoadExecutor-3854-thread-1) [ x:collection1] o.a.s.c.SolrCore org.apache.solr.core.MockDirectoryFactory
[junit4] 2> 965612 INFO (coreLoadExecutor-3854-thread-1) [ x:collection1] o.a.s.c.SolrCore [[collection1] ] Opening new SolrCore at [/home/jenkins/workspace/Lucene-Solr-6.x-Linux/solr/build/solr-core/test/J0/temp/solr.handler.TestReplicationHandler_EA53F3A6E0853F14-001/solr-instance-001/collection1], dataDir=[/home/jenkins/workspace/Lucene-Solr-6.x-Linux/solr/build/solr-core/test/J0/temp/solr.handler.TestReplicationHandler_EA53F3A6E0853F14-001/solr-instance-001/./collection1/data/]
[junit4] 2> 965612 INFO (coreLoadExecutor-3854-thread-1) [ x:collection1] o.a.s.c.SolrCore JMX monitoring not detected for core: collection1
[junit4] 2> 965612 INFO (coreLoadExecutor-3854-thread-1) [ x:collection1] o.a.s.c.CachingDirectoryFactory return new directory for /home/jenkins/workspace/Lucene-Solr-6.x-Linux/solr/build/solr-core/test/J0/temp/solr.handler.TestReplicationHandler_EA53F3A6E0853F14-001/solr-instance-001/./collection1/data
[junit4] 2> 965612 INFO (coreLoadExecutor-3854-thread-1) [ x:collection1] o.a.s.c.SolrCore New index directory detected: old=null new=/home/jenkins/workspace/Lucene-Solr-6.x-Linux/solr/build/solr-core/test/J0/temp/solr.handler.TestReplicationHandler_EA53F3A6E0853F14-001/solr-instance-001/./collection1/data/index/
[junit4] 2> 965612 WARN (coreLoadExecutor-3854-thread-1) [ x:collection1] o.a.s.c.SolrCore [collection1] Solr index directory '/home/jenkins/workspace/Lucene-Solr-6.x-Linux/solr/build/solr-core/test/J0/temp/solr.handler.TestReplicationHandler_EA53F3A6E0853F14-001/solr-instance-001/./collection1/data/index' doesn't exist. Creating new index...
[junit4] 2> 965612 INFO (coreLoadExecutor-3854-thread-1) [ x:collection1] o.a.s.c.CachingDirectoryFactory return new directory for /home/jenkins/workspace/Lucene-Solr-6.x-Linux/solr/build/solr-core/test/J0/temp/solr.handler.TestReplicationHandler_EA53F3A6E0853F14-001/solr-instance-001/./collection1/data/index
[junit4] 2> 965612 INFO (coreLoadExecutor-3854-thread-1) [ x:collection1] o.a.s.u.RandomMergePolicy RandomMergePolicy wrapping class org.apache.lucene.index.TieredMergePolicy: [TieredMergePolicy: maxMergeAtOnce=25, maxMergeAtOnceExplicit=32, maxMergedSegmentMB=29.6669921875, floorSegmentMB=0.7529296875, forceMergeDeletesPctAllowed=12.889648540775555, segmentsPerTier=10.0, maxCFSSegmentSizeMB=8.796093022207999E12, noCFSRatio=0.10830915569079878
[junit4] 2> 965612 INFO (coreLoadExecutor-3854-thread-1) [ x:collection1] o.a.s.c.SolrDeletionPolicy SolrDeletionPolicy.onCommit: commits: num=1
[junit4] 2> commit{dir=MockDirectoryWrapper(RAMDirectory@27061e14 lockFactory=org.apache.lucene.store.SingleInstanceLockFactory@1044a8b5),segFN=segments_1,generation=1}
[junit4] 2> 965613 INFO (coreLoadExecutor-3854-thread-1) [ x:collection1] o.a.s.c.SolrDeletionPolicy newest commit generation = 1
[junit4] 2> 965613 INFO (OldIndexDirectoryCleanupThreadForCore-collection1) [ x:collection1] o.a.s.c.SolrCore Looking for old index directories to cleanup for core collection1 in /home/jenkins/workspace/Lucene-Solr-6.x-Linux/solr/build/solr-core/test/J0/temp/solr.handler.TestReplicationHandler_EA53F3A6E0853F14-001/solr-instance-001/./collection1/data/
[junit4] 2> 965614 INFO (coreLoadExecutor-3854-thread-1) [ x:collection1] o.a.s.c.SolrCore no updateRequestProcessorChain defined as default, creating implicit default
[junit4] 2> 965615 INFO (coreLoadExecutor-3854-thread-1) [ x:collection1] o.a.s.h.l.XMLLoader xsltCacheLifetimeSeconds=60
[junit4] 2> 965615 INFO (coreLoadExecutor-3854-thread-1) [ x:collection1] o.a.s.h.l.XMLLoader xsltCacheLifetimeSeconds=60
[junit4] 2> 965615 INFO (coreLoadExecutor-3854-thread-1) [ x:collection1] o.a.s.h.l.XMLLoader xsltCacheLifetimeSeconds=60
[junit4] 2> 965616 INFO (coreLoadExecutor-3854-thread-1) [ x:collection1] o.a.s.h.l.XMLLoader xsltCacheLifetimeSeconds=60
[junit4] 2> 965616 INFO (coreLoadExecutor-3854-thread-1) [ x:collection1] o.a.s.c.PluginBag requestHandler : 'lazy' created with startup=lazy
[junit4] 2> 965616 INFO (coreLoadExecutor-3854-thread-1) [ x:collection1] o.a.s.c.RequestHandlers Registered paths: /admin/mbeans,standard,lazy,/update/json/docs,/admin/luke,/export,/get,/admin/properties,/update/json,/admin/threads,/update/csv,/sql,/admin/segments,/admin/system,/replication,defaults,/config,/stream,/schema,/admin/plugins,/admin/logging,/admin/ping,/update,/admin/file
[junit4] 2> 965616 INFO (coreLoadExecutor-3854-thread-1) [ x:collection1] o.a.s.c.SolrCore Using default statsCache cache: org.apache.solr.search.stats.LocalStatsCache
[junit4] 2> 965616 INFO (coreLoadExecutor-3854-thread-1) [ x:collection1] o.a.s.u.CommitTracker Hard AutoCommit: disabled
[junit4] 2> 965617 INFO (coreLoadExecutor-3854-thread-1) [ x:collection1] o.a.s.u.CommitTracker Soft AutoCommit: disabled
[junit4] 2> 965617 INFO (coreLoadExecutor-3854-thread-1) [ x:collection1] o.a.s.u.RandomMergePolicy RandomMergePolicy wrapping class org.apache.lucene.index.TieredMergePolicy: [TieredMergePolicy: maxMergeAtOnce=10, maxMergeAtOnceExplicit=12, maxMergedSegmentMB=87.146484375, floorSegmentMB=1.4404296875, forceMergeDeletesPctAllowed=0.033041544331248174, segmentsPerTier=49.0, maxCFSSegmentSizeMB=8.796093022207999E12, noCFSRatio=0.0
[junit4] 2> 965617 INFO (coreLoadExecutor-3854-thread-1) [ x:collection1] o.a.s.c.SolrDeletionPolicy SolrDeletionPolicy.onInit: commits: num=1
[junit4] 2> commit{dir=MockDirectoryWrapper(RAMDirectory@27061e14 lockFactory=org.apache.lucene.store.SingleInstanceLockFactory@1044a8b5),segFN=segments_1,generation=1}
[junit4] 2> 965617 INFO (coreLoadExecutor-3854-thread-1) [ x:collection1] o.a.s.c.SolrDeletionPolicy newest commit generation = 1
[junit4] 2> 965617 INFO (coreLoadExecutor-3854-thread-1) [ x:collection1] o.a.s.s.SolrIndexSearcher Opening [Searcher@621f5eb2[collection1] main]
[junit4] 2> 965617 INFO (coreLoadExecutor-3854-thread-1) [ x:collection1] o.a.s.r.ManagedResourceStorage File-based storage initialized to use dir: /home/jenkins/workspace/Lucene-Solr-6.x-Linux/solr/build/solr-core/test/J0/temp/solr.handler.TestReplicationHandler_EA53F3A6E0853F14-001/solr-instance-001/collection1/conf
[junit4] 2> 965617 INFO (coreLoadExecutor-3854-thread-1) [ x:collection1] o.a.s.r.RestManager Initializing RestManager with initArgs: {storageDir=/home/jenkins/workspace/Lucene-Solr-6.x-Linux/solr/build/solr-core/test/J0/temp/solr.handler.TestReplicationHandler_EA53F3A6E0853F14-001/solr-instance-001/collection1/conf}
[junit4] 2> 965617 INFO (coreLoadExecutor-3854-thread-1) [ x:collection1] o.a.s.r.ManagedResourceStorage Reading _rest_managed.json using file:dir=/home/jenkins/workspace/Lucene-Solr-6.x-Linux/solr/build/solr-core/test/J0/temp/solr.handler.TestReplicationHandler_EA53F3A6E0853F14-001/solr-instance-001/collection1/conf
[junit4] 2> 965617 INFO (coreLoadExecutor-3854-thread-1) [ x:collection1] o.a.s.r.RestManager Initializing 0 registered ManagedResources
[junit4] 2> 965618 INFO (coreLoadExecutor-3854-thread-1) [ x:collection1] o.a.s.h.ReplicationHandler Replication enabled for following config files: schema.xml,xslt/dummy.xsl
[junit4] 2> 965618 INFO (coreLoadExecutor-3854-thread-1) [ x:collection1] o.a.s.h.ReplicationHandler Commits will be reserved for 10000
[junit4] 2> 965618 INFO (searcherExecutor-3855-thread-1-processing-x:collection1) [ x:collection1] o.a.s.c.SolrCore [collection1] Registered new searcher Searcher@621f5eb2[collection1] main{ExitableDirectoryReader(UninvertingDirectoryReader())}
[junit4] 2> 965618 INFO (coreLoadExecutor-3854-thread-1) [ x:collection1] o.a.s.c.CoreContainer registering core: collection1
[junit4] 2> 966099 INFO (TEST-TestReplicationHandler.doTestRepeater-seed#[EA53F3A6E0853F14]) [ ] o.a.s.SolrTestCaseJ4 Writing core.properties file to /home/jenkins/workspace/Lucene-Solr-6.x-Linux/solr/build/solr-core/test/J0/temp/solr.handler.TestReplicationHandler_EA53F3A6E0853F14-001/solr-instance-002/collection1
[junit4] 2> 966101 INFO (TEST-TestReplicationHandler.doTestRepeater-seed#[EA53F3A6E0853F14]) [ ] o.e.j.s.Server jetty-9.3.8.v20160314
[junit4] 2> 966102 INFO (TEST-TestReplicationHandler.doTestRepeater-seed#[EA53F3A6E0853F14]) [ ] o.e.j.s.h.ContextHandler Started o.e.j.s.ServletContextHandler@499027ec{/solr,null,AVAILABLE}
[junit4] 2> 966102 INFO (TEST-TestReplicationHandler.doTestRepeater-seed#[EA53F3A6E0853F14]) [ ] o.e.j.s.ServerConnector Started ServerConnector@16e82dce{HTTP/1.1,[http/1.1]}{127.0.0.1:45887}
[junit4] 2> 966103 INFO (TEST-TestReplicationHandler.doTestRepeater-seed#[EA53F3A6E0853F14]) [ ] o.e.j.s.Server Started @967691ms
[junit4] 2> 966103 INFO (TEST-TestReplicationHandler.doTestRepeater-seed#[EA53F3A6E0853F14]) [ ] o.a.s.c.s.e.JettySolrRunner Jetty properties: {solr.data.dir=/home/jenkins/workspace/Lucene-Solr-6.x-Linux/solr/build/solr-core/test/J0/temp/solr.handler.TestReplicationHandler_EA53F3A6E0853F14-001/solr-instance-002/collection1/data, hostContext=/solr, hostPort=45887}
[junit4] 2> 966103 INFO (TEST-TestReplicationHandler.doTestRepeater-seed#[EA53F3A6E0853F14]) [ ] o.a.s.s.SolrDispatchFilter SolrDispatchFilter.init(): sun.misc.Launcher$AppClassLoader@73d16e93
[junit4] 2> 966103 INFO (TEST-TestReplicationHandler.doTestRepeater-seed#[EA53F3A6E0853F14]) [ ] o.a.s.c.SolrResourceLoader new SolrResourceLoader for directory: '/home/jenkins/workspace/Lucene-Solr-6.x-Linux/solr/build/solr-core/test/J0/temp/solr.handler.TestReplicationHandler_EA53F3A6E0853F14-001/solr-instance-002'
[junit4] 2> 966103 INFO (TEST-TestReplicationHandler.doTestRepeater-seed#[EA53F3A6E0853F14]) [ ] o.a.s.c.SolrResourceLoader JNDI not configured for solr (NoInitialContextEx)
[junit4] 2> 966103 INFO (TEST-TestReplicationHandler.doTestRepeater-seed#[EA53F3A6E0853F14]) [ ] o.a.s.c.SolrResourceLoader solr home defaulted to 'solr/' (could not find system property or JNDI)
[junit4] 2> 966103 INFO (TEST-TestReplicationHandler.doTestRepeater-seed#[EA53F3A6E0853F14]) [ ] o.a.s.c.SolrXmlConfig Loading container configuration from /home/jenkins/workspace/Lucene-Solr-6.x-Linux/solr/build/solr-core/test/J0/temp/solr.handler.TestReplicationHandler_EA53F3A6E0853F14-001/solr-instance-002/solr.xml
[junit4] 2> 966106 INFO (TEST-TestReplicationHandler.doTestRepeater-seed#[EA53F3A6E0853F14]) [ ] o.a.s.c.CorePropertiesLocator Config-defined core root directory: /home/jenkins/workspace/Lucene-Solr-6.x-Linux/solr/build/solr-core/test/J0/temp/solr.handler.TestReplicationHandler_EA53F3A6E0853F14-001/solr-instance-002/.
[junit4] 2> 966106 INFO (TEST-TestReplicationHandler.doTestRepeater-seed#[EA53F3A6E0853F14]) [ ] o.a.s.c.CoreContainer New CoreContainer 289965800
[junit4] 2> 966106 INFO (TEST-TestReplicationHandler.doTestRepeater-seed#[EA53F3A6E0853F14]) [ ] o.a.s.c.CoreContainer Loading cores into CoreContainer [instanceDir=/home/jenkins/workspace/Lucene-Solr-6.x-Linux/solr/build/solr-core/test/J0/temp/solr.handler.TestReplicationHandler_EA53F3A6E0853F14-001/solr-instance-002]
[junit4] 2> 966107 WARN (TEST-TestReplicationHandler.doTestRepeater-seed#[EA53F3A6E0853F14]) [ ] o.a.s.c.CoreContainer Couldn't add files from /home/jenkins/workspace/Lucene-Solr-6.x-Linux/solr/build/solr-core/test/J0/temp/solr.handler.TestReplicationHandler_EA53F3A6E0853F14-001/solr-instance-002/lib to classpath: /home/jenkins/workspace/Lucene-Solr-6.x-Linux/solr/build/solr-core/test/J0/temp/solr.handler.TestReplicationHandler_EA53F3A6E0853F14-001/solr-instance-002/lib
[junit4] 2> 966107 INFO (TEST-TestReplicationHandler.doTestRepeater-seed#[EA53F3A6E0853F14]) [ ] o.a.s.h.c.HttpShardHandlerFactory created with socketTimeout : 90000,urlScheme : ,connTimeout : 15000,maxConnectionsPerHost : 20,maxConnections : 10000,corePoolSize : 0,maximumPoolSize : 2147483647,maxThreadIdleTime : 5,sizeOfQueue : -1,fairnessPolicy : false,useRetries : false,
[junit4] 2> 966107 INFO (TEST-TestReplicationHandler.doTestRepeater-seed#[EA53F3A6E0853F14]) [ ] o.a.s.u.UpdateShardHandler Creating UpdateShardHandler HTTP client with params: socketTimeout=340000&connTimeout=45000&retry=true
[junit4] 2> 966107 INFO (TEST-TestReplicationHandler.doTestRepeater-seed#[EA53F3A6E0853F14]) [ ] o.a.s.l.LogWatcher SLF4J impl is org.slf4j.impl.Log4jLoggerFactory
[junit4] 2> 966107 INFO (TEST-TestReplicationHandler.doTestRepeater-seed#[EA53F3A6E0853F14]) [ ] o.a.s.l.LogWatcher Registering Log Listener [Log4j (org.slf4j.impl.Log4jLoggerFactory)]
[junit4] 2> 966108 INFO (TEST-TestReplicationHandler.doTestRepeater-seed#[EA53F3A6E0853F14]) [ ] o.a.s.c.CoreContainer Security conf doesn't exist. Skipping setup for authorization module.
[junit4] 2> 966108 INFO (TEST-TestReplicationHandler.doTestRepeater-seed#[EA53F3A6E0853F14]) [ ] o.a.s.c.CoreContainer No authentication plugin used.
[junit4] 2> 966108 INFO (TEST-TestReplicationHandler.doTestRepeater-seed#[EA53F3A6E0853F14]) [ ] o.a.s.c.CorePropertiesLocator Looking for core definitions underneath /home/jenkins/workspace/Lucene-Solr-6.x-Linux/solr/build/solr-core/test/J0/temp/solr.handler.TestReplicationHandler_EA53F3A6E0853F14-001/solr-instance-002/.
[junit4] 2> 966109 INFO (TEST-TestReplicationHandler.doTestRepeater-seed#[EA53F3A6E0853F14]) [ ] o.a.s.c.CoreDescriptor Created CoreDescriptor: {name=collection1, config=solrconfig.xml, loadOnStartup=true, schema=schema.xml, configSetProperties=configsetprops.json, transient=false, dataDir=data/}
[junit4] 2> 966109 INFO (TEST-TestReplicationHandler.doTestRepeater-seed#[EA53F3A6E0853F14]) [ ] o.a.s.c.CorePropertiesLocator Found core collection1 in /home/jenkins/workspace/Lucene-Solr-6.x-Linux/solr/build/solr-core/test/J0/temp/solr.handler.TestReplicationHandler_EA53F3A6E0853F14-001/solr-instance-002/./collection1
[junit4] 2> 966109 INFO (TEST-TestReplicationHandler.doTestRepeater-seed#[EA53F3A6E0853F14]) [ ] o.a.s.c.CorePropertiesLocator Found 1 core definitions
[junit4] 2> 966109 INFO (coreLoadExecutor-3864-thread-1) [ ] o.a.s.c.SolrResourceLoader new SolrResourceLoader for directory: '/home/jenkins/workspace/Lucene-Solr-6.x-Linux/solr/build/solr-core/test/J0/temp/solr.handler.TestReplicationHandler_EA53F3A6E0853F14-001/solr-instance-002/collection1'
[junit4] 2> 966109 INFO (TEST-TestReplicationHandler.doTestRepeater-seed#[EA53F3A6E0853F14]) [ ] o.a.s.s.SolrDispatchFilter user.dir=/home/jenkins/workspace/Lucene-Solr-6.x-Linux/solr/build/solr-core/test/J0
[junit4] 2> 966110 INFO (TEST-TestReplicationHandler.doTestRepeater-seed#[EA53F3A6E0853F14]) [ ] o.a.s.s.SolrDispatchFilter SolrDispatchFilter.init() done
[junit4] 2> 966110 INFO (coreLoadExecutor-3864-thread-1) [ ] o.a.s.c.SolrResourceLoader JNDI not configured for solr (NoInitialContextEx)
[junit4] 2> 966110 INFO (coreLoadExecutor-3864-thread-1) [ ] o.a.s.c.SolrResourceLoader solr home defaulted to 'solr/' (could not find system property or JNDI)
[junit4] 2> 966113 INFO (coreLoadExecutor-3864-thread-1) [ ] o.a.s.c.SolrConfig current version of requestparams : -1
[junit4] 2> 966114 INFO (coreLoadExecutor-3864-thread-1) [ ] o.a.s.c.SolrConfig Using Lucene MatchVersion: 6.1.0
[junit4] 2> 966118 INFO (coreLoadExecutor-3864-thread-1) [ ] o.a.s.c.SolrConfig Loaded SolrConfig: solrconfig.xml
[junit4] 2> 966120 INFO (coreLoadExecutor-3864-thread-1) [ ] o.a.s.s.IndexSchema [collection1] Schema name=test
[junit4] 2> 966121 INFO (coreLoadExecutor-3864-thread-1) [ ] o.a.s.s.IndexSchema unique key field: id
[junit4] 2> 966122 INFO (coreLoadExecutor-3864-thread-1) [ ] o.a.s.c.ConfigSetProperties Did not find ConfigSet properties, assuming default properties: Can't find resource 'configsetprops.json' in classpath or '/home/jenkins/workspace/Lucene-Solr-6.x-Linux/solr/build/solr-core/test/J0/temp/solr.handler.TestReplicationHandler_EA53F3A6E0853F14-001/solr-instance-002/collection1'
[junit4] 2> 966122 INFO (coreLoadExecutor-3864-thread-1) [ ] o.a.s.c.CoreContainer Creating SolrCore 'collection1' using configuration from instancedir /home/jenkins/workspace/Lucene-Solr-6.x-Linux/solr/build/solr-core/test/J0/temp/solr.handler.TestReplicationHandler_EA53F3A6E0853F14-001/solr-instance-002/./collection1
[junit4] 2> 966122 INFO (coreLoadExecutor-3864-thread-1) [ x:collection1] o.a.s.c.SolrCore org.apache.solr.core.MockDirectoryFactory
[junit4] 2> 966122 INFO (coreLoadExecutor-3864-thread-1) [ x:collection1] o.a.s.c.SolrCore [[collection1] ] Opening new SolrCore at [/home/jenkins/workspace/Lucene-Solr-6.x-Linux/solr/build/solr-core/test/J0/temp/solr.handler.TestReplicationHandler_EA53F3A6E0853F14-001/solr-instance-002/collection1], dataDir=[/home/jenkins/workspace/Lucene-Solr-6.x-Linux/solr/build/solr-core/test/J0/temp/solr.handler.TestReplicationHandler_EA53F3A6E0853F14-001/solr-instance-002/./collection1/data/]
[junit4] 2> 966122 INFO (coreLoadExecutor-3864-thread-1) [ x:collection1] o.a.s.c.SolrCore JMX monitoring not detected for core: collection1
[junit4] 2> 966122 INFO (coreLoadExecutor-3864-thread-1) [ x:collection1] o.a.s.c.CachingDirectoryFactory return new directory for /home/jenkins/workspace/Lucene-Solr-6.x-Linux/solr/build/solr-core/test/J0/temp/solr.handler.TestReplicationHandler_EA53F3A6E0853F14-001/solr-instance-002/./collection1/data
[junit4] 2> 966122 INFO (coreLoadExecutor-3864-thread-1) [ x:collection1] o.a.s.c.SolrCore New index directory detected: old=null new=/home/jenkins/workspace/Lucene-Solr-6.x-Linux/solr/build/solr-core/test/J0/temp/solr.handler.TestReplicationHandler_EA53F3A6E0853F14-001/solr-instance-002/./collection1/data/index/
[junit4] 2> 966122 WARN (coreLoadExecutor-3864-thread-1) [ x:collection1] o.a.s.c.SolrCore [collection1] Solr index directory '/home/jenkins/workspace/Lucene-Solr-6.x-Linux/solr/build/solr-core/test/J0/temp/solr.handler.TestReplicationHandler_EA53F3A6E0853F14-001/solr-instance-002/./collection1/data/index' doesn't exist. Creating new index...
[junit4] 2> 966123 INFO (coreLoadExecutor-3864-thread-1) [ x:collection1] o.a.s.c.CachingDirectoryFactory return new directory for /home/jenkins/workspace/Lucene-Solr-6.x-Linux/solr/build/solr-core/test/J0/temp/solr.handler.TestReplicationHandler_EA53F3A6E0853F14-001/solr-instance-002/./collection1/data/index
[junit4] 2> 966123 INFO (coreLoadExecutor-3864-thread-1) [ x:collection1] o.a.s.u.RandomMergePolicy RandomMergePolicy wrapping class org.apache.lucene.index.TieredMergePolicy: [TieredMergePolicy: maxMergeAtOnce=25, maxMergeAtOnceExplicit=32, maxMergedSegmentMB=29.6669921875, floorSegmentMB=0.7529296875, forceMergeDeletesPctAllowed=12.889648540775555, segmentsPerTier=10.0, maxCFSSegmentSizeMB=8.796093022207999E12, noCFSRatio=0.10830915569079878
[junit4] 2> 966123 INFO (coreLoadExecutor-3864-thread-1) [ x:collection1] o.a.s.c.SolrDeletionPolicy SolrDeletionPolicy.onCommit: commits: num=1
[junit4] 2> commit{dir=MockDirectoryWrapper(RAMDirectory@3f78feb0 lockFactory=org.apache.lucene.store.SingleInstanceLockFactory@7c544470),segFN=segments_1,generation=1}
[junit4] 2> 966123 INFO (coreLoadExecutor-3864-thread-1) [ x:collection1] o.a.s.c.SolrDeletionPolicy newest commit generation = 1
[junit4] 2> 966123 INFO (OldIndexDirectoryCleanupThreadForCore-collection1) [ x:collection1] o.a.s.c.SolrCore Looking for old index directories to cleanup for core collection1 in /home/jenkins/workspace/Lucene-Solr-6.x-Linux/solr/build/solr-core/test/J0/temp/solr.handler.TestReplicationHandler_EA53F3A6E0853F14-001/solr-instance-002/./collection1/data/
[junit4] 2> 966124 INFO (coreLoadExecutor-3864-thread-1) [ x:collection1] o.a.s.c.SolrCore no updateRequestProcessorChain defined as default, creating implicit default
[junit4] 2> 966124 INFO (coreLoadExecutor-3864-thread-1) [ x:collection1] o.a.s.h.l.XMLLoader xsltCacheLifetimeSeconds=60
[junit4] 2> 966125 INFO (coreLoadExecutor-3864-thread-1) [ x:collection1] o.a.s.h.l.XMLLoader xsltCacheLifetimeSeconds=60
[junit4] 2> 966125 INFO (coreLoadExecutor-3864-thread-1) [ x:collection1] o.a.s.h.l.XMLLoader xsltCacheLifetimeSeconds=60
[junit4] 2> 966126 INFO (coreLoadExecutor-3864-thread-1) [ x:collection1] o.a.s.h.l.XMLLoader xsltCacheLifetimeSeconds=60
[junit4] 2> 966126 INFO (coreLoadExecutor-3864-thread-1) [ x:collection1] o.a.s.c.PluginBag requestHandler : 'lazy' created with startup=lazy
[junit4] 2> 966126 INFO (coreLoadExecutor-3864-thread-1) [ x:collection1] o.a.s.c.RequestHandlers Registered paths: /admin/mbeans,standard,lazy,/update/json/docs,/admin/luke,/export,/get,/admin/properties,/update/json,/admin/threads,/update/csv,/sql,/admin/segments,/admin/system,/replication,defaults,/config,/stream,/schema,/admin/plugins,/admin/logging,/admin/ping,/update,/admin/file
[junit4] 2> 966126 INFO (coreLoadExecutor-3864-thread-1) [ x:collection1] o.a.s.c.SolrCore Using default statsCache cache: org.apache.solr.search.stats.LocalStatsCache
[junit4] 2> 966127 INFO (coreLoadExecutor-3864-thread-1) [ x:collection1] o.a.s.u.CommitTracker Hard AutoCommit: disabled
[junit4] 2> 966127 INFO (coreLoadExecutor-3864-thread-1) [ x:collection1] o.a.s.u.CommitTracker Soft AutoCommit: disabled
[junit4] 2> 966127 INFO (coreLoadExecutor-3864-thread-1) [ x:collection1] o.a.s.u.RandomMergePolicy RandomMergePolicy wrapping class org.apache.lucene.index.TieredMergePolicy: [TieredMergePolicy: maxMergeAtOnce=10, maxMergeAtOnceExplicit=12, maxMergedSegmentMB=87.146484375, floorSegmentMB=1.4404296875, forceMergeDeletesPctAllowed=0.033041544331248174, segmentsPerTier=49.0, maxCFSSegmentSizeMB=8.796093022207999E12, noCFSRatio=0.0
[junit4] 2> 966127 INFO (coreLoadExecutor-3864-thread-1) [ x:collection1] o.a.s.c.SolrDeletionPolicy SolrDeletionPolicy.onInit: commits: num=1
[junit4] 2> commit{dir=MockDirectoryWrapper(RAMDirectory@3f78feb0 lockFactory=org.apache.lucene.store.SingleInstanceLockFactory@7c544470),segFN=segments_1,generation=1}
[junit4] 2> 966127 INFO (coreLoadExecutor-3864-thread-1) [ x:collection1] o.a.s.c.SolrDeletionPolicy newest commit generation = 1
[junit4] 2> 966127 INFO (coreLoadExecutor-3864-thread-1) [ x:collection1] o.a.s.s.SolrIndexSearcher Opening [Searcher@2c1a614c[collection1] main]
[junit4] 2> 966127 INFO (coreLoadExecutor-3864-thread-1) [ x:collection1] o.a.s.r.ManagedResourceStorage File-based storage initialized to use dir: /home/jenkins/workspace/Lucene-Solr-6.x-Linux/solr/build/solr-core/test/J0/temp/solr.handler.TestReplicationHandler_EA53F3A6E0853F14-001/solr-instance-002/collection1/conf
[junit4] 2> 966127 INFO (coreLoadExecutor-3864-thread-1) [ x:collection1] o.a.s.r.RestManager Initializing RestManager with initArgs: {storageDir=/home/jenkins/workspace/Lucene-Solr-6.x-Linux/solr/build/solr-core/test/J0/temp/solr.handler.TestReplicationHandler_EA53F3A6E0853F14-001/solr-instance-002/collection1/conf}
[junit4] 2> 966127 INFO (coreLoadExecutor-3864-thread-1) [ x:collection1] o.a.s.r.ManagedResourceStorage Reading _rest_managed.json using file:dir=/home/jenkins/workspace/Lucene-Solr-6.x-Linux/solr/build/solr-core/test/J0/temp/solr.handler.TestReplicationHandler_EA53F3A6E0853F14-001/solr-instance-002/collection1/conf
[junit4] 2> 966127 INFO (coreLoadExecutor-3864-thread-1) [ x:collection1] o.a.s.r.RestManager Initializing 0 registered ManagedResources
[junit4] 2> 966128 INFO (coreLoadExecutor-3864-thread-1) [ x:collection1] o.a.s.h.ReplicationHandler Poll scheduled at an interval of 1000ms
[junit4] 2> 966128 INFO (searcherExecutor-3865-thread-1-processing-x:collection1) [ x:collection1] o.a.s.c.SolrCore [collection1] Registered new searcher Searcher@2c1a614c[collection1] main{ExitableDirectoryReader(UninvertingDirectoryReader())}
[junit4] 2> 966128 INFO (coreLoadExecutor-3864-thread-1) [ x:collection1] o.a.s.c.CoreContainer registering core: collection1
[junit4] 2> 966614 INFO (TEST-TestReplicationHandler.doTestRepeater-seed#[EA53F3A6E0853F14]) [ ] o.e.j.s.ServerConnector Stopped ServerConnector@16e82dce{HTTP/1.1,[http/1.1]}{127.0.0.1:0}
[junit4] 2> 966614 INFO (TEST-TestReplicationHandler.doTestRepeater-seed#[EA53F3A6E0853F14]) [ ] o.a.s.c.CoreContainer Shutting down CoreContainer instance=289965800
[junit4] 2> 966615 INFO (coreCloseExecutor-3870-thread-1) [ x:collection1] o.a.s.c.SolrCore [collection1] CLOSING SolrCore org.apache.solr.core.SolrCore@58789d85
[junit4] 2> 966615 INFO (coreCloseExecutor-3870-thread-1) [ x:collection1] o.a.s.u.DirectUpdateHandler2 closing DirectUpdateHandler2{commits=0,autocommits=0,soft autocommits=0,optimizes=0,rollbacks=0,expungeDeletes=0,docsPending=0,adds=0,deletesById=0,deletesByQuery=0,errors=0,cumulative_adds=0,cumulative_deletesById=0,cumulative_deletesByQuery=0,cumulative_errors=0}
[junit4] 2> 966615 INFO (coreCloseExecutor-3870-thread-1) [ x:collection1] o.a.s.u.SolrCoreState Closing SolrCoreState
[junit4] 2> 966615 INFO (coreCloseExecutor-3870-thread-1) [ x:collection1] o.a.s.u.DefaultSolrCoreState SolrCoreState ref count has reached 0 - closing IndexWriter
[junit4] 2> 966615 INFO (coreCloseExecutor-3870-thread-1) [ x:collection1] o.a.s.u.DefaultSolrCoreState closing IndexWriter with IndexWriterCloser
[junit4] 2> 966615 INFO (coreCloseExecutor-3870-thread-1) [ x:collection1] o.a.s.c.SolrCore [collection1] Closing main searcher on request.
[junit4] 2> 966615 INFO (coreCloseExecutor-3870-thread-1) [ x:collection1] o.a.s.c.CachingDirectoryFactory Closing MockDirectoryFactory - 2 directories currently being tracked
[junit4] 2> 966615 INFO (coreCloseExecutor-3870-thread-1) [ x:collection1] o.a.s.c.CachingDirectoryFactory looking to close /home/jenkins/workspace/Lucene-Solr-6.x-Linux/solr/build/solr-core/test/J0/temp/solr.handler.TestReplicationHandler_EA53F3A6E0853F14-001/solr-instance-002/./collection1/data [CachedDir<<refCount=0;path=/home/jenkins/workspace/Lucene-Solr-6.x-Linux/solr/build/solr-core/test/J0/temp/solr.handler.TestReplicationHandler_EA53F3A6E0853F14-001/solr-instance-002/./collection1/data;done=false>>]
[junit4] 2> 966615 INFO (coreCloseExecutor-3870-thread-1) [ x:collection1] o.a.s.c.CachingDirectoryFactory Closing directory, CoreContainer#isShutdown=true
[junit4] 2> 966615 INFO (coreCloseExecutor-3870-thread-1) [ x:collection1] o.a.s.c.CachingDirectoryFactory Closing directory: /home/jenkins/workspace/Lucene-Solr-6.x-Linux/solr/build/solr-core/test/J0/temp/solr.handler.TestReplicationHandler_EA53F3A6E0853F14-001/solr-instance-002/./collection1/data
[junit4] 2> 966615 INFO (coreCloseExecutor-3870-thread-1) [ x:collection1] o.a.s.c.CachingDirectoryFactory looking to close /home/jenkins/workspace/Lucene-Solr-6.x-Linux/solr/build/solr-core/test/J0/temp/solr.handler.TestReplicationHandler_EA53F3A6E0853F14-001/solr-instance-002/./collection1/data/index [CachedDir<<refCount=0;path=/home/jenkins/workspace/Lucene-Solr-6.x-Linux/solr/build/solr-core/test/J0/temp/solr.handler.TestReplicationHandler_EA53F3A6E0853F14-001/solr-instance-002/./collection1/data/index;done=false>>]
[junit4] 2> 966615 INFO (coreCloseExecutor-3870-thread-1) [ x:collection1] o.a.s.c.CachingDirectoryFactory Closing directory, CoreContainer#isShutdown=true
[junit4] 2> 966615 INFO (coreCloseExecutor-3870-thread-1) [ x:collection1] o.a.s.c.CachingDirectoryFactory Closing directory: /home/jenkins/workspace/Lucene-Solr-6.x-Linux/solr/build/solr-core/test/J0/temp/solr.handler.TestReplicationHandler_EA53F3A6E0853F14-001/solr-instance-002/./collection1/data/index
[junit4] 2> 966616 INFO (TEST-TestReplicationHandler.doTestRepeater-seed#[EA53F3A6E0853F14]) [ ] o.e.j.s.h.ContextHandler Stopped o.e.j.s.ServletContextHandler@499027ec{/solr,null,UNAVAILABLE}
[junit4] 2> 966617 INFO (TEST-TestReplicationHandler.doTestRepeater-seed#[EA53F3A6E0853F14]) [ ] o.e.j.s.Server jetty-9.3.8.v20160314
[junit4] 2> 966617 INFO (TEST-TestReplicationHandler.doTestRepeater-seed#[EA53F3A6E0853F14]) [ ] o.e.j.s.h.ContextHandler Started o.e.j.s.ServletContextHandler@74a20733{/solr,null,AVAILABLE}
[junit4] 2> 966617 INFO (TEST-TestReplicationHandler.doTestRepeater-seed#[EA53F3A6E0853F14]) [ ] o.e.j.s.ServerConnector Started ServerConnector@601f6e36{HTTP/1.1,[http/1.1]}{127.0.0.1:44379}
[junit4] 2> 966618 INFO (TEST-TestReplicationHandler.doTestRepeater-seed#[EA53F3A6E0853F14]) [ ] o.e.j.s.Server Started @968206ms
[junit4] 2> 966618 INFO (TEST-TestReplicationHandler.doTestRepeater-seed#[EA53F3A6E0853F14]) [ ] o.a.s.c.s.e.JettySolrRunner Jetty properties: {solr.data.dir=/home/jenkins/workspace/Lucene-Solr-6.x-Linux/solr/build/solr-core/test/J0/temp/solr.handler.TestReplicationHandler_EA53F3A6E0853F14-001/solr-instance-002/collection1/data, hostContext=/solr, hostPort=44379}
[junit4] 2> 966618 INFO (TEST-TestReplicationHandler.doTestRepeater-seed#[EA53F3A6E0853F14]) [ ] o.a.s.s.SolrDispatchFilter SolrDispatchFilter.init(): sun.misc.Launcher$AppClassLoader@73d16e93
[junit4] 2> 966618 INFO (TEST-TestReplicationHandler.doTestRepeater-seed#[EA53F3A6E0853F14]) [ ] o.a.s.c.SolrResourceLoader new SolrResourceLoader for directory: '/home/jenkins/workspace/Lucene-Solr-6.x-Linux/solr/build/solr-core/test/J0/temp/solr.handler.TestReplicationHandler_EA53F3A6E0853F14-001/solr-instance-002'
[junit4] 2> 966618 INFO (TEST-TestReplicationHandler.doTestRepeater-seed#[EA53F3A6E0853F14]) [ ] o.a.s.c.SolrResourceLoader JNDI not configured for solr (NoInitialContextEx)
[junit4] 2> 966618 INFO (TEST-TestReplicationHandler.doTestRepeater-seed#[EA53F3A6E0853F14]) [ ] o.a.s.c.SolrResourceLoader solr home defaulted to 'solr/' (could not find system property or JNDI)
[junit4] 2> 966618 INFO (TEST-TestReplicationHandler.doTestRepeater-seed#[EA53F3A6E0853F14]) [ ] o.a.s.c.SolrXmlConfig Loading container configuration from /home/jenkins/workspace/Lucene-Solr-6.x-Linux/solr/build/solr-core/test/J0/temp/solr.handler.TestReplicationHandler_EA53F3A6E0853F14-001/solr-instance-002/solr.xml
[junit4] 2> 966621 INFO (TEST-TestReplicationHandler.doTestRepeater-seed#[EA53F3A6E0853F14]) [ ] o.a.s.c.CorePropertiesLocator Config-defined core root directory: /home/jenkins/workspace/Lucene-Solr-6.x-Linux/solr/build/solr-core/test/J0/temp/solr.handler.TestReplicationHandler_EA53F3A6E0853F14-001/solr-instance-002/.
[junit4] 2> 966621 INFO (TEST-TestReplicationHandler.doTestRepeater-seed#[EA53F3A6E0853F14]) [ ] o.a.s.c.CoreContainer New CoreContainer 1625349237
[junit4] 2> 966621 INFO (TEST-TestReplicationHandler.doTestRepeater-seed#[EA53F3A6E0853F14]) [ ] o.a.s.c.CoreContainer Loading cores into CoreContainer [instanceDir=/home/jenkins/workspace/Lucene-Solr-6.x-Linux/solr/build/solr-core/test/J0/temp/solr.handler.TestReplicationHandler_EA53F3A6E0853F14-001/solr-instance-002]
[junit4] 2> 966621 WARN (TEST-TestReplicationHandler.doTestRepeater-seed#[EA53F3A6E0853F14]) [ ] o.a.s.c.CoreContainer Couldn't add files from /home/jenkins/workspace/Lucene-Solr-6.x-Linux/solr/build/solr-core/test/J0/temp/solr.handler.TestReplicationHandler_EA53F3A6E0853F14-001/solr-instance-002/lib to classpath: /home/jenkins/workspace/Lucene-Solr-6.x-Linux/solr/build/solr-core/test/J0/temp/solr.handler.TestReplicationHandler_EA53F3A6E0853F14-001/solr-instance-002/lib
[junit4] 2> 966621 INFO (TEST-TestReplicationHandler.doTestRepeater-seed#[EA53F3A6E0853F14]) [ ] o.a.s.h.c.HttpShardHandlerFactory created with socketTimeout : 90000,urlScheme : ,connTimeout : 15000,maxConnectionsPerHost : 20,maxConnections : 10000,corePoolSize : 0,maximumPoolSize : 2147483647,maxThreadIdleTime : 5,sizeOfQueue : -1,fairnessPolicy : false,useRetries : false,
[junit4] 2> 966622 INFO (TEST-TestReplicationHandler.doTestRepeater-seed#[EA53F3A6E0853F14]) [ ] o.a.s.u.UpdateShardHandler Creating UpdateShardHandler HTTP client with params: socketTimeout=340000&connTimeout=45000&retry=true
[junit4] 2> 966622 INFO (TEST-TestReplicationHandler.doTestRepeater-seed#[EA53F3A6E0853F14]) [ ] o.a.s.l.LogWatcher SLF4J impl is org.slf4j.impl.Log4jLoggerFactory
[junit4] 2> 966622 INFO (TEST-TestReplicationHandler.doTestRepeater-seed#[EA53F3A6E0853F14]) [ ] o.a.s.l.LogWatcher Registering Log Listener [Log4j (org.slf4j.impl.Log4jLoggerFactory)]
[junit4] 2> 966622 INFO (TEST-TestReplicationHandler.doTestRepeater-seed#[EA53F3A6E0853F14]) [ ] o.a.s.c.CoreContainer Security conf doesn't exist. Skipping setup for authorization module.
[junit4] 2> 966622 INFO (TEST-TestReplicationHandler.doTestRepeater-seed#[EA53F3A6E0853F14]) [ ] o.a.s.c.CoreContainer No authentication plugin used.
[junit4] 2> 966622 INFO (TEST-TestReplicationHandler.doTestRepeater-seed#[EA53F3A6E0853F14]) [ ] o.a.s.c.CorePropertiesLocator Looking for core definitions underneath /home/jenkins/workspace/Lucene-Solr-6.x-Linux/solr/build/solr-core/test/J0/temp/solr.handler.TestReplicationHandler_EA53F3A6E0853F14-001/solr-instance-002/.
[junit4] 2> 966623 INFO (TEST-TestReplicationHandler.doTestRepeater-seed#[EA53F3A6E0853F14]) [ ] o.a.s.c.CoreDescriptor Created CoreDescriptor: {name=collection1, config=solrconfig.xml, loadOnStartup=true, schema=schema.xml, configSetProperties=configsetprops.json, transient=false, dataDir=data/}
[junit4] 2> 966623 INFO (TEST-TestReplicationHandler.doTestRepeater-seed#[EA53F3A6E0853F14]) [ ] o.a.s.c.CorePropertiesLocator Found core collection1 in /home/jenkins/workspace/Lucene-Solr-6.x-Linux/solr/build/solr-core/test/J0/temp/solr.handler.TestReplicationHandler_EA53F3A6E0853F14-001/solr-instance-002/./collection1
[junit4] 2> 966623 INFO (TEST-TestReplicationHandler.doTestRepeater-seed#[EA53F3A6E0853F14]) [ ] o.a.s.c.CorePropertiesLocator Found 1 core definitions
[junit4] 2> 966623 INFO (coreLoadExecutor-3877-thread-1) [ ] o.a.s.c.SolrResourceLoader new SolrResourceLoader for directory: '/home/jenkins/workspace/Lucene-Solr-6.x-Linux/solr/build/solr-core/test/J0/temp/solr.handler.TestReplicationHandler_EA53F3A6E0853F14-001/solr-instance-002/collection1'
[junit4] 2> 966623 INFO (TEST-TestReplicationHandler.doTestRepeater-seed#[EA53F3A6E0853F14]) [ ] o.a.s.s.SolrDispatchFilter user.dir=/home/jenkins/workspace/Lucene-Solr-6.x-Linux/solr/build/solr-core/test/J0
[junit4] 2> 966623 INFO (TEST-TestReplicationHandler.doTestRepeater-seed#[EA53F3A6E0853F14]) [ ] o.a.s.s.SolrDispatchFilter SolrDispatchFilter.init() done
[junit4] 2> 966623 INFO (coreLoadExecutor-3877-thread-1) [ ] o.a.s.c.SolrResourceLoader JNDI not configured for solr (NoInitialContextEx)
[junit4] 2> 966623 INFO (coreLoadExecutor-3877-thread-1) [ ] o.a.s.c.SolrResourceLoader solr home defaulted to 'solr/' (could not find system property or JNDI)
[junit4] 2> 966626 INFO (coreLoadExecutor-3877-thread-1) [ ] o.a.s.c.SolrConfig current version of requestparams : -1
[junit4] 2> 966628 INFO (coreLoadExecutor-3877-thread-1) [ ] o.a.s.c.SolrConfig Using Lucene MatchVersion: 6.1.0
[junit4] 2> 966631 INFO (coreLoadExecutor-3877-thread-1) [ ] o.a.s.c.SolrConfig Loaded SolrConfig: solrconfig.xml
[junit4] 2> 966632 INFO (coreLoadExecutor-3877-thread-1) [ ] o.a.s.s.IndexSchema [collection1] Schema name=test
[junit4] 2> 966633 INFO (coreLoadExecutor-3877-thread-1) [ ] o.a.s.s.IndexSchema unique key field: id
[junit4] 2> 966634 INFO (coreLoadExecutor-3877-thread-1) [ ] o.a.s.c.ConfigSetProperties Did not find ConfigSet properties, assuming default properties: Can't find resource 'configsetprops.json' in classpath or '/home/jenkins/workspace/Lucene-Solr-6.x-Linux/solr/build/solr-core/test/J0/temp/solr.handler.TestReplicationHandler_EA53F3A6E0853F14-001/solr-instance-002/collection1'
[junit4] 2> 966634 INFO (coreLoadExecutor-3877-thread-1) [ ] o.a.s.c.CoreContainer Creating SolrCore 'collection1' using configuration from instancedir /home/jenkins/workspace/Lucene-Solr-6.x-Linux/solr/build/solr-core/test/J0/temp/solr.handler.TestReplicationHandler_EA53F3A6E0853F14-001/solr-instance-002/./collection1
[junit4] 2> 966634 INFO (coreLoadExecutor-3877-thread-1) [ x:collection1] o.a.s.c.SolrCore org.apache.solr.core.MockDirectoryFactory
[junit4] 2> 966634 INFO (coreLoadExecutor-3877-thread-1) [ x:collection1] o.a.s.c.SolrCore [[collection1] ] Opening new SolrCore at [/home/jenkins/workspace/Lucene-Solr-6.x-Linux/solr/build/solr-core/test/J0/temp/solr.handler.TestReplicationHandler_EA53F3A6E0853F14-001/solr-instance-002/collection1], dataDir=[/home/jenkins/workspace/Lucene-Solr-6.x-Linux/solr/build/solr-core/test/J0/temp/solr.handler.TestReplicationHandler_EA53F3A6E0853F14-001/solr-instance-002/./collection1/data/]
[junit4] 2> 966634 INFO (coreLoadExecutor-3877-thread-1) [ x:collection1] o.a.s.c.SolrCore JMX monitoring not detected for core: collection1
[junit4] 2> 966635 INFO (coreLoadExecutor-3877-thread-1) [ x:collection1] o.a.s.c.CachingDirectoryFactory return new directory for /home/jenkins/workspace/Lucene-Solr-6.x-Linux/solr/build/solr-core/test/J0/temp/solr.handler.TestReplicationHandler_EA53F3A6E0853F14-001/solr-instance-002/./collection1/data
[junit4] 2> 966635 INFO (coreLoadExecutor-3877-thread-1) [ x:collection1] o.a.s.c.SolrCore New index directory detected: old=null new=/home/jenkins/workspace/Lucene-Solr-6.x-Linux/solr/build/solr-core/test/J0/temp/solr.handler.TestReplicationHandler_EA53F3A6E0853F14-001/solr-instance-002/./collection1/data/index/
[junit4] 2> 966635 WARN (coreLoadExecutor-3877-thread-1) [ x:collection1] o.a.s.c.SolrCore [collection1] Solr index directory '/home/jenkins/workspace/Lucene-Solr-6.x-Linux/solr/build/solr-core/test/J0/temp/solr.handler.TestReplicationHandler_EA53F3A6E0853F14-001/solr-instance-002/./collection1/data/index' doesn't exist. Creating new index...
[junit4] 2> 966635 INFO (coreLoadExecutor-3877-thread-1) [ x:collection1] o.a.s.c.CachingDirectoryFactory return new directory for /home/jenkins/workspace/Lucene-Solr-6.x-Linux/solr/build/solr-core/test/J0/temp/solr.handler.TestReplicationHandler_EA53F3A6E0853F14-001/solr-instance-002/./collection1/data/index
[junit4] 2> 966635 INFO (coreLoadExecutor-3877-thread-1) [ x:collection1] o.a.s.u.RandomMergePolicy RandomMergePolicy wrapping class org.apache.lucene.index.TieredMergePolicy: [TieredMergePolicy: maxMergeAtOnce=25, maxMergeAtOnceExplicit=32, maxMergedSegmentMB=29.6669921875, floorSegmentMB=0.7529296875, forceMergeDeletesPctAllowed=12.889648540775555, segmentsPerTier=10.0, maxCFSSegmentSizeMB=8.796093022207999E12, noCFSRatio=0.10830915569079878
[junit4] 2> 966635 INFO (coreLoadExecutor-3877-thread-1) [ x:collection1] o.a.s.c.SolrDeletionPolicy SolrDeletionPolicy.onCommit: commits: num=1
[junit4] 2> commit{dir=MockDirectoryWrapper(RAMDirectory@28e9d09a lockFactory=org.apache.lucene.store.SingleInstanceLockFactory@5d498c99),segFN=segments_1,generation=1}
[junit4] 2> 966635 INFO (coreLoadExecutor-3877-thread-1) [ x:collection1] o.a.s.c.SolrDeletionPolicy newest commit generation = 1
[junit4] 2> 966635 INFO (OldIndexDirectoryCleanupThreadForCore-collection1) [ x:collection1] o.a.s.c.SolrCore Looking for old index directories to cleanup for core collection1 in /home/jenkins/workspace/Lucene-Solr-6.x-Linux/solr/build/solr-core/test/J0/temp/solr.handler.TestReplicationHandler_EA53F3A6E0853F14-001/solr-instance-002/./collection1/data/
[junit4] 2> 966636 INFO (coreLoadExecutor-3877-thread-1) [ x:collection1] o.a.s.c.SolrCore no updateRequestProcessorChain defined as default, creating implicit default
[junit4] 2> 966637 INFO (coreLoadExecutor-3877-thread-1) [ x:collection1] o.a.s.h.l.XMLLoader xsltCacheLifetimeSeconds=60
[junit4] 2> 966637 INFO (coreLoadExecutor-3877-thread-1) [ x:collection1] o.a.s.h.l.XMLLoader xsltCacheLifetimeSeconds=60
[junit4] 2> 966638 INFO (coreLoadExecutor-3877-thread-1) [ x:collection1] o.a.s.h.l.XMLLoader xsltCacheLifetimeSeconds=60
[junit4] 2> 966638 INFO (coreLoadExecutor-3877-thread-1) [ x:collection1] o.a.s.h.l.XMLLoader xsltCacheLifetimeSeconds=60
[junit4] 2> 966639 INFO (coreLoadExecutor-3877-thread-1) [ x:collection1] o.a.s.c.PluginBag requestHandler : 'lazy' created with startup=lazy
[junit4] 2> 966639 INFO (coreLoadExecutor-3877-thread-1) [ x:collection1] o.a.s.c.RequestHandlers Registered paths: /admin/mbeans,standard,lazy,/update/json/docs,/admin/luke,/export,/get,/admin/properties,/update/json,/admin/threads,/update/csv,/sql,/admin/segments,/admin/system,/replication,defaults,/config,/stream,/schema,/admin/plugins,/admin/logging,/admin/ping,/update,/admin/file
[junit4] 2> 966639 INFO (coreLoadExecutor-3877-thread-1) [ x:collection1] o.a.s.c.SolrCore Using default statsCache cache: org.apache.solr.search.stats.LocalStatsCache
[junit4] 2> 966639 INFO (coreLoadExecutor-3877-thread-1) [ x:collection1] o.a.s.u.CommitTracker Hard AutoCommit: disabled
[junit4] 2> 966639 INFO (coreLoadExecutor-3877-thread-1) [ x:collection1] o.a.s.u.CommitTracker Soft AutoCommit: disabled
[junit4] 2> 966639 INFO (coreLoadExecutor-3877-thread-1) [ x:collection1] o.a.s.u.RandomMergePolicy RandomMergePolicy wrapping class org.apache.lucene.index.TieredMergePolicy: [TieredMergePolicy: maxMergeAtOnce=10, maxMergeAtOnceExplicit=12, maxMergedSegmentMB=87.146484375, floorSegmentMB=1.4404296875, forceMergeDeletesPctAllowed=0.033041544331248174, segmentsPerTier=49.0, maxCFSSegmentSizeMB=8.796093022207999E12, noCFSRatio=0.0
[junit4] 2> 966639 INFO (coreLoadExecutor-3877-thread-1) [ x:collection1] o.a.s.c.SolrDeletionPolicy SolrDeletionPolicy.onInit: commits: num=1
[junit4] 2> commit{dir=MockDirectoryWrapper(RAMDirectory@28e9d09a lockFactory=org.apache.lucene.store.SingleInstanceLockFactory@5d498c99),segFN=segments_1,generation=1}
[junit4] 2> 966639 INFO (coreLoadExecutor-3877-thread-1) [ x:collection1] o.a.s.c.SolrDeletionPolicy newest commit generation = 1
[junit4] 2> 966639 INFO (coreLoadExecutor-3877-thread-1) [ x:collection1] o.a.s.s.SolrIndexSearcher Opening [Searcher@2a879fad[collection1] main]
[junit4] 2> 966639 INFO (coreLoadExecutor-3877-thread-1) [ x:collection1] o.a.s.r.ManagedResourceStorage File-based storage initialized to use dir: /home/jenkins/workspace/Lucene-Solr-6.x-Linux/solr/build/solr-core/test/J0/temp/solr.handler.TestReplicationHandler_EA53F3A6E0853F14-001/solr-instance-002/collection1/conf
[junit4] 2> 966639 INFO (coreLoadExecutor-3877-thread-1) [ x:collection1] o.a.s.r.RestManager Initializing RestManager with initArgs: {storageDir=/home/jenkins/workspace/Lucene-Solr-6.x-Linux/solr/build/solr-core/test/J0/temp/solr.handler.TestReplicationHandler_EA53F3A6E0853F14-001/solr-instance-002/collection1/conf}
[junit4] 2> 966639 INFO (coreLoadExecutor-3877-thread-1) [ x:collection1] o.a.s.r.ManagedResourceStorage Reading _rest_managed.json using file:dir=/home/jenkins/workspace/Lucene-Solr-6.x-Linux/solr/build/solr-core/test/J0/temp/solr.handler.TestReplicationHandler_EA53F3A6E0853F14-001/solr-instance-002/collection1/conf
[junit4] 2> 966639 INFO (coreLoadExecutor-3877-thread-1) [ x:collection1] o.a.s.r.RestManager Initializing 0 registered ManagedResources
[junit4] 2> 966639 INFO (coreLoadExecutor-3877-thread-1) [ x:collection1] o.a.s.h.ReplicationHandler Commits will be reserved for 10000
[junit4] 2> 966640 INFO (searcherExecutor-3878-thread-1-processing-x:collection1) [ x:collection1] o.a.s.c.SolrCore [collection1] Registered new searcher Searcher@2a879fad[collection1] main{ExitableDirectoryReader(UninvertingDirectoryReader())}
[junit4] 2> 966640 INFO (coreLoadExecutor-3877-thread-1) [ x:collection1] o.a.s.c.CoreContainer registering core: collection1
[junit4] 2> 967124 INFO (TEST-TestReplicationHandler.doTestRepeater-seed#[EA53F3A6E0853F14]) [ ] o.a.s.SolrTestCaseJ4 Writing core.properties file to /home/jenkins/workspace/Lucene-Solr-6.x-Linux/solr/build/solr-core/test/J0/temp/solr.handler.TestReplicationHandler_EA53F3A6E0853F14-001/solr-instance-003/collection1
[junit4] 2> 967130 INFO (TEST-TestReplicationHandler.doTestRepeater-seed#[EA53F3A6E0853F14]) [ ] o.e.j.s.Server jetty-9.3.8.v20160314
[junit4] 2> 967131 INFO (TEST-TestReplicationHandler.doTestRepeater-seed#[EA53F3A6E0853F14]) [ ] o.e.j.s.h.ContextHandler Started o.e.j.s.ServletContextHandler@6af114c3{/solr,null,AVAILABLE}
[junit4] 2> 967131 INFO (TEST-TestReplicationHandler.doTestRepeater-seed#[EA53F3A6E0853F14]) [ ] o.e.j.s.ServerConnector Started ServerConnector@57145dae{HTTP/1.1,[http/1.1]}{127.0.0.1:41984}
[junit4] 2> 967131 INFO (TEST-TestReplicationHandler.doTestRepeater-seed#[EA53F3A6E0853F14]) [ ] o.e.j.s.Server Started @968719ms
[junit4] 2> 967131 INFO (TEST-TestReplicationHandler.doTestRepeater-seed#[EA53F3A6E0853F14]) [ ] o.a.s.c.s.e.JettySolrRunner Jetty properties: {solr.data.dir=/home/jenkins/workspace/Lucene-Solr-6.x-Linux/solr/build/solr-core/test/J0/temp/solr.handler.TestReplicationHandler_EA53F3A6E0853F14-001/solr-instance-003/collection1/data, hostContext=/solr, hostPort=41984}
[junit4] 2> 967132 INFO (TEST-TestReplicationHandler.doTestRepeater-seed#[EA53F3A6E0853F14]) [ ] o.a.s.s.SolrDispatchFilter SolrDispatchFilter.init(): sun.misc.Launcher$AppClassLoader@73d16e93
[junit4] 2> 967132 INFO (TEST-TestReplicationHandler.doTestRepeater-seed#[EA53F3A6E0853F14]) [ ] o.a.s.c.SolrResourceLoader new SolrResourceLoader for directory: '/home/jenkins/workspace/Lucene-Solr-6.x-Linux/solr/build/solr-core/test/J0/temp/solr.handler.TestReplicationHandler_EA53F3A6E0853F14-001/solr-instance-003'
[junit4] 2> 967132 INFO (TEST-TestReplicationHandler.doTestRepeater-seed#[EA53F3A6E0853F14]) [ ] o.a.s.c.SolrResourceLoader JNDI not configured for solr (NoInitialContextEx)
[junit4] 2> 967132 INFO (TEST-TestReplicationHandler.doTestRepeater-seed#[EA53F3A6E0853F14]) [ ] o.a.s.c.SolrResourceLoader solr home defaulted to 'solr/' (could not find system property or JNDI)
[junit4] 2> 967132 INFO (TEST-TestReplicationHandler.doTestRepeater-seed#[EA53F3A6E0853F14]) [ ] o.a.s.c.SolrXmlConfig Loading container configuration from /home/jenkins/workspace/Lucene-Solr-6.x-Linux/solr/build/solr-core/test/J0/temp/solr.handler.TestReplicationHandler_EA53F3A6E0853F14-001/solr-instance-003/solr.xml
[junit4] 2> 967134 INFO (TEST-TestReplicationHandler.doTestRepeater-seed#[EA53F3A6E0853F14]) [ ] o.a.s.c.CorePropertiesLocator Config-defined core root directory: /home/jenkins/workspace/Lucene-Solr-6.x-Linux/solr/build/solr-core/test/J0/temp/solr.handler.TestReplicationHandler_EA53F3A6E0853F14-001/solr-instance-003/.
[junit4] 2> 967134 INFO (TEST-TestReplicationHandler.doTestRepeater-seed#[EA53F3A6E0853F14]) [ ] o.a.s.c.CoreContainer New CoreContainer 1190761354
[junit4] 2> 967134 INFO (TEST-TestReplicationHandler.doTestRepeater-seed#[EA53F3A6E0853F14]) [ ] o.a.s.c.CoreContainer Loading cores into CoreContainer [instanceDir=/home/jenkins/workspace/Lucene-Solr-6.x-Linux/solr/build/solr-core/test/J0/temp/solr.handler.TestReplicationHandler_EA53F3A6E0853F14-001/solr-instance-003]
[junit4] 2> 967135 WARN (TEST-TestReplicationHandler.doTestRepeater-seed#[EA53F3A6E0853F14]) [ ] o.a.s.c.CoreContainer Couldn't add files from /home/jenkins/workspace/Lucene-Solr-6.x-Linux/solr/build/solr-core/test/J0/temp/solr.handler.TestReplicationHandler_EA53F3A6E0853F14-001/solr-instance-003/lib to classpath: /home/jenkins/workspace/Lucene-Solr-6.x-Linux/solr/build/solr-core/test/J0/temp/solr.handler.TestReplicationHandler_EA53F3A6E0853F14-001/solr-instance-003/lib
[junit4] 2> 967135 INFO (TEST-TestReplicationHandler.doTestRepeater-seed#[EA53F3A6E0853F14]) [ ] o.a.s.h.c.HttpShardHandlerFactory created with socketTimeout : 90000,urlScheme : ,connTimeout : 15000,maxConnectionsPerHost : 20,maxConnections : 10000,corePoolSize : 0,maximumPoolSize : 2147483647,maxThreadIdleTime : 5,sizeOfQueue : -1,fairnessPolicy : false,useRetries : false,
[junit4] 2> 967135 INFO (TEST-TestReplicationHandler.doTestRepeater-seed#[EA53F3A6E0853F14]) [ ] o.a.s.u.UpdateShardHandler Creating UpdateShardHandler HTTP client with params: socketTimeout=340000&connTimeout=45000&retry=true
[junit4] 2> 967135 INFO (TEST-TestReplicationHandler.doTestRepeater-seed#[EA53F3A6E0853F14]) [ ] o.a.s.l.LogWatcher SLF4J impl is org.slf4j.impl.Log4jLoggerFactory
[junit4] 2> 967135 INFO (TEST-TestReplicationHandler.doTestRepeater-seed#[EA53F3A6E0853F14]) [ ] o.a.s.l.LogWatcher Registering Log Listener [Log4j (org.slf4j.impl.Log4jLoggerFactory)]
[junit4] 2> 967135 INFO (TEST-TestReplicationHandler.doTestRepeater-seed#[EA53F3A6E0853F14]) [ ] o.a.s.c.CoreContainer Security conf doesn't exist. Skipping setup for authorization module.
[junit4] 2> 967136 INFO (TEST-TestReplicationHandler.doTestRepeater-seed#[EA53F3A6E0853F14]) [ ] o.a.s.c.CoreContainer No authentication plugin used.
[junit4] 2> 967136 INFO (TEST-TestReplicationHandler.doTestRepeater-seed#[EA53F3A6E0853F14]) [ ] o.a.s.c.CorePropertiesLocator Looking for core definitions underneath /home/jenkins/workspace/Lucene-Solr-6.x-Linux/solr/build/solr-core/test/J0/temp/solr.handler.TestReplicationHandler_EA53F3A6E0853F14-001/solr-instance-003/.
[junit4] 2> 967136 INFO (TEST-TestReplicationHandler.doTestRepeater-seed#[EA53F3A6E0853F14]) [ ] o.a.s.c.CoreDescriptor Created CoreDescriptor: {name=collection1, config=solrconfig.xml, loadOnStartup=true, schema=schema.xml, configSetProperties=configsetprops.json, transient=false, dataDir=data/}
[junit4] 2> 967137 INFO (TEST-TestReplicationHandler.doTestRepeater-seed#[EA53F3A6E0853F14]) [ ] o.a.s.c.CorePropertiesLocator Found core collection1 in /home/jenkins/workspace/Lucene-Solr-6.x-Linux/solr/build/solr-core/test/J0/temp/solr.handler.TestReplicationHandler_EA53F3A6E0853F14-001/solr-instance-003/./collection1
[junit4] 2> 967137 INFO (TEST-TestReplicationHandler.doTestRepeater-seed#[EA53F3A6E0853F14]) [ ] o.a.s.c.CorePropertiesLocator Found 1 core definitions
[junit4] 2> 967137 INFO (coreLoadExecutor-3887-thread-1) [ ] o.a.s.c.SolrResourceLoader new SolrResourceLoader for directory: '/home/jenkins/workspace/Lucene-Solr-6.x-Linux/solr/build/solr-core/test/J0/temp/solr.handler.TestReplicationHandler_EA53F3A6E0853F14-001/solr-instance-003/collection1'
[junit4] 2> 967137 INFO (TEST-TestReplicationHandler.doTestRepeater-seed#[EA53F3A6E0853F14]) [ ] o.a.s.s.SolrDispatchFilter user.dir=/home/jenkins/workspace/Lucene-Solr-6.x-Linux/solr/build/solr-core/test/J0
[junit4] 2> 967137 INFO (TEST-TestReplicationHandler.doTestRepeater-seed#[EA53F3A6E0853F14]) [ ] o.a.s.s.SolrDispatchFilter SolrDispatchFilter.init() done
[junit4] 2> 967137 INFO (coreLoadExecutor-3887-thread-1) [ ] o.a.s.c.SolrResourceLoader JNDI not configured for solr (NoInitialContextEx)
[junit4] 2> 967137 INFO (coreLoadExecutor-3887-thread-1) [ ] o.a.s.c.SolrResourceLoader solr home defaulted to 'solr/' (could not find system property or JNDI)
[junit4] 2> 967140 INFO (coreLoadExecutor-3887-thread-1) [ ] o.a.s.c.SolrConfig current version of requestparams : -1
[junit4] 2> 967142 INFO (coreLoadExecutor-3887-thread-1) [ ] o.a.s.c.SolrConfig Using Lucene MatchVersion: 6.1.0
[junit4] 2> 967145 INFO (coreLoadExecutor-3887-thread-1) [ ] o.a.s.c.SolrConfig Loaded SolrConfig: solrconfig.xml
[junit4] 2> 967147 INFO (coreLoadExecutor-3887-thread-1) [ ] o.a.s.s.IndexSchema [collection1] Schema name=test
[junit4] 2> 967190 INFO (coreLoadExecutor-3887-thread-1) [ ] o.a.s.s.IndexSchema unique key field: id
[junit4] 2> 967191 INFO (coreLoadExecutor-3887-thread-1) [ ] o.a.s.c.ConfigSetProperties Did not find ConfigSet properties, assuming default properties: Can't find resource 'configsetprops.json' in classpath or '/home/jenkins/workspace/Lucene-Solr-6.x-Linux/solr/build/solr-core/test/J0/temp/solr.handler.TestReplicationHandler_EA53F3A6E0853F14-001/solr-instance-003/collection1'
[junit4] 2> 967191 INFO (coreLoadExecutor-3887-thread-1) [ ] o.a.s.c.CoreContainer Creating SolrCore 'collection1' using configuration from instancedir /home/jenkins/workspace/Lucene-Solr-6.x-Linux/solr/build/solr-core/test/J0/temp/solr.handler.TestReplicationHandler_EA53F3A6E0853F14-001/solr-instance-003/./collection1
[junit4] 2> 967191 INFO (coreLoadExecutor-3887-thread-1) [ x:collection1] o.a.s.c.SolrCore org.apache.solr.core.MockDirectoryFactory
[junit4] 2> 967192 INFO (coreLoadExecutor-3887-thread-1) [ x:collection1] o.a.s.c.SolrCore [[collection1] ] Opening new SolrCore at [/home/jenkins/workspace/Lucene-Solr-6.x-Linux/solr/build/solr-core/test/J0/temp/solr.handler.TestReplicationHandler_EA53F3A6E0853F14-001/solr-instance-003/collection1], dataDir=[/home/jenkins/workspace/Lucene-Solr-6.x-Linux/solr/build/solr-core/test/J0/temp/solr.handler.TestReplicationHandler_EA53F3A6E0853F14-001/solr-instance-003/./collection1/data/]
[junit4] 2> 967192 INFO (coreLoadExecutor-3887-thread-1) [ x:collection1] o.a.s.c.SolrCore JMX monitoring not detected for core: collection1
[junit4] 2> 967192 INFO (coreLoadExecutor-3887-thread-1) [ x:collection1] o.a.s.c.CachingDirectoryFactory return new directory for /home/jenkins/workspace/Lucene-Solr-6.x-Linux/solr/build/solr-core/test/J0/temp/solr.handler.TestReplicationHandler_EA53F3A6E0853F14-001/solr-instance-003/./collection1/data
[junit4] 2> 967192 INFO (coreLoadExecutor-3887-thread-1) [ x:collection1] o.a.s.c.SolrCore New index directory detected: old=null new=/home/jenkins/workspace/Lucene-Solr-6.x-Linux/solr/build/solr-core/test/J0/temp/solr.handler.TestReplicationHandler_EA53F3A6E0853F14-001/solr-instance-003/./collection1/data/index/
[junit4] 2> 967192 WARN (coreLoadExecutor-3887-thread-1) [ x:collection1] o.a.s.c.SolrCore [collection1] Solr index directory '/home/jenkins/workspace/Lucene-Solr-6.x-Linux/solr/build/solr-core/test/J0/temp/solr.handler.TestReplicationHandler_EA53F3A6E0853F14-001/solr-instance-003/./collection1/data/index' doesn't exist. Creating new index...
[junit4] 2> 967192 INFO (coreLoadExecutor-3887-thread-1) [ x:collection1] o.a.s.c.CachingDirectoryFactory return new directory for /home/jenkins/workspace/Lucene-Solr-6.x-Linux/solr/build/solr-core/test/J0/temp/solr.handler.TestReplicationHandler_EA53F3A6E0853F14-001/solr-instance-003/./collection1/data/index
[junit4] 2> 967192 INFO (coreLoadExecutor-3887-thread-1) [ x:collection1] o.a.s.u.RandomMergePolicy RandomMergePolicy wrapping class org.apache.lucene.index.TieredMergePolicy: [TieredMergePolicy: maxMergeAtOnce=25, maxMergeAtOnceExplicit=32, maxMergedSegmentMB=29.6669921875, floorSegmentMB=0.7529296875, forceMergeDeletesPctAllowed=12.889648540775555, segmentsPerTier=10.0, maxCFSSegmentSizeMB=8.796093022207999E12, noCFSRatio=0.10830915569079878
[junit4] 2> 967192 INFO (coreLoadExecutor-3887-thread-1) [ x:collection1] o.a.s.c.SolrDeletionPolicy SolrDeletionPolicy.onCommit: commits: num=1
[junit4] 2> commit{dir=MockDirectoryWrapper(RAMDirectory@5dc028fe lockFactory=org.apache.lucene.store.SingleInstanceLockFactory@2b493605),segFN=segments_1,generation=1}
[junit4] 2> 967192 INFO (coreLoadExecutor-3887-thread-1) [ x:collection1] o.a.s.c.SolrDeletionPolicy newest commit generation = 1
[junit4] 2> 967193 INFO (OldIndexDirectoryCleanupThreadForCore-collection1) [ x:collection1] o.a.s.c.SolrCore Looking for old index directories to cleanup for core collection1 in /home/jenkins/workspace/Lucene-Solr-6.x-Linux/solr/build/solr-core/test/J0/temp/solr.handler.TestReplicationHandler_EA53F3A6E0853F14-001/solr-instance-003/./collection1/data/
[junit4] 2> 967194 INFO (coreLoadExecutor-3887-thread-1) [ x:collection1] o.a.s.c.SolrCore no updateRequestProcessorChain defined as default, creating implicit default
[junit4] 2> 967194 INFO (coreLoadExecutor-3887-thread-1) [ x:collection1] o.a.s.h.l.XMLLoader xsltCacheLifetimeSeconds=60
[junit4] 2> 967194 INFO (coreLoadExecutor-3887-thread-1) [ x:collection1] o.a.s.h.l.XMLLoader xsltCacheLifetimeSeconds=60
[junit4] 2> 967195 INFO (coreLoadExecutor-3887-thread-1) [ x:collection1] o.a.s.h.l.XMLLoader xsltCacheLifetimeSeconds=60
[junit4] 2> 967195 INFO (coreLoadExecutor-3887-thread-1) [ x:collection1] o.a.s.h.l.XMLLoader xsltCacheLifetimeSeconds=60
[junit4] 2> 967196 INFO (coreLoadExecutor-3887-thread-1) [ x:collection1] o.a.s.c.PluginBag requestHandler : 'lazy' created with startup=lazy
[junit4] 2> 967196 INFO (coreLoadExecutor-3887-thread-1) [ x:collection1] o.a.s.c.RequestHandlers Registered paths: /admin/mbeans,standard,lazy,/update/json/docs,/admin/luke,/export,/get,/admin/properties,/update/json,/admin/threads,/update/csv,/sql,/admin/segments,/admin/system,/replication,defaults,/config,/stream,/schema,/admin/plugins,/admin/logging,/admin/ping,/update,/admin/file
[junit4] 2> 967196 INFO (coreLoadExecutor-3887-thread-1) [ x:collection1] o.a.s.c.SolrCore Using default statsCache cache: org.apache.solr.search.stats.LocalStatsCache
[junit4] 2> 967196 INFO (coreLoadExecutor-3887-thread-1) [ x:collection1] o.a.s.u.CommitTracker Hard AutoCommit: disabled
[junit4] 2> 967196 INFO (coreLoadExecutor-3887-thread-1) [ x:collection1] o.a.s.u.CommitTracker Soft AutoCommit: disabled
[junit4] 2> 967196 INFO (coreLoadExecutor-3887-thread-1) [ x:collection1] o.a.s.u.RandomMergePolicy RandomMergePolicy wrapping class org.apache.lucene.index.TieredMergePolicy: [TieredMergePolicy: maxMergeAtOnce=10, maxMergeAtOnceExplicit=12, maxMergedSegmentMB=87.146484375, floorSegmentMB=1.4404296875, forceMergeDeletesPctAllowed=0.033041544331248174, segmentsPerTier=49.0, maxCFSSegmentSizeMB=8.796093022207999E12, noCFSRatio=0.0
[junit4] 2> 967196 INFO (coreLoadExecutor-3887-thread-1) [ x:collection1] o.a.s.c.SolrDeletionPolicy SolrDeletionPolicy.onInit: commits: num=1
[junit4] 2> commit{dir=MockDirectoryWrapper(RAMDirectory@5dc028fe lockFactory=org.apache.lucene.store.SingleInstanceLockFactory@2b493605),segFN=segments_1,generation=1}
[junit4] 2> 967196 INFO (coreLoadExecutor-3887-thread-1) [ x:collection1] o.a.s.c.SolrDeletionPolicy newest commit generation = 1
[junit4] 2> 967196 INFO (coreLoadExecutor-3887-thread-1) [ x:collection1] o.a.s.s.SolrIndexSearcher Opening [Searcher@528b359b[collection1] main]
[junit4] 2> 967197 INFO (coreLoadExecutor-3887-thread-1) [ x:collection1] o.a.s.r.ManagedResourceStorage File-based storage initialized to use dir: /home/jenkins/workspace/Lucene-Solr-6.x-Linux/solr/build/solr-core/test/J0/temp/solr.handler.TestReplicationHandler_EA53F3A6E0853F14-001/solr-instance-003/collection1/conf
[junit4] 2> 967197 INFO (coreLoadExecutor-3887-thread-1) [ x:collection1] o.a.s.r.RestManager Initializing RestManager with initArgs: {storageDir=/home/jenkins/workspace/Lucene-Solr-6.x-Linux/solr/build/solr-core/test/J0/temp/solr.handler.TestReplicationHandler_EA53F3A6E0853F14-001/solr-instance-003/collection1/conf}
[junit4] 2> 967197 INFO (coreLoadExecutor-3887-thread-1) [ x:collection1] o.a.s.r.ManagedResourceStorage Reading _rest_managed.json using file:dir=/home/jenkins/workspace/Lucene-Solr-6.x-Linux/solr/build/solr-core/test/J0/temp/solr.handler.TestReplicationHandler_EA53F3A6E0853F14-001/solr-instance-003/collection1/conf
[junit4] 2> 967197 INFO (coreLoadExecutor-3887-thread-1) [ x:collection1] o.a.s.r.RestManager Initializing 0 registered ManagedResources
[junit4] 2> 967197 WARN (coreLoadExecutor-3887-thread-1) [ x:collection1] o.a.s.h.IndexFetcher 'masterUrl' must be specified without the /replication suffix
[junit4] 2> 967198 INFO (coreLoadExecutor-3887-thread-1) [ x:collection1] o.a.s.h.ReplicationHandler No value set for 'pollInterval'. Timer Task not started.
[junit4] 2> 967198 INFO (coreLoadExecutor-3887-thread-1) [ x:collection1] o.a.s.h.ReplicationHandler Replication enabled for following config files: schema.xml
[junit4] 2> 967198 INFO (coreLoadExecutor-3887-thread-1) [ x:collection1] o.a.s.h.ReplicationHandler Commits will be reserved for 10000
[junit4] 2> 967198 INFO (searcherExecutor-3888-thread-1-processing-x:collection1) [ x:collection1] o.a.s.c.SolrCore [collection1] Registered new searcher Searcher@528b359b[collection1] main{ExitableDirectoryReader(UninvertingDirectoryReader())}
[junit4] 2> 967198 INFO (coreLoadExecutor-3887-thread-1) [ x:collection1] o.a.s.c.CoreContainer registering core: collection1
[junit4] 2> 967640 INFO (qtp1703579395-7929) [ x:collection1] o.a.s.u.p.LogUpdateProcessorFactory [collection1] webapp=/solr path=/update params={wt=javabin&version=2}{add=[0]} 0 0
[junit4] 2> 967642 INFO (qtp1703579395-7930) [ x:collection1] o.a.s.u.p.LogUpdateProcessorFactory [collection1] webapp=/solr path=/update params={wt=javabin&version=2}{add=[1]} 0 0
[junit4] 2> 967643 INFO (qtp1703579395-7931) [ x:collection1] o.a.s.u.p.LogUpdateProcessorFactory [collection1] webapp=/solr path=/update params={wt=javabin&version=2}{add=[2]} 0 0
[junit4] 2> 967645 INFO (qtp1703579395-7924) [ x:collection1] o.a.s.u.DirectUpdateHandler2 start commit{,optimize=false,openSearcher=true,waitSearcher=true,expungeDeletes=false,softCommit=false,prepareCommit=false}
[junit4] 2> 967646 INFO (qtp1703579395-7924) [ x:collection1] o.a.s.c.SolrDeletionPolicy SolrDeletionPolicy.onCommit: commits: num=2
[junit4] 2> commit{dir=MockDirectoryWrapper(RAMDirectory@27061e14 lockFactory=org.apache.lucene.store.SingleInstanceLockFactory@1044a8b5),segFN=segments_1,generation=1}
[junit4] 2> commit{dir=MockDirectoryWrapper(RAMDirectory@27061e14 lockFactory=org.apache.lucene.store.SingleInstanceLockFactory@1044a8b5),segFN=segments_2,generation=2}
[junit4] 2> 967646 INFO (qtp1703579395-7924) [ x:collection1] o.a.s.c.SolrDeletionPolicy newest commit generation = 2
[junit4] 2> 967647 INFO (qtp1703579395-7924) [ x:collection1] o.a.s.s.SolrIndexSearcher Opening [Searcher@6a5d6762[collection1] main]
[junit4] 2> 967647 INFO (qtp1703579395-7924) [ x:collection1] o.a.s.u.DirectUpdateHandler2 end_commit_flush
[junit4] 2> 967647 INFO (searcherExecutor-3855-thread-1-processing-x:collection1) [ x:collection1] o.a.s.c.SolrCore [collection1] Registered new searcher Searcher@6a5d6762[collection1] main{ExitableDirectoryReader(UninvertingDirectoryReader(Uninverting(_0(6.1.0):c3)))}
[junit4] 2> 967647 INFO (qtp1703579395-7924) [ x:collection1] o.a.s.u.p.LogUpdateProcessorFactory [collection1] webapp=/solr path=/update params={waitSearcher=true&commit=true&softCommit=false&wt=javabin&version=2}{commit=} 0 2
[junit4] 2> 967650 WARN (explicit-fetchindex-cmd) [ x:collection1] o.a.s.h.IndexFetcher 'masterUrl' must be specified without the /replication suffix
[junit4] 2> 967652 INFO (qtp1703579395-7930) [ x:collection1] o.a.s.c.S.Request [collection1] webapp=/solr path=/replication params={qt=/replication&wt=javabin&version=2&command=indexversion} status=0 QTime=0
[junit4] 2> 967652 INFO (explicit-fetchindex-cmd) [ x:collection1] o.a.s.h.IndexFetcher Master's generation: 2
[junit4] 2> 967652 INFO (explicit-fetchindex-cmd) [ x:collection1] o.a.s.h.IndexFetcher Slave's generation: 1
[junit4] 2> 967652 INFO (explicit-fetchindex-cmd) [ x:collection1] o.a.s.h.IndexFetcher Starting replication process
[junit4] 2> 967655 INFO (qtp1703579395-7931) [ x:collection1] o.a.s.c.S.Request [collection1] webapp=/solr path=/replication params={generation=2&qt=/replication&wt=javabin&version=2&command=filelist} status=0 QTime=1
[junit4] 2> 967655 INFO (explicit-fetchindex-cmd) [ x:collection1] o.a.s.h.IndexFetcher Number of files in latest index in master: 4
[junit4] 2> 967656 INFO (explicit-fetchindex-cmd) [ x:collection1] o.a.s.c.CachingDirectoryFactory return new directory for /home/jenkins/workspace/Lucene-Solr-6.x-Linux/solr/build/solr-core/test/J0/temp/solr.handler.TestReplicationHandler_EA53F3A6E0853F14-001/solr-instance-003/./collection1/data/index.20160412043045367
[junit4] 2> 967656 INFO (explicit-fetchindex-cmd) [ x:collection1] o.a.s.u.DefaultSolrCoreState Rollback old IndexWriter... core=collection1
[junit4] 2> 967656 INFO (explicit-fetchindex-cmd) [ x:collection1] o.a.s.u.RandomMergePolicy RandomMergePolicy wrapping class org.apache.lucene.index.TieredMergePolicy: [TieredMergePolicy: maxMergeAtOnce=28, maxMergeAtOnceExplicit=10, maxMergedSegmentMB=32.8916015625, floorSegmentMB=1.8974609375, forceMergeDeletesPctAllowed=8.900176652411451, segmentsPerTier=17.0, maxCFSSegmentSizeMB=8.796093022207999E12, noCFSRatio=1.0
[junit4] 2> 967656 INFO (explicit-fetchindex-cmd) [ x:collection1] o.a.s.c.SolrDeletionPolicy SolrDeletionPolicy.onInit: commits: num=1
[junit4] 2> commit{dir=MockDirectoryWrapper(RAMDirectory@5dc028fe lockFactory=org.apache.lucene.store.SingleInstanceLockFactory@2b493605),segFN=segments_1,generation=1}
[junit4] 2> 967657 INFO (explicit-fetchindex-cmd) [ x:collection1] o.a.s.c.SolrDeletionPolicy newest commit generation = 1
[junit4] 2> 967657 INFO (explicit-fetchindex-cmd) [ x:collection1] o.a.s.u.DefaultSolrCoreState New IndexWriter is ready to be used.
[junit4] 2> 967657 INFO (explicit-fetchindex-cmd) [ x:collection1] o.a.s.c.SolrDeletionPolicy SolrDeletionPolicy.onCommit: commits: num=1
[junit4] 2> commit{dir=MockDirectoryWrapper(RAMDirectory@5dc028fe lockFactory=org.apache.lucene.store.SingleInstanceLockFactory@2b493605),segFN=segments_1,generation=1}
[junit4] 2> 967657 INFO (explicit-fetchindex-cmd) [ x:collection1] o.a.s.c.SolrDeletionPolicy newest commit generation = 1
[junit4] 2> 967657 INFO (explicit-fetchindex-cmd) [ x:collection1] o.a.s.u.DefaultSolrCoreState Rollback old IndexWriter... core=collection1
[junit4] 2> 967657 INFO (explicit-fetchindex-cmd) [ x:collection1] o.a.s.h.IndexFetcher Starting download (fullCopy=false) to MockDirectoryWrapper(RAMDirectory@46bd0d7d lockFactory=org.apache.lucene.store.SingleInstanceLockFactory@6fb6c41e)
[junit4] 2> 967658 INFO (qtp1703579395-7924) [ x:collection1] o.a.s.c.S.Request [collection1] webapp=/solr path=/replication params={generation=2&qt=/replication&file=_0.cfe&checksum=true&wt=filestream&command=filecontent} status=0 QTime=0
[junit4] 2> 967661 INFO (qtp1703579395-7925) [ x:collection1] o.a.s.c.S.Request [collection1] webapp=/solr path=/replication params={generation=2&qt=/replication&file=_0.si&checksum=true&wt=filestream&command=filecontent} status=0 QTime=0
[junit4] 2> 967663 INFO (qtp1703579395-7930) [ x:collection1] o.a.s.c.S.Request [collection1] webapp=/solr path=/replication params={generation=2&qt=/replication&file=_0.cfs&checksum=true&wt=filestream&command=filecontent} status=0 QTime=0
[junit4] 2> 967665 INFO (qtp1703579395-7931) [ x:collection1] o.a.s.c.S.Request [collection1] webapp=/solr path=/replication params={generation=2&qt=/replication&file=segments_2&checksum=true&wt=filestream&command=filecontent} status=0 QTime=0
[junit4] 2> 967666 INFO (explicit-fetchindex-cmd) [ x:collection1] o.a.s.h.IndexFetcher Total time taken for download (fullCopy=false,bytesDownloaded=1943) : 0 secs (null bytes/sec) to MockDirectoryWrapper(RAMDirectory@46bd0d7d lockFactory=org.apache.lucene.store.SingleInstanceLockFactory@6fb6c41e)
[junit4] 2> 967667 INFO (explicit-fetchindex-cmd) [ x:collection1] o.a.s.u.RandomMergePolicy RandomMergePolicy wrapping class org.apache.lucene.index.LogDocMergePolicy: [LogDocMergePolicy: minMergeSize=1000, mergeFactor=22, maxMergeSize=9223372036854775807, maxMergeSizeForForcedMerge=9223372036854775807, calibrateSizeByDeletes=false, maxMergeDocs=2147483647, maxCFSSegmentSizeMB=8.796093022207999E12, noCFSRatio=0.0]
[junit4] 2> 967667 INFO (explicit-fetchindex-cmd) [ x:collection1] o.a.s.c.SolrDeletionPolicy SolrDeletionPolicy.onInit: commits: num=2
[junit4] 2> commit{dir=MockDirectoryWrapper(RAMDirectory@5dc028fe lockFactory=org.apache.lucene.store.SingleInstanceLockFactory@2b493605),segFN=segments_1,generation=1}
[junit4] 2> commit{dir=MockDirectoryWrapper(RAMDirectory@5dc028fe lockFactory=org.apache.lucene.store.SingleInstanceLockFactory@2b493605),segFN=segments_2,generation=2}
[junit4] 2> 967667 INFO (explicit-fetchindex-cmd) [ x:collection1] o.a.s.c.SolrDeletionPolicy newest commit generation = 2
[junit4] 2> 967667 INFO (explicit-fetchindex-cmd) [ x:collection1] o.a.s.u.DefaultSolrCoreState New IndexWriter is ready to be used.
[junit4] 2> 967668 INFO (explicit-fetchindex-cmd) [ x:collection1] o.a.s.s.SolrIndexSearcher Opening [Searcher@5053e9a1[collection1] main]
[junit4] 2> 967668 INFO (searcherExecutor-3888-thread-1-processing-x:collection1) [ x:collection1] o.a.s.c.SolrCore [collection1] Registered new searcher Searcher@5053e9a1[collection1] main{ExitableDirectoryReader(UninvertingDirectoryReader(Uninverting(_0(6.1.0):c3)))}
[junit4] 2> 967668 INFO (explicit-fetchindex-cmd) [ x:collection1] o.a.s.c.CachingDirectoryFactory looking to close /home/jenkins/workspace/Lucene-Solr-6.x-Linux/solr/build/solr-core/test/J0/temp/solr.handler.TestReplicationHandler_EA53F3A6E0853F14-001/solr-instance-003/./collection1/data/index.20160412043045367 [CachedDir<<refCount=0;path=/home/jenkins/workspace/Lucene-Solr-6.x-Linux/solr/build/solr-core/test/J0/temp/solr.handler.TestReplicationHandler_EA53F3A6E0853F14-001/solr-instance-003/./collection1/data/index.20160412043045367;done=true>>]
[junit4] 2> 967668 INFO (explicit-fetchindex-cmd) [ x:collection1] o.a.s.c.CachingDirectoryFactory Closing directory, CoreContainer#isShutdown=false
[junit4] 2> 967668 INFO (explicit-fetchindex-cmd) [ x:collection1] o.a.s.c.CachingDirectoryFactory Closing directory: /home/jenkins/workspace/Lucene-Solr-6.x-Linux/solr/build/solr-core/test/J0/temp/solr.handler.TestReplicationHandler_EA53F3A6E0853F14-001/solr-instance-003/./collection1/data/index.20160412043045367
[junit4] 2> 967668 INFO (qtp94157707-7982) [ x:collection1] o.a.s.c.S.Request [collection1] webapp=/solr path=/replication params={wait=true&masterUrl=http://127.0.0.1:38242/solr/collection1/replication&command=fetchindex} status=0 QTime=19
[junit4] 2> 967673 INFO (qtp94157707-7984) [ x:collection1] o.a.s.c.S.Request [collection1] webapp=/solr path=/select params={q=*:*&sort=id+desc&wt=javabin&version=2} hits=3 status=0 QTime=0
[junit4] 2> 967673 INFO (TEST-TestReplicationHandler.doTestRepeater-seed#[EA53F3A6E0853F14]) [ ] o.a.s.h.TestReplicationHandler Waited for 0ms and found 3 docs
[junit4] 2> 967678 WARN (explicit-fetchindex-cmd) [ x:collection1] o.a.s.h.IndexFetcher 'masterUrl' must be specified without the /replication suffix
[junit4] 2> 967680 INFO (qtp94157707-7982) [ x:collection1] o.a.s.c.S.Request [collection1] webapp=/solr path=/replication params={qt=/replication&wt=javabin&version=2&command=indexversion} status=0 QTime=0
[junit4] 2> 967680 INFO (explicit-fetchindex-cmd) [ x:collection1] o.a.s.h.IndexFetcher Master's generation: 2
[junit4] 2> 967680 INFO (explicit-fetchindex-cmd) [ x:collection1] o.a.s.h.IndexFetcher Slave's generation: 1
[junit4] 2> 967680 INFO (explicit-fetchindex-cmd) [ x:collection1] o.a.s.h.IndexFetcher Starting replication process
[junit4] 2> 967682 INFO (qtp94157707-7978) [ x:collection1] o.a.s.c.S.Request [collection1] webapp=/solr path=/replication params={generation=2&qt=/replication&wt=javabin&version=2&command=filelist} status=0 QTime=0
[junit4] 2> 967682 INFO (explicit-fetchindex-cmd) [ x:collection1] o.a.s.h.IndexFetcher Number of files in latest index in master: 4
[junit4] 2> 967682 INFO (explicit-fetchindex-cmd) [ x:collection1] o.a.s.c.CachingDirectoryFactory return new directory for /home/jenkins/workspace/Lucene-Solr-6.x-Linux/solr/build/solr-core/test/J0/temp/solr.handler.TestReplicationHandler_EA53F3A6E0853F14-001/solr-instance-002/./collection1/data/index.20160412043045393
[junit4] 2> 967682 INFO (explicit-fetchindex-cmd) [ x:collection1] o.a.s.u.DefaultSolrCoreState Rollback old IndexWriter... core=collection1
[junit4] 2> 967683 INFO (explicit-fetchindex-cmd) [ x:collection1] o.a.s.u.RandomMergePolicy RandomMergePolicy wrapping class org.apache.lucene.index.TieredMergePolicy: [TieredMergePolicy: maxMergeAtOnce=28, maxMergeAtOnceExplicit=10, maxMergedSegmentMB=32.8916015625, floorSegmentMB=1.8974609375, forceMergeDeletesPctAllowed=8.900176652411451, segmentsPerTier=17.0, maxCFSSegmentSizeMB=8.796093022207999E12, noCFSRatio=1.0
[junit4] 2> 967683 INFO (explicit-fetchindex-cmd) [ x:collection1] o.a.s.c.SolrDeletionPolicy SolrDeletionPolicy.onInit: commits: num=1
[junit4] 2> commit{dir=MockDirectoryWrapper(RAMDirectory@28e9d09a lockFactory=org.apache.lucene.store.SingleInstanceLockFactory@5d498c99),segFN=segments_1,generation=1}
[junit4] 2> 967683 INFO (explicit-fetchindex-cmd) [ x:collection1] o.a.s.c.SolrDeletionPolicy newest commit generation = 1
[junit4] 2> 967683 INFO (explicit-fetchindex-cmd) [ x:collection1] o.a.s.u.DefaultSolrCoreState New IndexWriter is ready to be used.
[junit4] 2> 967683 INFO (explicit-fetchindex-cmd) [ x:collection1] o.a.s.c.SolrDeletionPolicy SolrDeletionPolicy.onCommit: commits: num=1
[junit4] 2> commit{dir=MockDirectoryWrapper(RAMDirectory@28e9d09a lockFactory=org.apache.lucene.store.SingleInstanceLockFactory@5d498c99),segFN=segments_1,generation=1}
[junit4] 2> 967683 INFO (explicit-fetchindex-cmd) [ x:collection1] o.a.s.c.SolrDeletionPolicy newest commit generation = 1
[junit4] 2> 967683 INFO (explicit-fetchindex-cmd) [ x:collection1] o.a.s.u.DefaultSolrCoreState Rollback old IndexWriter... core=collection1
[junit4] 2> 967684 INFO (explicit-fetchindex-cmd) [ x:collection1] o.a.s.h.IndexFetcher Starting download (fullCopy=false) to MockDirectoryWrapper(RAMDirectory@6e7c6ce7 lockFactory=org.apache.lucene.store.SingleInstanceLockFactory@7fd34b54)
[junit4] 2> 967685 INFO (qtp94157707-7984) [ x:collection1] o.a.s.c.S.Request [collection1] webapp=/solr path=/replication params={generation=2&qt=/replication&file=_0.cfe&checksum=true&wt=filestream&command=filecontent} status=0 QTime=0
[junit4] 2> 967687 INFO (qtp94157707-7979) [ x:collection1] o.a.s.c.S.Request [collection1] webapp=/solr path=/replication params={generation=2&qt=/replication&file=_0.si&checksum=true&wt=filestream&command=filecontent} status=0 QTime=0
[junit4] 2> 967690 INFO (qtp94157707-7982) [ x:collection1] o.a.s.c.S.Request [collection1] webapp=/solr path=/replication params={generation=2&qt=/replication&file=_0.cfs&checksum=true&wt=filestream&command=filecontent} status=0 QTime=0
[junit4] 2> 967692 INFO (qtp94157707-7978) [ x:collection1] o.a.s.c.S.Request [collection1] webapp=/solr path=/replication params={generation=2&qt=/replication&file=segments_2&checksum=true&wt=filestream&command=filecontent} status=0 QTime=0
[junit4] 2> 967692 INFO (explicit-fetchindex-cmd) [ x:collection1] o.a.s.h.IndexFetcher Total time taken for download (fullCopy=false,bytesDownloaded=1943) : 0 secs (null bytes/sec) to MockDirectoryWrapper(RAMDirectory@6e7c6ce7 lockFactory=org.apache.lucene.store.SingleInstanceLockFactory@7fd34b54)
[junit4] 2> 967693 INFO (explicit-fetchindex-cmd) [ x:collection1] o.a.s.u.RandomMergePolicy RandomMergePolicy wrapping class org.apache.lucene.index.LogDocMergePolicy: [LogDocMergePolicy: minMergeSize=1000, mergeFactor=22, maxMergeSize=9223372036854775807, maxMergeSizeForForcedMerge=9223372036854775807, calibrateSizeByDeletes=false, maxMergeDocs=2147483647, maxCFSSegmentSizeMB=8.796093022207999E12, noCFSRatio=0.0]
[junit4] 2> 967693 INFO (explicit-fetchindex-cmd) [ x:collection1] o.a.s.c.SolrDeletionPolicy SolrDeletionPolicy.onInit: commits: num=2
[junit4] 2> commit{dir=MockDirectoryWrapper(RAMDirectory@28e9d09a lockFactory=org.apache.lucene.store.SingleInstanceLockFactory@5d498c99),segFN=segments_1,generation=1}
[junit4] 2> commit{dir=MockDirectoryWrapper(RAMDirectory@28e9d09a lockFactory=org.apache.lucene.store.SingleInstanceLockFactory@5d498c99),segFN=segments_2,generation=2}
[junit4] 2> 967693 INFO (explicit-fetchindex-cmd) [ x:collection1] o.a.s.c.SolrDeletionPolicy newest commit generation = 2
[junit4] 2> 967693 INFO (explicit-fetchindex-cmd) [ x:collection1] o.a.s.u.DefaultSolrCor
[...truncated too long message...]
closing IndexWriter with IndexWriterCloser
[junit4] 2> 1036487 INFO (coreCloseExecutor-4481-thread-1) [ x:collection1] o.a.s.c.SolrCore [collection1] Closing main searcher on request.
[junit4] 2> 1036487 INFO (coreCloseExecutor-4481-thread-1) [ x:collection1] o.a.s.c.CachingDirectoryFactory Closing MockDirectoryFactory - 2 directories currently being tracked
[junit4] 2> 1036487 INFO (coreCloseExecutor-4481-thread-1) [ x:collection1] o.a.s.c.CachingDirectoryFactory looking to close /home/jenkins/workspace/Lucene-Solr-6.x-Linux/solr/build/solr-core/test/J0/temp/solr.handler.TestReplicationHandler_EA53F3A6E0853F14-001/solr-instance-028/./collection1/data/index.20160412043153869 [CachedDir<<refCount=0;path=/home/jenkins/workspace/Lucene-Solr-6.x-Linux/solr/build/solr-core/test/J0/temp/solr.handler.TestReplicationHandler_EA53F3A6E0853F14-001/solr-instance-028/./collection1/data/index.20160412043153869;done=false>>]
[junit4] 2> 1036487 INFO (coreCloseExecutor-4481-thread-1) [ x:collection1] o.a.s.c.CachingDirectoryFactory Closing directory, CoreContainer#isShutdown=true
[junit4] 2> 1036487 INFO (coreCloseExecutor-4481-thread-1) [ x:collection1] o.a.s.c.CachingDirectoryFactory Closing directory: /home/jenkins/workspace/Lucene-Solr-6.x-Linux/solr/build/solr-core/test/J0/temp/solr.handler.TestReplicationHandler_EA53F3A6E0853F14-001/solr-instance-028/./collection1/data/index.20160412043153869
[junit4] 2> 1036487 INFO (coreCloseExecutor-4481-thread-1) [ x:collection1] o.a.s.c.CachingDirectoryFactory looking to close /home/jenkins/workspace/Lucene-Solr-6.x-Linux/solr/build/solr-core/test/J0/temp/solr.handler.TestReplicationHandler_EA53F3A6E0853F14-001/solr-instance-028/./collection1/data [CachedDir<<refCount=0;path=/home/jenkins/workspace/Lucene-Solr-6.x-Linux/solr/build/solr-core/test/J0/temp/solr.handler.TestReplicationHandler_EA53F3A6E0853F14-001/solr-instance-028/./collection1/data;done=false>>]
[junit4] 2> 1036487 INFO (coreCloseExecutor-4481-thread-1) [ x:collection1] o.a.s.c.CachingDirectoryFactory Closing directory, CoreContainer#isShutdown=true
[junit4] 2> 1036487 INFO (coreCloseExecutor-4481-thread-1) [ x:collection1] o.a.s.c.CachingDirectoryFactory Closing directory: /home/jenkins/workspace/Lucene-Solr-6.x-Linux/solr/build/solr-core/test/J0/temp/solr.handler.TestReplicationHandler_EA53F3A6E0853F14-001/solr-instance-028/./collection1/data
[junit4] 2> 1036488 INFO (TEST-TestReplicationHandler.doTestIndexAndConfigAliasReplication-seed#[EA53F3A6E0853F14]) [ ] o.e.j.s.h.ContextHandler Stopped o.e.j.s.ServletContextHandler@378c8969{/solr,null,UNAVAILABLE}
[junit4] 2> 1036489 INFO (SUITE-TestReplicationHandler-seed#[EA53F3A6E0853F14]-worker) [ ] o.a.s.SolrTestCaseJ4 ###deleteCore
[junit4] 2> ObjectTracker found 3 object(s) that were not released!!! [NRTCachingDirectory, NRTCachingDirectory, NRTCachingDirectory]
[junit4] 2> org.apache.solr.common.util.ObjectReleaseTracker$ObjectTrackerException
[junit4] 2> at org.apache.solr.common.util.ObjectReleaseTracker.track(ObjectReleaseTracker.java:42)
[junit4] 2> at org.apache.solr.core.CachingDirectoryFactory.get(CachingDirectoryFactory.java:347)
[junit4] 2> at org.apache.solr.handler.IndexFetcher.fetchLatestIndex(IndexFetcher.java:386)
[junit4] 2> at org.apache.solr.handler.IndexFetcher.fetchLatestIndex(IndexFetcher.java:270)
[junit4] 2> at org.apache.solr.handler.ReplicationHandler.doFetch(ReplicationHandler.java:387)
[junit4] 2> at org.apache.solr.handler.ReplicationHandler$1.run(ReplicationHandler.java:275)
[junit4] 2>
[junit4] 2> org.apache.solr.common.util.ObjectReleaseTracker$ObjectTrackerException
[junit4] 2> at org.apache.solr.common.util.ObjectReleaseTracker.track(ObjectReleaseTracker.java:42)
[junit4] 2> at org.apache.solr.core.CachingDirectoryFactory.get(CachingDirectoryFactory.java:347)
[junit4] 2> at org.apache.solr.handler.IndexFetcher.fetchLatestIndex(IndexFetcher.java:386)
[junit4] 2> at org.apache.solr.handler.IndexFetcher.fetchLatestIndex(IndexFetcher.java:270)
[junit4] 2> at org.apache.solr.handler.ReplicationHandler.doFetch(ReplicationHandler.java:387)
[junit4] 2> at org.apache.solr.handler.ReplicationHandler$1.run(ReplicationHandler.java:275)
[junit4] 2>
[junit4] 2> org.apache.solr.common.util.ObjectReleaseTracker$ObjectTrackerException
[junit4] 2> at org.apache.solr.common.util.ObjectReleaseTracker.track(ObjectReleaseTracker.java:42)
[junit4] 2> at org.apache.solr.core.CachingDirectoryFactory.get(CachingDirectoryFactory.java:347)
[junit4] 2> at org.apache.solr.handler.IndexFetcher.fetchLatestIndex(IndexFetcher.java:386)
[junit4] 2> at org.apache.solr.handler.IndexFetcher.fetchLatestIndex(IndexFetcher.java:270)
[junit4] 2> at org.apache.solr.handler.ReplicationHandler.doFetch(ReplicationHandler.java:387)
[junit4] 2> at org.apache.solr.handler.ReplicationHandler$1.run(ReplicationHandler.java:275)
[junit4] 2>
[junit4] 2> NOTE: test params are: codec=Asserting(Lucene60): {name=Lucene50(blocksize=128), id=Lucene50(blocksize=128), newname=Lucene50(blocksize=128)}, docValues:{}, maxPointsInLeafNode=836, maxMBSortInHeap=6.113467751294638, sim=RandomSimilarity(queryNorm=true,coord=crazy): {}, locale=et, timezone=Asia/Singapore
[junit4] 2> NOTE: Linux 4.2.0-34-generic amd64/Oracle Corporation 1.8.0_72 (64-bit)/cpus=12,threads=1,free=219057384,total=536870912
[junit4] 2> NOTE: All tests run in this JVM: [TestRangeQuery, TestCrossCoreJoin, ResourceLoaderTest, TestAnalyzedSuggestions, TestPhraseSuggestions, TestIBSimilarityFactory, SignatureUpdateProcessorFactoryTest, CdcrVersionReplicationTest, CdcrUpdateLogTest, TestExpandComponent, StandardRequestHandlerTest, TestSolr4Spatial, JavabinLoaderTest, TestLRUCache, TestConfigSetProperties, TestRemoteStreaming, TestSortByMinMaxFunction, ExternalFileFieldSortTest, IndexSchemaRuntimeFieldTest, URLClassifyProcessorTest, TestCustomSort, RequiredFieldsTest, CurrencyFieldOpenExchangeTest, TestOmitPositions, RankQueryTest, TestSchemaSimilarityResource, TestAuthorizationFramework, TestRTGBase, CloneFieldUpdateProcessorFactoryTest, JsonLoaderTest, TestPseudoReturnFields, DistributedQueueTest, IndexSchemaTest, CollectionTooManyReplicasTest, TestScoreJoinQPNoScore, HdfsCollectionsAPIDistributedZkTest, DistributedQueryElevationComponentTest, SharedFSAutoReplicaFailoverUtilsTest, TestMergePolicyConfig, TestExclusionRuleCollectionAccess, TestLuceneMatchVersion, TestCryptoKeys, RecoveryAfterSoftCommitTest, TestConfigSetsAPI, DocumentAnalysisRequestHandlerTest, InfoHandlerTest, TestSearcherReuse, TestJsonFacets, TestSolr4Spatial2, TestFoldingMultitermQuery, DirectoryFactoryTest, BasicDistributedZkTest, CustomCollectionTest, TestCloudManagedSchema, TestReplicaProperties, AnalysisAfterCoreReloadTest, TestBinaryField, TestLazyCores, DistributedSuggestComponentTest, AddSchemaFieldsUpdateProcessorFactoryTest, HdfsBasicDistributedZkTest, DisMaxRequestHandlerTest, TestStressLucene, TestDistribIDF, BitVectorTest, SynonymTokenizerTest, TestUseDocValuesAsStored, HLLSerializationTest, TolerantUpdateProcessorTest, TestArbitraryIndexDir, TestRawTransformer, TestManagedStopFilterFactory, AnalyticsQueryTest, AlternateDirectoryTest, SaslZkACLProviderTest, JSONWriterTest, TestPerFieldSimilarityWithDefaultOverride, QueryElevationComponentTest, PrimUtilsTest, SolrRequestParserTest, TestShortCircuitedRequests, CloudMLTQParserTest, PeerSyncTest, SyncSliceTest, CursorPagingTest, TestConfig, SolrXmlInZkTest, SOLR749Test, QueryResultKeyTest, TestMissingGroups, TestCustomDocTransformer, OutputWriterTest, ZkNodePropsTest, DistributedFacetPivotLongTailTest, TestFieldTypeResource, TestHashQParserPlugin, OverseerRolesTest, OverseerTest, LeaderElectionIntegrationTest, TestReplicationHandler]
[junit4] 2> NOTE: reproduce with: ant test -Dtestcase=TestReplicationHandler -Dtests.seed=EA53F3A6E0853F14 -Dtests.multiplier=3 -Dtests.slow=true -Dtests.locale=et -Dtests.timezone=Asia/Singapore -Dtests.asserts=true -Dtests.file.encoding=US-ASCII
[junit4] ERROR 0.00s J0 | TestReplicationHandler (suite) <<<
[junit4] > Throwable #1: java.lang.AssertionError: ObjectTracker found 3 object(s) that were not released!!! [NRTCachingDirectory, NRTCachingDirectory, NRTCachingDirectory]
[junit4] > at __randomizedtesting.SeedInfo.seed([EA53F3A6E0853F14]:0)
[junit4] > at org.apache.solr.SolrTestCaseJ4.afterClass(SolrTestCaseJ4.java:256)
[junit4] > at java.lang.Thread.run(Thread.java:745)
[junit4] Completed [307/585 (1!)] on J0 in 70.94s, 13 tests, 1 failure <<< FAILURES!
[...truncated 913 lines...]
BUILD FAILED
/home/jenkins/workspace/Lucene-Solr-6.x-Linux/build.xml:740: The following error occurred while executing this line:
/home/jenkins/workspace/Lucene-Solr-6.x-Linux/build.xml:684: The following error occurred while executing this line:
/home/jenkins/workspace/Lucene-Solr-6.x-Linux/build.xml:59: The following error occurred while executing this line:
/home/jenkins/workspace/Lucene-Solr-6.x-Linux/solr/build.xml:233: The following error occurred while executing this line:
/home/jenkins/workspace/Lucene-Solr-6.x-Linux/solr/common-build.xml:529: The following error occurred while executing this line:
/home/jenkins/workspace/Lucene-Solr-6.x-Linux/lucene/common-build.xml:1457: The following error occurred while executing this line:
/home/jenkins/workspace/Lucene-Solr-6.x-Linux/lucene/common-build.xml:1014: There were test failures: 585 suites (10 ignored), 2363 tests, 1 suite-level error, 114 ignored (70 assumptions) [seed: EA53F3A6E0853F14]
Total time: 56 minutes 48 seconds
Build step 'Invoke Ant' marked build as failure
Archiving artifacts
[WARNINGS] Skipping publisher since build result is FAILURE
Recording test results
Email was triggered for: Failure - Any
Sending email for trigger: Failure - Any