You are viewing a plain text version of this content. The canonical link for it is here.
Posted to builds@cassandra.apache.org by Apache Jenkins Server <je...@builds.apache.org> on 2025/07/30 05:25:59 UTC
Build complete: Cassandra-trunk #2226 [ABORTED] 8c9627076b0bb7956d1303e7a7454ac0c30e5074
-------------------------------------------------------------------------------
Build Cassandra-trunk #2226 Aborted
URL: https://ci-cassandra.apache.org/job/Cassandra-trunk/2226/
-------------------------------------------------------------------------------
Changes:
[David Capwell] When using BEGIN TRANSACTION if a complex mutation exists in the same statement as one that uses a reference, then the complex delete is dropped
-------------------------------------------------------------------------------
Failed Tests:
31 tests failed.
FAILED: dtest-novnode.repair_tests.incremental_repair_test.TestIncRepair.Tests / dtest-novnode jdk11 21/64 / test_multiple_full_repairs_lcs
FAILED: dtest-novnode.repair_tests.repair_test.TestRepair.Tests / dtest-novnode jdk11 2/64 / test_multiple_concurrent_repairs
FAILED: dtest-upgrade.upgrade_tests.cql_tests.TestCQLNodes2RF1_Upgrade_indev_4_0_x_To_indev_trunk.Tests / dtest-upgrade jdk11 83/160 / test_map_item_conditional
FAILED: dtest-upgrade.upgrade_tests.cql_tests.TestCQLNodes2RF1_Upgrade_indev_4_0_x_To_indev_trunk.Tests / dtest-upgrade jdk11 38/160 / test_ticket_5230
FAILED: org.apache.cassandra.distributed.test.log.InProgressSequenceCoordinationTest.Tests / jvm-dtest jdk17 11/16 / bootstrapProgressTest-_jdk17_x86_64
FAILED: org.apache.cassandra.distributed.test.log.InProgressSequenceCoordinationTest.Tests / jvm-dtest jdk17 11/16 / decommissionProgressTest-_jdk17_x86_64
FAILED: org.apache.cassandra.distributed.test.log.InProgressSequenceCoordinationTest.Tests / jvm-dtest jdk17 11/16 / inProgressSequenceRetryTest-_jdk17_x86_64
FAILED: org.apache.cassandra.distributed.test.log.InProgressSequenceCoordinationTest.Tests / jvm-dtest jdk17 11/16 / replacementProgressTest-_jdk17_x86_64
FAILED: org.apache.cassandra.service.accord.txn.TxnConditionTest.Tests / test-system-keyspace-directory jdk17 20/20 / value-system_keyspace_directory_jdk17_x86_64
FAILED: org.apache.cassandra.db.virtual.AccordDebugKeyspaceTest.Tests / test jdk11 8/20 / patchJournalVestigialTest-_jdk11_x86_64
FAILED: org.apache.cassandra.db.virtual.AccordDebugKeyspaceTest.Tests / test jdk17 8/20 / patchJournalVestigialTest-_jdk17_x86_64
FAILED: org.apache.cassandra.db.virtual.AccordDebugKeyspaceTest.Tests / test-cdc jdk11 8/20 / patchJournalVestigialTest-cdc_jdk11_x86_64
FAILED: org.apache.cassandra.db.virtual.AccordDebugKeyspaceTest.Tests / test-cdc jdk17 8/20 / patchJournalVestigialTest-cdc_jdk17_x86_64
FAILED: org.apache.cassandra.db.virtual.AccordDebugKeyspaceTest.Tests / test-compression jdk11 8/20 / patchJournalVestigialTest-compression_jdk11_x86_64
FAILED: org.apache.cassandra.db.virtual.AccordDebugKeyspaceTest.Tests / test-compression jdk17 8/20 / patchJournalVestigialTest-compression_jdk17_x86_64
FAILED: org.apache.cassandra.db.virtual.AccordDebugKeyspaceTest.Tests / test-latest jdk11 8/20 / patchJournalVestigialTest-latest_jdk11_x86_64
FAILED: org.apache.cassandra.db.virtual.AccordDebugKeyspaceTest.Tests / test-latest jdk17 8/20 / patchJournalVestigialTest-latest_jdk17_x86_64
FAILED: org.apache.cassandra.db.virtual.AccordDebugKeyspaceTest.Tests / test-oa jdk11 8/20 / patchJournalVestigialTest-oa_jdk11_x86_64
FAILED: org.apache.cassandra.db.virtual.AccordDebugKeyspaceTest.Tests / test-oa jdk17 8/20 / patchJournalVestigialTest-oa_jdk17_x86_64
FAILED: org.apache.cassandra.db.virtual.AccordDebugKeyspaceTest.Tests / test-system-keyspace-directory jdk11 8/20 / patchJournalVestigialTest-system_keyspace_directory_jdk11_x86_64
FAILED: org.apache.cassandra.db.virtual.AccordDebugKeyspaceTest.Tests / test-system-keyspace-directory jdk17 8/20 / patchJournalVestigialTest-system_keyspace_directory_jdk17_x86_64
FAILED: org.apache.cassandra.utils.btree.IntervalBTreeTest.Tests / test-latest jdk17 16/20 / testN-cassandra.testtag_IS_UNDEFINED
FAILED: org.apache.cassandra.distributed.test.accord.AccordIncrementalRepairTest.Tests / jvm-dtest jdk11 11/16 / onlyAccordTest-cassandra.testtag_IS_UNDEFINED
FAILED: org.apache.cassandra.simulator.test.AccordHarrySimulationTest.Tests / simulator-dtest jdk11 / test-cassandra.testtag_IS_UNDEFINED
FAILED: org.apache.cassandra.distributed.test.SSTableLoaderEncryptionOptionsTest.Tests / jvm-dtest jdk11 15/16 / bulkLoaderSuccessfullyStreamsOverSslWithDeprecatedSslStoragePort-_jdk11_x86_64
FAILED: org.apache.cassandra.distributed.test.SSTableLoaderEncryptionOptionsTest.Tests / jvm-dtest jdk17 15/16 / bulkLoaderSuccessfullyStreamsOverSslWithDeprecatedSslStoragePort-_jdk17_x86_64
FAILED: org.apache.cassandra.io.sstable.indexsummary.IndexSummaryTest.Tests / test-compression jdk17 12/20 / testLargeIndexSummary-cassandra.testtag_IS_UNDEFINED
FAILED: org.apache.cassandra.io.sstable.indexsummary.IndexSummaryTest.Tests / test-latest jdk17 12/20 / testLargeIndexSummary-cassandra.testtag_IS_UNDEFINED
FAILED: org.apache.cassandra.db.compaction.unified.ParallelizedTasksTest.Tests / test-latest jdk17 16/20 / testOneSSTablePerShard-cassandra.testtag_IS_UNDEFINED
FAILED: org.apache.cassandra.fuzz.sai.MultiNodeSAITest.Tests / jvm-dtest jdk17 13/16 / indexOnlySaiTest-cassandra.testtag_IS_UNDEFINED
FAILED: org.apache.cassandra.fuzz.sai.MultiNodeSAITest.Tests / jvm-dtest jdk11 13/16 / indexOnlySaiTest-cassandra.testtag_IS_UNDEFINED
-------------------------------------------------------------------------------
For complete test report and logs see https://nightlies.apache.org/cassandra/Cassandra-trunk/2226/