You are viewing a plain text version of this content. The canonical link for it is here.
Posted to yarn-dev@hadoop.apache.org by Apache Jenkins Server <je...@builds.apache.org> on 2015/05/19 17:29:51 UTC

Failed: YARN-3543 PreCommit Build #7997

Jira: https://issues.apache.org/jira/browse/YARN-3543
Build: https://builds.apache.org/job/PreCommit-YARN-Build/7997/

###################################################################################
########################## LAST 60 LINES OF THE CONSOLE ###########################
[...truncated 499 lines...]
                    |  hadoop.yarn.server.resourcemanager.scheduler.fair.TestFairSchedulerQueueACLs 
                    |  hadoop.yarn.server.resourcemanager.security.TestClientToAMTokens 
                    |  hadoop.yarn.server.resourcemanager.scheduler.capacity.TestCapacitySchedulerDynamicBehavior 
                    |  hadoop.yarn.server.resourcemanager.TestRMRestart 
                    |  hadoop.yarn.server.resourcemanager.webapp.TestRMWebServicesApps 
                    |  hadoop.yarn.server.resourcemanager.webapp.TestRMWebServicesHttpStaticUserPermissions 
                    |  hadoop.yarn.server.resourcemanager.ahs.TestRMApplicationHistoryWriter 
                    |  hadoop.yarn.server.resourcemanager.scheduler.capacity.TestCapacityScheduler 


|| Subsystem || Report/Notes ||
============================================================================
| Patch URL | http://issues.apache.org/jira/secure/attachment/12733786/0004-YARN-3543.patch |
| Optional Tests | javadoc javac unit findbugs checkstyle |
| git revision | trunk / eb4c9dd |
| checkstyle |  /home/jenkins/jenkins-slave/workspace/PreCommit-YARN-Build/patchprocess/diffcheckstylehadoop-yarn-api.txt |
| Findbugs warnings | /home/jenkins/jenkins-slave/workspace/PreCommit-YARN-Build/patchprocess/newPatchFindbugsWarningshadoop-yarn-server-resourcemanager.html |
| hadoop-mapreduce-client-jobclient test log | /home/jenkins/jenkins-slave/workspace/PreCommit-YARN-Build/patchprocess/testrun_hadoop-mapreduce-client-jobclient.txt |
| hadoop-yarn-api test log | /home/jenkins/jenkins-slave/workspace/PreCommit-YARN-Build/patchprocess/testrun_hadoop-yarn-api.txt |
| hadoop-yarn-client test log | /home/jenkins/jenkins-slave/workspace/PreCommit-YARN-Build/patchprocess/testrun_hadoop-yarn-client.txt |
| hadoop-yarn-common test log | /home/jenkins/jenkins-slave/workspace/PreCommit-YARN-Build/patchprocess/testrun_hadoop-yarn-common.txt |
| hadoop-yarn-server-applicationhistoryservice test log | /home/jenkins/jenkins-slave/workspace/PreCommit-YARN-Build/patchprocess/testrun_hadoop-yarn-server-applicationhistoryservice.txt |
| hadoop-yarn-server-common test log | /home/jenkins/jenkins-slave/workspace/PreCommit-YARN-Build/patchprocess/testrun_hadoop-yarn-server-common.txt |
| hadoop-yarn-server-resourcemanager test log | /home/jenkins/jenkins-slave/workspace/PreCommit-YARN-Build/patchprocess/testrun_hadoop-yarn-server-resourcemanager.txt |
| Test Results | https://builds.apache.org/job/PreCommit-YARN-Build/7997/testReport/ |
| Java | 1.7.0_55 |
| uname | Linux asf904.gq1.ygridcore.net 3.13.0-36-lowlatency #63-Ubuntu SMP PREEMPT Wed Sep 3 21:56:12 UTC 2014 x86_64 x86_64 x86_64 GNU/Linux |


============================================================================
============================================================================
                          Adding comment to JIRA
============================================================================
============================================================================


Comment added.
58089d0dbe5cd69a89c062d15e8ecbdb2669b4e0 logged out


============================================================================
============================================================================
                              Finished build.
============================================================================
============================================================================


Build step 'Execute shell' marked build as failure
Archiving artifacts
Sending artifact delta relative to PreCommit-YARN-Build #7995
Archived 79 artifacts
Archive block size is 32768
Received 59 blocks and 31024168 bytes
Compression is 5.9%
Took 6.2 sec
[description-setter] Could not determine description.
Recording test results
Email was triggered for: Failure
Sending email for trigger: Failure



###################################################################################
############################## FAILED TESTS (if any) ##############################
60 tests failed.
FAILED:  org.apache.hadoop.yarn.client.api.impl.TestYarnClient.testReservationAPIs

Error Message:
org.apache.hadoop.yarn.server.resourcemanager.reservation.exceptions.PlanningException: The GreedyAgent couldn't find a valid allocation for your request
 at org.apache.hadoop.yarn.ipc.RPCUtil.getRemoteException(RPCUtil.java:38)
 at org.apache.hadoop.yarn.server.resourcemanager.ClientRMService.submitReservation(ClientRMService.java:1140)
 at org.apache.hadoop.yarn.api.impl.pb.service.ApplicationClientProtocolPBServiceImpl.submitReservation(ApplicationClientProtocolPBServiceImpl.java:423)
 at org.apache.hadoop.yarn.proto.ApplicationClientProtocol$ApplicationClientProtocolService$2.callBlockingMethod(ApplicationClientProtocol.java:449)
 at org.apache.hadoop.ipc.ProtobufRpcEngine$Server$ProtoBufRpcInvoker.call(ProtobufRpcEngine.java:636)
 at org.apache.hadoop.ipc.RPC$Server.call(RPC.java:976)
 at org.apache.hadoop.ipc.Server$Handler$1.run(Server.java:2171)
 at org.apache.hadoop.ipc.Server$Handler$1.run(Server.java:2167)
 at java.security.AccessController.doPrivileged(Native Method)
 at javax.security.auth.Subject.doAs(Subject.java:415)
 at org.apache.hadoop.security.UserGroupInformation.doAs(UserGroupInformation.java:1666)
 at org.apache.hadoop.ipc.Server$Handler.run(Server.java:2165)
Caused by: org.apache.hadoop.yarn.server.resourcemanager.reservation.exceptions.PlanningException: The GreedyAgent couldn't find a valid allocation for your request
 at org.apache.hadoop.yarn.server.resourcemanager.reservation.GreedyReservationAgent.computeAllocation(GreedyReservationAgent.java:130)
 at org.apache.hadoop.yarn.server.resourcemanager.reservation.GreedyReservationAgent.createReservation(GreedyReservationAgent.java:58)
 at org.apache.hadoop.yarn.server.resourcemanager.ClientRMService.submitReservation(ClientRMService.java:1123)
 ... 10 more


Stack Trace:
java.lang.AssertionError: org.apache.hadoop.yarn.server.resourcemanager.reservation.exceptions.PlanningException: The GreedyAgent couldn't find a valid allocation for your request
	at org.apache.hadoop.yarn.ipc.RPCUtil.getRemoteException(RPCUtil.java:38)
	at org.apache.hadoop.yarn.server.resourcemanager.ClientRMService.submitReservation(ClientRMService.java:1140)
	at org.apache.hadoop.yarn.api.impl.pb.service.ApplicationClientProtocolPBServiceImpl.submitReservation(ApplicationClientProtocolPBServiceImpl.java:423)
	at org.apache.hadoop.yarn.proto.ApplicationClientProtocol$ApplicationClientProtocolService$2.callBlockingMethod(ApplicationClientProtocol.java:449)
	at org.apache.hadoop.ipc.ProtobufRpcEngine$Server$ProtoBufRpcInvoker.call(ProtobufRpcEngine.java:636)
	at org.apache.hadoop.ipc.RPC$Server.call(RPC.java:976)
	at org.apache.hadoop.ipc.Server$Handler$1.run(Server.java:2171)
	at org.apache.hadoop.ipc.Server$Handler$1.run(Server.java:2167)
	at java.security.AccessController.doPrivileged(Native Method)
	at javax.security.auth.Subject.doAs(Subject.java:415)
	at org.apache.hadoop.security.UserGroupInformation.doAs(UserGroupInformation.java:1666)
	at org.apache.hadoop.ipc.Server$Handler.run(Server.java:2165)
Caused by: org.apache.hadoop.yarn.server.resourcemanager.reservation.exceptions.PlanningException: The GreedyAgent couldn't find a valid allocation for your request
	at org.apache.hadoop.yarn.server.resourcemanager.reservation.GreedyReservationAgent.computeAllocation(GreedyReservationAgent.java:130)
	at org.apache.hadoop.yarn.server.resourcemanager.reservation.GreedyReservationAgent.createReservation(GreedyReservationAgent.java:58)
	at org.apache.hadoop.yarn.server.resourcemanager.ClientRMService.submitReservation(ClientRMService.java:1123)
	... 10 more

	at org.junit.Assert.fail(Assert.java:88)
	at org.apache.hadoop.yarn.client.api.impl.TestYarnClient.testReservationAPIs(TestYarnClient.java:1155)


REGRESSION:  org.apache.hadoop.yarn.server.resourcemanager.TestApplicationACLs.testApplicationACLs

Error Message:
org.apache.hadoop.yarn.server.utils.BuilderUtils.newApplicationReport(Lorg/apache/hadoop/yarn/api/records/ApplicationId;Lorg/apache/hadoop/yarn/api/records/ApplicationAttemptId;Ljava/lang/String;Ljava/lang/String;Ljava/lang/String;Ljava/lang/String;ILorg/apache/hadoop/yarn/api/records/Token;Lorg/apache/hadoop/yarn/api/records/YarnApplicationState;Ljava/lang/String;Ljava/lang/String;JJLorg/apache/hadoop/yarn/api/records/FinalApplicationStatus;Lorg/apache/hadoop/yarn/api/records/ApplicationResourceUsageReport;Ljava/lang/String;FLjava/lang/String;Lorg/apache/hadoop/yarn/api/records/Token;Ljava/util/Set;Z)Lorg/apache/hadoop/yarn/api/records/ApplicationReport;
 at org.apache.hadoop.yarn.server.resourcemanager.rmapp.RMAppImpl.createAndGetApplicationReport(RMAppImpl.java:660)
 at org.apache.hadoop.yarn.server.resourcemanager.ClientRMService.getApplicationReport(ClientRMService.java:334)
 at org.apache.hadoop.yarn.api.impl.pb.service.ApplicationClientProtocolPBServiceImpl.getApplicationReport(ApplicationClientProtocolPBServiceImpl.java:175)
 at org.apache.hadoop.yarn.proto.ApplicationClientProtocol$ApplicationClientProtocolService$2.callBlockingMethod(ApplicationClientProtocol.java:417)
 at org.apache.hadoop.ipc.ProtobufRpcEngine$Server$ProtoBufRpcInvoker.call(ProtobufRpcEngine.java:636)
 at org.apache.hadoop.ipc.RPC$Server.call(RPC.java:976)
 at org.apache.hadoop.ipc.Server$Handler$1.run(Server.java:2171)
 at org.apache.hadoop.ipc.Server$Handler$1.run(Server.java:2167)
 at java.security.AccessController.doPrivileged(Native Method)
 at javax.security.auth.Subject.doAs(Subject.java:415)
 at org.apache.hadoop.security.UserGroupInformation.doAs(UserGroupInformation.java:1666)
 at org.apache.hadoop.ipc.Server$Handler.run(Server.java:2165)


Stack Trace:
org.apache.hadoop.ipc.RemoteException: org.apache.hadoop.yarn.server.utils.BuilderUtils.newApplicationReport(Lorg/apache/hadoop/yarn/api/records/ApplicationId;Lorg/apache/hadoop/yarn/api/records/ApplicationAttemptId;Ljava/lang/String;Ljava/lang/String;Ljava/lang/String;Ljava/lang/String;ILorg/apache/hadoop/yarn/api/records/Token;Lorg/apache/hadoop/yarn/api/records/YarnApplicationState;Ljava/lang/String;Ljava/lang/String;JJLorg/apache/hadoop/yarn/api/records/FinalApplicationStatus;Lorg/apache/hadoop/yarn/api/records/ApplicationResourceUsageReport;Ljava/lang/String;FLjava/lang/String;Lorg/apache/hadoop/yarn/api/records/Token;Ljava/util/Set;Z)Lorg/apache/hadoop/yarn/api/records/ApplicationReport;
	at org.apache.hadoop.yarn.server.resourcemanager.rmapp.RMAppImpl.createAndGetApplicationReport(RMAppImpl.java:660)
	at org.apache.hadoop.yarn.server.resourcemanager.ClientRMService.getApplicationReport(ClientRMService.java:334)
	at org.apache.hadoop.yarn.api.impl.pb.service.ApplicationClientProtocolPBServiceImpl.getApplicationReport(ApplicationClientProtocolPBServiceImpl.java:175)
	at org.apache.hadoop.yarn.proto.ApplicationClientProtocol$ApplicationClientProtocolService$2.callBlockingMethod(ApplicationClientProtocol.java:417)
	at org.apache.hadoop.ipc.ProtobufRpcEngine$Server$ProtoBufRpcInvoker.call(ProtobufRpcEngine.java:636)
	at org.apache.hadoop.ipc.RPC$Server.call(RPC.java:976)
	at org.apache.hadoop.ipc.Server$Handler$1.run(Server.java:2171)
	at org.apache.hadoop.ipc.Server$Handler$1.run(Server.java:2167)
	at java.security.AccessController.doPrivileged(Native Method)
	at javax.security.auth.Subject.doAs(Subject.java:415)
	at org.apache.hadoop.security.UserGroupInformation.doAs(UserGroupInformation.java:1666)
	at org.apache.hadoop.ipc.Server$Handler.run(Server.java:2165)

	at org.apache.hadoop.ipc.Client.call(Client.java:1489)
	at org.apache.hadoop.ipc.Client.call(Client.java:1420)
	at org.apache.hadoop.ipc.ProtobufRpcEngine$Invoker.invoke(ProtobufRpcEngine.java:229)
	at com.sun.proxy.$Proxy14.getApplicationReport(Unknown Source)
	at org.apache.hadoop.yarn.api.impl.pb.client.ApplicationClientProtocolPBClientImpl.getApplicationReport(ApplicationClientProtocolPBClientImpl.java:191)
	at org.apache.hadoop.yarn.server.resourcemanager.TestApplicationACLs.verifyOwnerAccess(TestApplicationACLs.java:243)
	at org.apache.hadoop.yarn.server.resourcemanager.TestApplicationACLs.testApplicationACLs(TestApplicationACLs.java:171)


REGRESSION:  org.apache.hadoop.yarn.server.resourcemanager.TestClientRMService.testAppSubmit

Error Message:
org.apache.hadoop.yarn.server.utils.BuilderUtils.newApplicationReport(Lorg/apache/hadoop/yarn/api/records/ApplicationId;Lorg/apache/hadoop/yarn/api/records/ApplicationAttemptId;Ljava/lang/String;Ljava/lang/String;Ljava/lang/String;Ljava/lang/String;ILorg/apache/hadoop/yarn/api/records/Token;Lorg/apache/hadoop/yarn/api/records/YarnApplicationState;Ljava/lang/String;Ljava/lang/String;JJLorg/apache/hadoop/yarn/api/records/FinalApplicationStatus;Lorg/apache/hadoop/yarn/api/records/ApplicationResourceUsageReport;Ljava/lang/String;FLjava/lang/String;Lorg/apache/hadoop/yarn/api/records/Token;Ljava/util/Set;Z)Lorg/apache/hadoop/yarn/api/records/ApplicationReport;

Stack Trace:
java.lang.NoSuchMethodError: org.apache.hadoop.yarn.server.utils.BuilderUtils.newApplicationReport(Lorg/apache/hadoop/yarn/api/records/ApplicationId;Lorg/apache/hadoop/yarn/api/records/ApplicationAttemptId;Ljava/lang/String;Ljava/lang/String;Ljava/lang/String;Ljava/lang/String;ILorg/apache/hadoop/yarn/api/records/Token;Lorg/apache/hadoop/yarn/api/records/YarnApplicationState;Ljava/lang/String;Ljava/lang/String;JJLorg/apache/hadoop/yarn/api/records/FinalApplicationStatus;Lorg/apache/hadoop/yarn/api/records/ApplicationResourceUsageReport;Ljava/lang/String;FLjava/lang/String;Lorg/apache/hadoop/yarn/api/records/Token;Ljava/util/Set;Z)Lorg/apache/hadoop/yarn/api/records/ApplicationReport;
	at org.apache.hadoop.yarn.server.resourcemanager.rmapp.RMAppImpl.createAndGetApplicationReport(RMAppImpl.java:660)
	at org.apache.hadoop.yarn.server.resourcemanager.ClientRMService.getApplications(ClientRMService.java:810)
	at org.apache.hadoop.yarn.server.resourcemanager.ClientRMService.getApplications(ClientRMService.java:677)
	at org.apache.hadoop.yarn.server.resourcemanager.TestClientRMService.testAppSubmit(TestClientRMService.java:899)


REGRESSION:  org.apache.hadoop.yarn.server.resourcemanager.TestClientRMService.testGetApplications

Error Message:
org.apache.hadoop.yarn.server.utils.BuilderUtils.newApplicationReport(Lorg/apache/hadoop/yarn/api/records/ApplicationId;Lorg/apache/hadoop/yarn/api/records/ApplicationAttemptId;Ljava/lang/String;Ljava/lang/String;Ljava/lang/String;Ljava/lang/String;ILorg/apache/hadoop/yarn/api/records/Token;Lorg/apache/hadoop/yarn/api/records/YarnApplicationState;Ljava/lang/String;Ljava/lang/String;JJLorg/apache/hadoop/yarn/api/records/FinalApplicationStatus;Lorg/apache/hadoop/yarn/api/records/ApplicationResourceUsageReport;Ljava/lang/String;FLjava/lang/String;Lorg/apache/hadoop/yarn/api/records/Token;Ljava/util/Set;Z)Lorg/apache/hadoop/yarn/api/records/ApplicationReport;

Stack Trace:
java.lang.NoSuchMethodError: org.apache.hadoop.yarn.server.utils.BuilderUtils.newApplicationReport(Lorg/apache/hadoop/yarn/api/records/ApplicationId;Lorg/apache/hadoop/yarn/api/records/ApplicationAttemptId;Ljava/lang/String;Ljava/lang/String;Ljava/lang/String;Ljava/lang/String;ILorg/apache/hadoop/yarn/api/records/Token;Lorg/apache/hadoop/yarn/api/records/YarnApplicationState;Ljava/lang/String;Ljava/lang/String;JJLorg/apache/hadoop/yarn/api/records/FinalApplicationStatus;Lorg/apache/hadoop/yarn/api/records/ApplicationResourceUsageReport;Ljava/lang/String;FLjava/lang/String;Lorg/apache/hadoop/yarn/api/records/Token;Ljava/util/Set;Z)Lorg/apache/hadoop/yarn/api/records/ApplicationReport;
	at org.apache.hadoop.yarn.server.resourcemanager.rmapp.RMAppImpl.createAndGetApplicationReport(RMAppImpl.java:660)
	at org.apache.hadoop.yarn.server.resourcemanager.ClientRMService.getApplications(ClientRMService.java:810)
	at org.apache.hadoop.yarn.server.resourcemanager.ClientRMService.getApplications(ClientRMService.java:677)
	at org.apache.hadoop.yarn.server.resourcemanager.TestClientRMService.testGetApplications(TestClientRMService.java:967)


REGRESSION:  org.apache.hadoop.yarn.server.resourcemanager.TestClientRMService.testGetQueueInfo

Error Message:
org.apache.hadoop.yarn.server.utils.BuilderUtils.newApplicationReport(Lorg/apache/hadoop/yarn/api/records/ApplicationId;Lorg/apache/hadoop/yarn/api/records/ApplicationAttemptId;Ljava/lang/String;Ljava/lang/String;Ljava/lang/String;Ljava/lang/String;ILorg/apache/hadoop/yarn/api/records/Token;Lorg/apache/hadoop/yarn/api/records/YarnApplicationState;Ljava/lang/String;Ljava/lang/String;JJLorg/apache/hadoop/yarn/api/records/FinalApplicationStatus;Lorg/apache/hadoop/yarn/api/records/ApplicationResourceUsageReport;Ljava/lang/String;FLjava/lang/String;Lorg/apache/hadoop/yarn/api/records/Token;Ljava/util/Set;Z)Lorg/apache/hadoop/yarn/api/records/ApplicationReport;

Stack Trace:
java.lang.NoSuchMethodError: org.apache.hadoop.yarn.server.utils.BuilderUtils.newApplicationReport(Lorg/apache/hadoop/yarn/api/records/ApplicationId;Lorg/apache/hadoop/yarn/api/records/ApplicationAttemptId;Ljava/lang/String;Ljava/lang/String;Ljava/lang/String;Ljava/lang/String;ILorg/apache/hadoop/yarn/api/records/Token;Lorg/apache/hadoop/yarn/api/records/YarnApplicationState;Ljava/lang/String;Ljava/lang/String;JJLorg/apache/hadoop/yarn/api/records/FinalApplicationStatus;Lorg/apache/hadoop/yarn/api/records/ApplicationResourceUsageReport;Ljava/lang/String;FLjava/lang/String;Lorg/apache/hadoop/yarn/api/records/Token;Ljava/util/Set;Z)Lorg/apache/hadoop/yarn/api/records/ApplicationReport;
	at org.apache.hadoop.yarn.server.resourcemanager.rmapp.RMAppImpl.createAndGetApplicationReport(RMAppImpl.java:660)
	at org.apache.hadoop.yarn.server.resourcemanager.TestClientRMService$17.createAndGetApplicationReport(TestClientRMService.java:1234)
	at org.apache.hadoop.yarn.server.resourcemanager.ClientRMService.getQueueInfo(ClientRMService.java:871)
	at org.apache.hadoop.yarn.server.resourcemanager.TestClientRMService.testGetQueueInfo(TestClientRMService.java:575)


REGRESSION:  org.apache.hadoop.yarn.server.resourcemanager.TestClientRMService.testGetApplicationReport

Error Message:
org.apache.hadoop.yarn.server.utils.BuilderUtils.newApplicationReport(Lorg/apache/hadoop/yarn/api/records/ApplicationId;Lorg/apache/hadoop/yarn/api/records/ApplicationAttemptId;Ljava/lang/String;Ljava/lang/String;Ljava/lang/String;Ljava/lang/String;ILorg/apache/hadoop/yarn/api/records/Token;Lorg/apache/hadoop/yarn/api/records/YarnApplicationState;Ljava/lang/String;Ljava/lang/String;JJLorg/apache/hadoop/yarn/api/records/FinalApplicationStatus;Lorg/apache/hadoop/yarn/api/records/ApplicationResourceUsageReport;Ljava/lang/String;FLjava/lang/String;Lorg/apache/hadoop/yarn/api/records/Token;Ljava/util/Set;Z)Lorg/apache/hadoop/yarn/api/records/ApplicationReport;

Stack Trace:
java.lang.NoSuchMethodError: org.apache.hadoop.yarn.server.utils.BuilderUtils.newApplicationReport(Lorg/apache/hadoop/yarn/api/records/ApplicationId;Lorg/apache/hadoop/yarn/api/records/ApplicationAttemptId;Ljava/lang/String;Ljava/lang/String;Ljava/lang/String;Ljava/lang/String;ILorg/apache/hadoop/yarn/api/records/Token;Lorg/apache/hadoop/yarn/api/records/YarnApplicationState;Ljava/lang/String;Ljava/lang/String;JJLorg/apache/hadoop/yarn/api/records/FinalApplicationStatus;Lorg/apache/hadoop/yarn/api/records/ApplicationResourceUsageReport;Ljava/lang/String;FLjava/lang/String;Lorg/apache/hadoop/yarn/api/records/Token;Ljava/util/Set;Z)Lorg/apache/hadoop/yarn/api/records/ApplicationReport;
	at org.apache.hadoop.yarn.server.resourcemanager.rmapp.RMAppImpl.createAndGetApplicationReport(RMAppImpl.java:660)
	at org.apache.hadoop.yarn.server.resourcemanager.TestClientRMService$17.createAndGetApplicationReport(TestClientRMService.java:1234)
	at org.apache.hadoop.yarn.server.resourcemanager.ClientRMService.getApplicationReport(ClientRMService.java:334)
	at org.apache.hadoop.yarn.server.resourcemanager.TestClientRMService.testGetApplicationReport(TestClientRMService.java:326)


REGRESSION:  org.apache.hadoop.yarn.server.resourcemanager.TestClientRMService.testForceKillApplication

Error Message:
org.apache.hadoop.yarn.server.utils.BuilderUtils.newApplicationReport(Lorg/apache/hadoop/yarn/api/records/ApplicationId;Lorg/apache/hadoop/yarn/api/records/ApplicationAttemptId;Ljava/lang/String;Ljava/lang/String;Ljava/lang/String;Ljava/lang/String;ILorg/apache/hadoop/yarn/api/records/Token;Lorg/apache/hadoop/yarn/api/records/YarnApplicationState;Ljava/lang/String;Ljava/lang/String;JJLorg/apache/hadoop/yarn/api/records/FinalApplicationStatus;Lorg/apache/hadoop/yarn/api/records/ApplicationResourceUsageReport;Ljava/lang/String;FLjava/lang/String;Lorg/apache/hadoop/yarn/api/records/Token;Ljava/util/Set;Z)Lorg/apache/hadoop/yarn/api/records/ApplicationReport;

Stack Trace:
java.lang.NoSuchMethodError: org.apache.hadoop.yarn.server.utils.BuilderUtils.newApplicationReport(Lorg/apache/hadoop/yarn/api/records/ApplicationId;Lorg/apache/hadoop/yarn/api/records/ApplicationAttemptId;Ljava/lang/String;Ljava/lang/String;Ljava/lang/String;Ljava/lang/String;ILorg/apache/hadoop/yarn/api/records/Token;Lorg/apache/hadoop/yarn/api/records/YarnApplicationState;Ljava/lang/String;Ljava/lang/String;JJLorg/apache/hadoop/yarn/api/records/FinalApplicationStatus;Lorg/apache/hadoop/yarn/api/records/ApplicationResourceUsageReport;Ljava/lang/String;FLjava/lang/String;Lorg/apache/hadoop/yarn/api/records/Token;Ljava/util/Set;Z)Lorg/apache/hadoop/yarn/api/records/ApplicationReport;
	at org.apache.hadoop.yarn.server.resourcemanager.rmapp.RMAppImpl.createAndGetApplicationReport(RMAppImpl.java:660)
	at org.apache.hadoop.yarn.server.resourcemanager.ClientRMService.getApplications(ClientRMService.java:810)
	at org.apache.hadoop.yarn.server.resourcemanager.ClientRMService.getApplications(ClientRMService.java:677)
	at org.apache.hadoop.yarn.server.resourcemanager.TestClientRMService.testForceKillApplication(TestClientRMService.java:523)


REGRESSION:  org.apache.hadoop.yarn.server.resourcemanager.TestRM.testInvalidateAMHostPortWhenAMFailedOrKilled[0]

Error Message:
org.apache.hadoop.yarn.server.utils.BuilderUtils.newApplicationReport(Lorg/apache/hadoop/yarn/api/records/ApplicationId;Lorg/apache/hadoop/yarn/api/records/ApplicationAttemptId;Ljava/lang/String;Ljava/lang/String;Ljava/lang/String;Ljava/lang/String;ILorg/apache/hadoop/yarn/api/records/Token;Lorg/apache/hadoop/yarn/api/records/YarnApplicationState;Ljava/lang/String;Ljava/lang/String;JJLorg/apache/hadoop/yarn/api/records/FinalApplicationStatus;Lorg/apache/hadoop/yarn/api/records/ApplicationResourceUsageReport;Ljava/lang/String;FLjava/lang/String;Lorg/apache/hadoop/yarn/api/records/Token;Ljava/util/Set;Z)Lorg/apache/hadoop/yarn/api/records/ApplicationReport;

Stack Trace:
java.lang.NoSuchMethodError: org.apache.hadoop.yarn.server.utils.BuilderUtils.newApplicationReport(Lorg/apache/hadoop/yarn/api/records/ApplicationId;Lorg/apache/hadoop/yarn/api/records/ApplicationAttemptId;Ljava/lang/String;Ljava/lang/String;Ljava/lang/String;Ljava/lang/String;ILorg/apache/hadoop/yarn/api/records/Token;Lorg/apache/hadoop/yarn/api/records/YarnApplicationState;Ljava/lang/String;Ljava/lang/String;JJLorg/apache/hadoop/yarn/api/records/FinalApplicationStatus;Lorg/apache/hadoop/yarn/api/records/ApplicationResourceUsageReport;Ljava/lang/String;FLjava/lang/String;Lorg/apache/hadoop/yarn/api/records/Token;Ljava/util/Set;Z)Lorg/apache/hadoop/yarn/api/records/ApplicationReport;
	at org.apache.hadoop.yarn.server.resourcemanager.rmapp.RMAppImpl.createAndGetApplicationReport(RMAppImpl.java:660)
	at org.apache.hadoop.yarn.server.resourcemanager.ClientRMService.getApplications(ClientRMService.java:810)
	at org.apache.hadoop.yarn.server.resourcemanager.ClientRMService.getApplications(ClientRMService.java:677)
	at org.apache.hadoop.yarn.server.resourcemanager.TestRM.testInvalidateAMHostPortWhenAMFailedOrKilled(TestRM.java:519)


REGRESSION:  org.apache.hadoop.yarn.server.resourcemanager.TestRM.testInvalidatedAMHostPortOnAMRestart[0]

Error Message:
org.apache.hadoop.yarn.server.utils.BuilderUtils.newApplicationReport(Lorg/apache/hadoop/yarn/api/records/ApplicationId;Lorg/apache/hadoop/yarn/api/records/ApplicationAttemptId;Ljava/lang/String;Ljava/lang/String;Ljava/lang/String;Ljava/lang/String;ILorg/apache/hadoop/yarn/api/records/Token;Lorg/apache/hadoop/yarn/api/records/YarnApplicationState;Ljava/lang/String;Ljava/lang/String;JJLorg/apache/hadoop/yarn/api/records/FinalApplicationStatus;Lorg/apache/hadoop/yarn/api/records/ApplicationResourceUsageReport;Ljava/lang/String;FLjava/lang/String;Lorg/apache/hadoop/yarn/api/records/Token;Ljava/util/Set;Z)Lorg/apache/hadoop/yarn/api/records/ApplicationReport;

Stack Trace:
java.lang.NoSuchMethodError: org.apache.hadoop.yarn.server.utils.BuilderUtils.newApplicationReport(Lorg/apache/hadoop/yarn/api/records/ApplicationId;Lorg/apache/hadoop/yarn/api/records/ApplicationAttemptId;Ljava/lang/String;Ljava/lang/String;Ljava/lang/String;Ljava/lang/String;ILorg/apache/hadoop/yarn/api/records/Token;Lorg/apache/hadoop/yarn/api/records/YarnApplicationState;Ljava/lang/String;Ljava/lang/String;JJLorg/apache/hadoop/yarn/api/records/FinalApplicationStatus;Lorg/apache/hadoop/yarn/api/records/ApplicationResourceUsageReport;Ljava/lang/String;FLjava/lang/String;Lorg/apache/hadoop/yarn/api/records/Token;Ljava/util/Set;Z)Lorg/apache/hadoop/yarn/api/records/ApplicationReport;
	at org.apache.hadoop.yarn.server.resourcemanager.rmapp.RMAppImpl.createAndGetApplicationReport(RMAppImpl.java:660)
	at org.apache.hadoop.yarn.server.resourcemanager.ClientRMService.getApplicationReport(ClientRMService.java:334)
	at org.apache.hadoop.yarn.server.resourcemanager.TestRM.testInvalidatedAMHostPortOnAMRestart(TestRM.java:559)


REGRESSION:  org.apache.hadoop.yarn.server.resourcemanager.TestRM.testInvalidateAMHostPortWhenAMFailedOrKilled[1]

Error Message:
org.apache.hadoop.yarn.server.utils.BuilderUtils.newApplicationReport(Lorg/apache/hadoop/yarn/api/records/ApplicationId;Lorg/apache/hadoop/yarn/api/records/ApplicationAttemptId;Ljava/lang/String;Ljava/lang/String;Ljava/lang/String;Ljava/lang/String;ILorg/apache/hadoop/yarn/api/records/Token;Lorg/apache/hadoop/yarn/api/records/YarnApplicationState;Ljava/lang/String;Ljava/lang/String;JJLorg/apache/hadoop/yarn/api/records/FinalApplicationStatus;Lorg/apache/hadoop/yarn/api/records/ApplicationResourceUsageReport;Ljava/lang/String;FLjava/lang/String;Lorg/apache/hadoop/yarn/api/records/Token;Ljava/util/Set;Z)Lorg/apache/hadoop/yarn/api/records/ApplicationReport;

Stack Trace:
java.lang.NoSuchMethodError: org.apache.hadoop.yarn.server.utils.BuilderUtils.newApplicationReport(Lorg/apache/hadoop/yarn/api/records/ApplicationId;Lorg/apache/hadoop/yarn/api/records/ApplicationAttemptId;Ljava/lang/String;Ljava/lang/String;Ljava/lang/String;Ljava/lang/String;ILorg/apache/hadoop/yarn/api/records/Token;Lorg/apache/hadoop/yarn/api/records/YarnApplicationState;Ljava/lang/String;Ljava/lang/String;JJLorg/apache/hadoop/yarn/api/records/FinalApplicationStatus;Lorg/apache/hadoop/yarn/api/records/ApplicationResourceUsageReport;Ljava/lang/String;FLjava/lang/String;Lorg/apache/hadoop/yarn/api/records/Token;Ljava/util/Set;Z)Lorg/apache/hadoop/yarn/api/records/ApplicationReport;
	at org.apache.hadoop.yarn.server.resourcemanager.rmapp.RMAppImpl.createAndGetApplicationReport(RMAppImpl.java:660)
	at org.apache.hadoop.yarn.server.resourcemanager.ClientRMService.getApplications(ClientRMService.java:810)
	at org.apache.hadoop.yarn.server.resourcemanager.ClientRMService.getApplications(ClientRMService.java:677)
	at org.apache.hadoop.yarn.server.resourcemanager.TestRM.testInvalidateAMHostPortWhenAMFailedOrKilled(TestRM.java:519)


REGRESSION:  org.apache.hadoop.yarn.server.resourcemanager.TestRM.testInvalidatedAMHostPortOnAMRestart[1]

Error Message:
org.apache.hadoop.yarn.server.utils.BuilderUtils.newApplicationReport(Lorg/apache/hadoop/yarn/api/records/ApplicationId;Lorg/apache/hadoop/yarn/api/records/ApplicationAttemptId;Ljava/lang/String;Ljava/lang/String;Ljava/lang/String;Ljava/lang/String;ILorg/apache/hadoop/yarn/api/records/Token;Lorg/apache/hadoop/yarn/api/records/YarnApplicationState;Ljava/lang/String;Ljava/lang/String;JJLorg/apache/hadoop/yarn/api/records/FinalApplicationStatus;Lorg/apache/hadoop/yarn/api/records/ApplicationResourceUsageReport;Ljava/lang/String;FLjava/lang/String;Lorg/apache/hadoop/yarn/api/records/Token;Ljava/util/Set;Z)Lorg/apache/hadoop/yarn/api/records/ApplicationReport;

Stack Trace:
java.lang.NoSuchMethodError: org.apache.hadoop.yarn.server.utils.BuilderUtils.newApplicationReport(Lorg/apache/hadoop/yarn/api/records/ApplicationId;Lorg/apache/hadoop/yarn/api/records/ApplicationAttemptId;Ljava/lang/String;Ljava/lang/String;Ljava/lang/String;Ljava/lang/String;ILorg/apache/hadoop/yarn/api/records/Token;Lorg/apache/hadoop/yarn/api/records/YarnApplicationState;Ljava/lang/String;Ljava/lang/String;JJLorg/apache/hadoop/yarn/api/records/FinalApplicationStatus;Lorg/apache/hadoop/yarn/api/records/ApplicationResourceUsageReport;Ljava/lang/String;FLjava/lang/String;Lorg/apache/hadoop/yarn/api/records/Token;Ljava/util/Set;Z)Lorg/apache/hadoop/yarn/api/records/ApplicationReport;
	at org.apache.hadoop.yarn.server.resourcemanager.rmapp.RMAppImpl.createAndGetApplicationReport(RMAppImpl.java:660)
	at org.apache.hadoop.yarn.server.resourcemanager.ClientRMService.getApplicationReport(ClientRMService.java:334)
	at org.apache.hadoop.yarn.server.resourcemanager.TestRM.testInvalidatedAMHostPortOnAMRestart(TestRM.java:559)


REGRESSION:  org.apache.hadoop.yarn.server.resourcemanager.TestRMRestart.testRMRestartGetApplicationList[0]

Error Message:
org.apache.hadoop.yarn.server.utils.BuilderUtils.newApplicationReport(Lorg/apache/hadoop/yarn/api/records/ApplicationId;Lorg/apache/hadoop/yarn/api/records/ApplicationAttemptId;Ljava/lang/String;Ljava/lang/String;Ljava/lang/String;Ljava/lang/String;ILorg/apache/hadoop/yarn/api/records/Token;Lorg/apache/hadoop/yarn/api/records/YarnApplicationState;Ljava/lang/String;Ljava/lang/String;JJLorg/apache/hadoop/yarn/api/records/FinalApplicationStatus;Lorg/apache/hadoop/yarn/api/records/ApplicationResourceUsageReport;Ljava/lang/String;FLjava/lang/String;Lorg/apache/hadoop/yarn/api/records/Token;Ljava/util/Set;Z)Lorg/apache/hadoop/yarn/api/records/ApplicationReport;

Stack Trace:
java.lang.NoSuchMethodError: org.apache.hadoop.yarn.server.utils.BuilderUtils.newApplicationReport(Lorg/apache/hadoop/yarn/api/records/ApplicationId;Lorg/apache/hadoop/yarn/api/records/ApplicationAttemptId;Ljava/lang/String;Ljava/lang/String;Ljava/lang/String;Ljava/lang/String;ILorg/apache/hadoop/yarn/api/records/Token;Lorg/apache/hadoop/yarn/api/records/YarnApplicationState;Ljava/lang/String;Ljava/lang/String;JJLorg/apache/hadoop/yarn/api/records/FinalApplicationStatus;Lorg/apache/hadoop/yarn/api/records/ApplicationResourceUsageReport;Ljava/lang/String;FLjava/lang/String;Lorg/apache/hadoop/yarn/api/records/Token;Ljava/util/Set;Z)Lorg/apache/hadoop/yarn/api/records/ApplicationReport;
	at org.apache.hadoop.yarn.server.resourcemanager.rmapp.RMAppImpl.createAndGetApplicationReport(RMAppImpl.java:660)
	at org.apache.hadoop.yarn.server.resourcemanager.ClientRMService.getApplications(ClientRMService.java:810)
	at org.apache.hadoop.yarn.server.resourcemanager.ClientRMService.getApplications(ClientRMService.java:677)
	at org.apache.hadoop.yarn.server.resourcemanager.TestRMRestart.testRMRestartGetApplicationList(TestRMRestart.java:942)


REGRESSION:  org.apache.hadoop.yarn.server.resourcemanager.TestRMRestart.testRMRestartKilledApp[0]

Error Message:
org.apache.hadoop.yarn.server.utils.BuilderUtils.newApplicationReport(Lorg/apache/hadoop/yarn/api/records/ApplicationId;Lorg/apache/hadoop/yarn/api/records/ApplicationAttemptId;Ljava/lang/String;Ljava/lang/String;Ljava/lang/String;Ljava/lang/String;ILorg/apache/hadoop/yarn/api/records/Token;Lorg/apache/hadoop/yarn/api/records/YarnApplicationState;Ljava/lang/String;Ljava/lang/String;JJLorg/apache/hadoop/yarn/api/records/FinalApplicationStatus;Lorg/apache/hadoop/yarn/api/records/ApplicationResourceUsageReport;Ljava/lang/String;FLjava/lang/String;Lorg/apache/hadoop/yarn/api/records/Token;Ljava/util/Set;Z)Lorg/apache/hadoop/yarn/api/records/ApplicationReport;

Stack Trace:
java.lang.NoSuchMethodError: org.apache.hadoop.yarn.server.utils.BuilderUtils.newApplicationReport(Lorg/apache/hadoop/yarn/api/records/ApplicationId;Lorg/apache/hadoop/yarn/api/records/ApplicationAttemptId;Ljava/lang/String;Ljava/lang/String;Ljava/lang/String;Ljava/lang/String;ILorg/apache/hadoop/yarn/api/records/Token;Lorg/apache/hadoop/yarn/api/records/YarnApplicationState;Ljava/lang/String;Ljava/lang/String;JJLorg/apache/hadoop/yarn/api/records/FinalApplicationStatus;Lorg/apache/hadoop/yarn/api/records/ApplicationResourceUsageReport;Ljava/lang/String;FLjava/lang/String;Lorg/apache/hadoop/yarn/api/records/Token;Ljava/util/Set;Z)Lorg/apache/hadoop/yarn/api/records/ApplicationReport;
	at org.apache.hadoop.yarn.server.resourcemanager.rmapp.RMAppImpl.createAndGetApplicationReport(RMAppImpl.java:660)
	at org.apache.hadoop.yarn.server.resourcemanager.ClientRMService.getApplicationReport(ClientRMService.java:334)
	at org.apache.hadoop.yarn.server.resourcemanager.TestRMRestart.verifyAppReportAfterRMRestart(TestRMRestart.java:998)
	at org.apache.hadoop.yarn.server.resourcemanager.TestRMRestart.testRMRestartKilledApp(TestRMRestart.java:795)


REGRESSION:  org.apache.hadoop.yarn.server.resourcemanager.TestRMRestart.testRMRestartSucceededApp[0]

Error Message:
org.apache.hadoop.yarn.server.utils.BuilderUtils.newApplicationReport(Lorg/apache/hadoop/yarn/api/records/ApplicationId;Lorg/apache/hadoop/yarn/api/records/ApplicationAttemptId;Ljava/lang/String;Ljava/lang/String;Ljava/lang/String;Ljava/lang/String;ILorg/apache/hadoop/yarn/api/records/Token;Lorg/apache/hadoop/yarn/api/records/YarnApplicationState;Ljava/lang/String;Ljava/lang/String;JJLorg/apache/hadoop/yarn/api/records/FinalApplicationStatus;Lorg/apache/hadoop/yarn/api/records/ApplicationResourceUsageReport;Ljava/lang/String;FLjava/lang/String;Lorg/apache/hadoop/yarn/api/records/Token;Ljava/util/Set;Z)Lorg/apache/hadoop/yarn/api/records/ApplicationReport;

Stack Trace:
java.lang.NoSuchMethodError: org.apache.hadoop.yarn.server.utils.BuilderUtils.newApplicationReport(Lorg/apache/hadoop/yarn/api/records/ApplicationId;Lorg/apache/hadoop/yarn/api/records/ApplicationAttemptId;Ljava/lang/String;Ljava/lang/String;Ljava/lang/String;Ljava/lang/String;ILorg/apache/hadoop/yarn/api/records/Token;Lorg/apache/hadoop/yarn/api/records/YarnApplicationState;Ljava/lang/String;Ljava/lang/String;JJLorg/apache/hadoop/yarn/api/records/FinalApplicationStatus;Lorg/apache/hadoop/yarn/api/records/ApplicationResourceUsageReport;Ljava/lang/String;FLjava/lang/String;Lorg/apache/hadoop/yarn/api/records/Token;Ljava/util/Set;Z)Lorg/apache/hadoop/yarn/api/records/ApplicationReport;
	at org.apache.hadoop.yarn.server.resourcemanager.rmapp.RMAppImpl.createAndGetApplicationReport(RMAppImpl.java:660)
	at org.apache.hadoop.yarn.server.resourcemanager.ClientRMService.getApplicationReport(ClientRMService.java:334)
	at org.apache.hadoop.yarn.server.resourcemanager.TestRMRestart.verifyAppReportAfterRMRestart(TestRMRestart.java:998)
	at org.apache.hadoop.yarn.server.resourcemanager.TestRMRestart.testRMRestartSucceededApp(TestRMRestart.java:885)


REGRESSION:  org.apache.hadoop.yarn.server.resourcemanager.TestRMRestart.testRMRestartFailedApp[0]

Error Message:
org.apache.hadoop.yarn.server.utils.BuilderUtils.newApplicationReport(Lorg/apache/hadoop/yarn/api/records/ApplicationId;Lorg/apache/hadoop/yarn/api/records/ApplicationAttemptId;Ljava/lang/String;Ljava/lang/String;Ljava/lang/String;Ljava/lang/String;ILorg/apache/hadoop/yarn/api/records/Token;Lorg/apache/hadoop/yarn/api/records/YarnApplicationState;Ljava/lang/String;Ljava/lang/String;JJLorg/apache/hadoop/yarn/api/records/FinalApplicationStatus;Lorg/apache/hadoop/yarn/api/records/ApplicationResourceUsageReport;Ljava/lang/String;FLjava/lang/String;Lorg/apache/hadoop/yarn/api/records/Token;Ljava/util/Set;Z)Lorg/apache/hadoop/yarn/api/records/ApplicationReport;

Stack Trace:
java.lang.NoSuchMethodError: org.apache.hadoop.yarn.server.utils.BuilderUtils.newApplicationReport(Lorg/apache/hadoop/yarn/api/records/ApplicationId;Lorg/apache/hadoop/yarn/api/records/ApplicationAttemptId;Ljava/lang/String;Ljava/lang/String;Ljava/lang/String;Ljava/lang/String;ILorg/apache/hadoop/yarn/api/records/Token;Lorg/apache/hadoop/yarn/api/records/YarnApplicationState;Ljava/lang/String;Ljava/lang/String;JJLorg/apache/hadoop/yarn/api/records/FinalApplicationStatus;Lorg/apache/hadoop/yarn/api/records/ApplicationResourceUsageReport;Ljava/lang/String;FLjava/lang/String;Lorg/apache/hadoop/yarn/api/records/Token;Ljava/util/Set;Z)Lorg/apache/hadoop/yarn/api/records/ApplicationReport;
	at org.apache.hadoop.yarn.server.resourcemanager.rmapp.RMAppImpl.createAndGetApplicationReport(RMAppImpl.java:660)
	at org.apache.hadoop.yarn.server.resourcemanager.ClientRMService.getApplicationReport(ClientRMService.java:334)
	at org.apache.hadoop.yarn.server.resourcemanager.TestRMRestart.verifyAppReportAfterRMRestart(TestRMRestart.java:998)
	at org.apache.hadoop.yarn.server.resourcemanager.TestRMRestart.testRMRestartFailedApp(TestRMRestart.java:745)


REGRESSION:  org.apache.hadoop.yarn.server.resourcemanager.TestRMRestart.testRMRestartGetApplicationList[1]

Error Message:
org.apache.hadoop.yarn.server.utils.BuilderUtils.newApplicationReport(Lorg/apache/hadoop/yarn/api/records/ApplicationId;Lorg/apache/hadoop/yarn/api/records/ApplicationAttemptId;Ljava/lang/String;Ljava/lang/String;Ljava/lang/String;Ljava/lang/String;ILorg/apache/hadoop/yarn/api/records/Token;Lorg/apache/hadoop/yarn/api/records/YarnApplicationState;Ljava/lang/String;Ljava/lang/String;JJLorg/apache/hadoop/yarn/api/records/FinalApplicationStatus;Lorg/apache/hadoop/yarn/api/records/ApplicationResourceUsageReport;Ljava/lang/String;FLjava/lang/String;Lorg/apache/hadoop/yarn/api/records/Token;Ljava/util/Set;Z)Lorg/apache/hadoop/yarn/api/records/ApplicationReport;

Stack Trace:
java.lang.NoSuchMethodError: org.apache.hadoop.yarn.server.utils.BuilderUtils.newApplicationReport(Lorg/apache/hadoop/yarn/api/records/ApplicationId;Lorg/apache/hadoop/yarn/api/records/ApplicationAttemptId;Ljava/lang/String;Ljava/lang/String;Ljava/lang/String;Ljava/lang/String;ILorg/apache/hadoop/yarn/api/records/Token;Lorg/apache/hadoop/yarn/api/records/YarnApplicationState;Ljava/lang/String;Ljava/lang/String;JJLorg/apache/hadoop/yarn/api/records/FinalApplicationStatus;Lorg/apache/hadoop/yarn/api/records/ApplicationResourceUsageReport;Ljava/lang/String;FLjava/lang/String;Lorg/apache/hadoop/yarn/api/records/Token;Ljava/util/Set;Z)Lorg/apache/hadoop/yarn/api/records/ApplicationReport;
	at org.apache.hadoop.yarn.server.resourcemanager.rmapp.RMAppImpl.createAndGetApplicationReport(RMAppImpl.java:660)
	at org.apache.hadoop.yarn.server.resourcemanager.ClientRMService.getApplications(ClientRMService.java:810)
	at org.apache.hadoop.yarn.server.resourcemanager.ClientRMService.getApplications(ClientRMService.java:677)
	at org.apache.hadoop.yarn.server.resourcemanager.TestRMRestart.testRMRestartGetApplicationList(TestRMRestart.java:942)


REGRESSION:  org.apache.hadoop.yarn.server.resourcemanager.TestRMRestart.testRMRestartKilledApp[1]

Error Message:
org.apache.hadoop.yarn.server.utils.BuilderUtils.newApplicationReport(Lorg/apache/hadoop/yarn/api/records/ApplicationId;Lorg/apache/hadoop/yarn/api/records/ApplicationAttemptId;Ljava/lang/String;Ljava/lang/String;Ljava/lang/String;Ljava/lang/String;ILorg/apache/hadoop/yarn/api/records/Token;Lorg/apache/hadoop/yarn/api/records/YarnApplicationState;Ljava/lang/String;Ljava/lang/String;JJLorg/apache/hadoop/yarn/api/records/FinalApplicationStatus;Lorg/apache/hadoop/yarn/api/records/ApplicationResourceUsageReport;Ljava/lang/String;FLjava/lang/String;Lorg/apache/hadoop/yarn/api/records/Token;Ljava/util/Set;Z)Lorg/apache/hadoop/yarn/api/records/ApplicationReport;

Stack Trace:
java.lang.NoSuchMethodError: org.apache.hadoop.yarn.server.utils.BuilderUtils.newApplicationReport(Lorg/apache/hadoop/yarn/api/records/ApplicationId;Lorg/apache/hadoop/yarn/api/records/ApplicationAttemptId;Ljava/lang/String;Ljava/lang/String;Ljava/lang/String;Ljava/lang/String;ILorg/apache/hadoop/yarn/api/records/Token;Lorg/apache/hadoop/yarn/api/records/YarnApplicationState;Ljava/lang/String;Ljava/lang/String;JJLorg/apache/hadoop/yarn/api/records/FinalApplicationStatus;Lorg/apache/hadoop/yarn/api/records/ApplicationResourceUsageReport;Ljava/lang/String;FLjava/lang/String;Lorg/apache/hadoop/yarn/api/records/Token;Ljava/util/Set;Z)Lorg/apache/hadoop/yarn/api/records/ApplicationReport;
	at org.apache.hadoop.yarn.server.resourcemanager.rmapp.RMAppImpl.createAndGetApplicationReport(RMAppImpl.java:660)
	at org.apache.hadoop.yarn.server.resourcemanager.ClientRMService.getApplicationReport(ClientRMService.java:334)
	at org.apache.hadoop.yarn.server.resourcemanager.TestRMRestart.verifyAppReportAfterRMRestart(TestRMRestart.java:998)
	at org.apache.hadoop.yarn.server.resourcemanager.TestRMRestart.testRMRestartKilledApp(TestRMRestart.java:795)


REGRESSION:  org.apache.hadoop.yarn.server.resourcemanager.TestRMRestart.testRMRestartSucceededApp[1]

Error Message:
org.apache.hadoop.yarn.server.utils.BuilderUtils.newApplicationReport(Lorg/apache/hadoop/yarn/api/records/ApplicationId;Lorg/apache/hadoop/yarn/api/records/ApplicationAttemptId;Ljava/lang/String;Ljava/lang/String;Ljava/lang/String;Ljava/lang/String;ILorg/apache/hadoop/yarn/api/records/Token;Lorg/apache/hadoop/yarn/api/records/YarnApplicationState;Ljava/lang/String;Ljava/lang/String;JJLorg/apache/hadoop/yarn/api/records/FinalApplicationStatus;Lorg/apache/hadoop/yarn/api/records/ApplicationResourceUsageReport;Ljava/lang/String;FLjava/lang/String;Lorg/apache/hadoop/yarn/api/records/Token;Ljava/util/Set;Z)Lorg/apache/hadoop/yarn/api/records/ApplicationReport;

Stack Trace:
java.lang.NoSuchMethodError: org.apache.hadoop.yarn.server.utils.BuilderUtils.newApplicationReport(Lorg/apache/hadoop/yarn/api/records/ApplicationId;Lorg/apache/hadoop/yarn/api/records/ApplicationAttemptId;Ljava/lang/String;Ljava/lang/String;Ljava/lang/String;Ljava/lang/String;ILorg/apache/hadoop/yarn/api/records/Token;Lorg/apache/hadoop/yarn/api/records/YarnApplicationState;Ljava/lang/String;Ljava/lang/String;JJLorg/apache/hadoop/yarn/api/records/FinalApplicationStatus;Lorg/apache/hadoop/yarn/api/records/ApplicationResourceUsageReport;Ljava/lang/String;FLjava/lang/String;Lorg/apache/hadoop/yarn/api/records/Token;Ljava/util/Set;Z)Lorg/apache/hadoop/yarn/api/records/ApplicationReport;
	at org.apache.hadoop.yarn.server.resourcemanager.rmapp.RMAppImpl.createAndGetApplicationReport(RMAppImpl.java:660)
	at org.apache.hadoop.yarn.server.resourcemanager.ClientRMService.getApplicationReport(ClientRMService.java:334)
	at org.apache.hadoop.yarn.server.resourcemanager.TestRMRestart.verifyAppReportAfterRMRestart(TestRMRestart.java:998)
	at org.apache.hadoop.yarn.server.resourcemanager.TestRMRestart.testRMRestartSucceededApp(TestRMRestart.java:885)


REGRESSION:  org.apache.hadoop.yarn.server.resourcemanager.TestRMRestart.testRMRestartFailedApp[1]

Error Message:
org.apache.hadoop.yarn.server.utils.BuilderUtils.newApplicationReport(Lorg/apache/hadoop/yarn/api/records/ApplicationId;Lorg/apache/hadoop/yarn/api/records/ApplicationAttemptId;Ljava/lang/String;Ljava/lang/String;Ljava/lang/String;Ljava/lang/String;ILorg/apache/hadoop/yarn/api/records/Token;Lorg/apache/hadoop/yarn/api/records/YarnApplicationState;Ljava/lang/String;Ljava/lang/String;JJLorg/apache/hadoop/yarn/api/records/FinalApplicationStatus;Lorg/apache/hadoop/yarn/api/records/ApplicationResourceUsageReport;Ljava/lang/String;FLjava/lang/String;Lorg/apache/hadoop/yarn/api/records/Token;Ljava/util/Set;Z)Lorg/apache/hadoop/yarn/api/records/ApplicationReport;

Stack Trace:
java.lang.NoSuchMethodError: org.apache.hadoop.yarn.server.utils.BuilderUtils.newApplicationReport(Lorg/apache/hadoop/yarn/api/records/ApplicationId;Lorg/apache/hadoop/yarn/api/records/ApplicationAttemptId;Ljava/lang/String;Ljava/lang/String;Ljava/lang/String;Ljava/lang/String;ILorg/apache/hadoop/yarn/api/records/Token;Lorg/apache/hadoop/yarn/api/records/YarnApplicationState;Ljava/lang/String;Ljava/lang/String;JJLorg/apache/hadoop/yarn/api/records/FinalApplicationStatus;Lorg/apache/hadoop/yarn/api/records/ApplicationResourceUsageReport;Ljava/lang/String;FLjava/lang/String;Lorg/apache/hadoop/yarn/api/records/Token;Ljava/util/Set;Z)Lorg/apache/hadoop/yarn/api/records/ApplicationReport;
	at org.apache.hadoop.yarn.server.resourcemanager.rmapp.RMAppImpl.createAndGetApplicationReport(RMAppImpl.java:660)
	at org.apache.hadoop.yarn.server.resourcemanager.ClientRMService.getApplicationReport(ClientRMService.java:334)
	at org.apache.hadoop.yarn.server.resourcemanager.TestRMRestart.verifyAppReportAfterRMRestart(TestRMRestart.java:998)
	at org.apache.hadoop.yarn.server.resourcemanager.TestRMRestart.testRMRestartFailedApp(TestRMRestart.java:745)


REGRESSION:  org.apache.hadoop.yarn.server.resourcemanager.TestSubmitApplicationWithRMHA.testHandleRMHAafterSubmitApplicationCallWithSavedApplicationState

Error Message:
org.apache.hadoop.yarn.server.utils.BuilderUtils.newApplicationReport(Lorg/apache/hadoop/yarn/api/records/ApplicationId;Lorg/apache/hadoop/yarn/api/records/ApplicationAttemptId;Ljava/lang/String;Ljava/lang/String;Ljava/lang/String;Ljava/lang/String;ILorg/apache/hadoop/yarn/api/records/Token;Lorg/apache/hadoop/yarn/api/records/YarnApplicationState;Ljava/lang/String;Ljava/lang/String;JJLorg/apache/hadoop/yarn/api/records/FinalApplicationStatus;Lorg/apache/hadoop/yarn/api/records/ApplicationResourceUsageReport;Ljava/lang/String;FLjava/lang/String;Lorg/apache/hadoop/yarn/api/records/Token;Ljava/util/Set;Z)Lorg/apache/hadoop/yarn/api/records/ApplicationReport;

Stack Trace:
java.lang.NoSuchMethodError: org.apache.hadoop.yarn.server.utils.BuilderUtils.newApplicationReport(Lorg/apache/hadoop/yarn/api/records/ApplicationId;Lorg/apache/hadoop/yarn/api/records/ApplicationAttemptId;Ljava/lang/String;Ljava/lang/String;Ljava/lang/String;Ljava/lang/String;ILorg/apache/hadoop/yarn/api/records/Token;Lorg/apache/hadoop/yarn/api/records/YarnApplicationState;Ljava/lang/String;Ljava/lang/String;JJLorg/apache/hadoop/yarn/api/records/FinalApplicationStatus;Lorg/apache/hadoop/yarn/api/records/ApplicationResourceUsageReport;Ljava/lang/String;FLjava/lang/String;Lorg/apache/hadoop/yarn/api/records/Token;Ljava/util/Set;Z)Lorg/apache/hadoop/yarn/api/records/ApplicationReport;
	at org.apache.hadoop.yarn.server.resourcemanager.rmapp.RMAppImpl.createAndGetApplicationReport(RMAppImpl.java:660)
	at org.apache.hadoop.yarn.server.resourcemanager.ClientRMService.getApplicationReport(ClientRMService.java:334)
	at org.apache.hadoop.yarn.server.resourcemanager.MockRM.getApplicationReport(MockRM.java:732)
	at org.apache.hadoop.yarn.server.resourcemanager.TestSubmitApplicationWithRMHA.testHandleRMHAafterSubmitApplicationCallWithSavedApplicationState(TestSubmitApplicationWithRMHA.java:117)


REGRESSION:  org.apache.hadoop.yarn.server.resourcemanager.TestSubmitApplicationWithRMHA.testHandleRMHAafterSubmitApplicationCallWithoutSavedApplicationState

Error Message:
org.apache.hadoop.yarn.server.utils.BuilderUtils.newApplicationReport(Lorg/apache/hadoop/yarn/api/records/ApplicationId;Lorg/apache/hadoop/yarn/api/records/ApplicationAttemptId;Ljava/lang/String;Ljava/lang/String;Ljava/lang/String;Ljava/lang/String;ILorg/apache/hadoop/yarn/api/records/Token;Lorg/apache/hadoop/yarn/api/records/YarnApplicationState;Ljava/lang/String;Ljava/lang/String;JJLorg/apache/hadoop/yarn/api/records/FinalApplicationStatus;Lorg/apache/hadoop/yarn/api/records/ApplicationResourceUsageReport;Ljava/lang/String;FLjava/lang/String;Lorg/apache/hadoop/yarn/api/records/Token;Ljava/util/Set;Z)Lorg/apache/hadoop/yarn/api/records/ApplicationReport;

Stack Trace:
java.lang.NoSuchMethodError: org.apache.hadoop.yarn.server.utils.BuilderUtils.newApplicationReport(Lorg/apache/hadoop/yarn/api/records/ApplicationId;Lorg/apache/hadoop/yarn/api/records/ApplicationAttemptId;Ljava/lang/String;Ljava/lang/String;Ljava/lang/String;Ljava/lang/String;ILorg/apache/hadoop/yarn/api/records/Token;Lorg/apache/hadoop/yarn/api/records/YarnApplicationState;Ljava/lang/String;Ljava/lang/String;JJLorg/apache/hadoop/yarn/api/records/FinalApplicationStatus;Lorg/apache/hadoop/yarn/api/records/ApplicationResourceUsageReport;Ljava/lang/String;FLjava/lang/String;Lorg/apache/hadoop/yarn/api/records/Token;Ljava/util/Set;Z)Lorg/apache/hadoop/yarn/api/records/ApplicationReport;
	at org.apache.hadoop.yarn.server.resourcemanager.rmapp.RMAppImpl.createAndGetApplicationReport(RMAppImpl.java:660)
	at org.apache.hadoop.yarn.server.resourcemanager.ClientRMService.getApplicationReport(ClientRMService.java:334)
	at org.apache.hadoop.yarn.server.resourcemanager.MockRM.getApplicationReport(MockRM.java:732)
	at org.apache.hadoop.yarn.server.resourcemanager.TestSubmitApplicationWithRMHA.verifySubmitApp(TestSubmitApplicationWithRMHA.java:71)
	at org.apache.hadoop.yarn.server.resourcemanager.TestSubmitApplicationWithRMHA.testHandleRMHAafterSubmitApplicationCallWithoutSavedApplicationState(TestSubmitApplicationWithRMHA.java:172)


REGRESSION:  org.apache.hadoop.yarn.server.resourcemanager.TestSubmitApplicationWithRMHA.testHandleRMHABeforeSubmitApplicationCallWithSavedApplicationState

Error Message:
org.apache.hadoop.yarn.server.utils.BuilderUtils.newApplicationReport(Lorg/apache/hadoop/yarn/api/records/ApplicationId;Lorg/apache/hadoop/yarn/api/records/ApplicationAttemptId;Ljava/lang/String;Ljava/lang/String;Ljava/lang/String;Ljava/lang/String;ILorg/apache/hadoop/yarn/api/records/Token;Lorg/apache/hadoop/yarn/api/records/YarnApplicationState;Ljava/lang/String;Ljava/lang/String;JJLorg/apache/hadoop/yarn/api/records/FinalApplicationStatus;Lorg/apache/hadoop/yarn/api/records/ApplicationResourceUsageReport;Ljava/lang/String;FLjava/lang/String;Lorg/apache/hadoop/yarn/api/records/Token;Ljava/util/Set;Z)Lorg/apache/hadoop/yarn/api/records/ApplicationReport;

Stack Trace:
java.lang.NoSuchMethodError: org.apache.hadoop.yarn.server.utils.BuilderUtils.newApplicationReport(Lorg/apache/hadoop/yarn/api/records/ApplicationId;Lorg/apache/hadoop/yarn/api/records/ApplicationAttemptId;Ljava/lang/String;Ljava/lang/String;Ljava/lang/String;Ljava/lang/String;ILorg/apache/hadoop/yarn/api/records/Token;Lorg/apache/hadoop/yarn/api/records/YarnApplicationState;Ljava/lang/String;Ljava/lang/String;JJLorg/apache/hadoop/yarn/api/records/FinalApplicationStatus;Lorg/apache/hadoop/yarn/api/records/ApplicationResourceUsageReport;Ljava/lang/String;FLjava/lang/String;Lorg/apache/hadoop/yarn/api/records/Token;Ljava/util/Set;Z)Lorg/apache/hadoop/yarn/api/records/ApplicationReport;
	at org.apache.hadoop.yarn.server.resourcemanager.rmapp.RMAppImpl.createAndGetApplicationReport(RMAppImpl.java:660)
	at org.apache.hadoop.yarn.server.resourcemanager.ClientRMService.getApplicationReport(ClientRMService.java:334)
	at org.apache.hadoop.yarn.server.resourcemanager.MockRM.getApplicationReport(MockRM.java:732)
	at org.apache.hadoop.yarn.server.resourcemanager.TestSubmitApplicationWithRMHA.verifySubmitApp(TestSubmitApplicationWithRMHA.java:71)
	at org.apache.hadoop.yarn.server.resourcemanager.TestSubmitApplicationWithRMHA.testHandleRMHABeforeSubmitApplicationCallWithSavedApplicationState(TestSubmitApplicationWithRMHA.java:63)


REGRESSION:  org.apache.hadoop.yarn.server.resourcemanager.TestSubmitApplicationWithRMHA.testHandleRMHADuringSubmitApplicationCallWithoutSavedApplicationState

Error Message:
org.apache.hadoop.yarn.server.utils.BuilderUtils.newApplicationReport(Lorg/apache/hadoop/yarn/api/records/ApplicationId;Lorg/apache/hadoop/yarn/api/records/ApplicationAttemptId;Ljava/lang/String;Ljava/lang/String;Ljava/lang/String;Ljava/lang/String;ILorg/apache/hadoop/yarn/api/records/Token;Lorg/apache/hadoop/yarn/api/records/YarnApplicationState;Ljava/lang/String;Ljava/lang/String;JJLorg/apache/hadoop/yarn/api/records/FinalApplicationStatus;Lorg/apache/hadoop/yarn/api/records/ApplicationResourceUsageReport;Ljava/lang/String;FLjava/lang/String;Lorg/apache/hadoop/yarn/api/records/Token;Ljava/util/Set;Z)Lorg/apache/hadoop/yarn/api/records/ApplicationReport;

Stack Trace:
java.lang.NoSuchMethodError: org.apache.hadoop.yarn.server.utils.BuilderUtils.newApplicationReport(Lorg/apache/hadoop/yarn/api/records/ApplicationId;Lorg/apache/hadoop/yarn/api/records/ApplicationAttemptId;Ljava/lang/String;Ljava/lang/String;Ljava/lang/String;Ljava/lang/String;ILorg/apache/hadoop/yarn/api/records/Token;Lorg/apache/hadoop/yarn/api/records/YarnApplicationState;Ljava/lang/String;Ljava/lang/String;JJLorg/apache/hadoop/yarn/api/records/FinalApplicationStatus;Lorg/apache/hadoop/yarn/api/records/ApplicationResourceUsageReport;Ljava/lang/String;FLjava/lang/String;Lorg/apache/hadoop/yarn/api/records/Token;Ljava/util/Set;Z)Lorg/apache/hadoop/yarn/api/records/ApplicationReport;
	at org.apache.hadoop.yarn.server.resourcemanager.rmapp.RMAppImpl.createAndGetApplicationReport(RMAppImpl.java:660)
	at org.apache.hadoop.yarn.server.resourcemanager.ClientRMService.getApplicationReport(ClientRMService.java:334)
	at org.apache.hadoop.yarn.server.resourcemanager.MockRM.getApplicationReport(MockRM.java:732)
	at org.apache.hadoop.yarn.server.resourcemanager.TestSubmitApplicationWithRMHA.verifySubmitApp(TestSubmitApplicationWithRMHA.java:71)
	at org.apache.hadoop.yarn.server.resourcemanager.TestSubmitApplicationWithRMHA.testHandleRMHADuringSubmitApplicationCallWithoutSavedApplicationState(TestSubmitApplicationWithRMHA.java:303)


REGRESSION:  org.apache.hadoop.yarn.server.resourcemanager.TestSubmitApplicationWithRMHA.testGetApplicationReportIdempotent

Error Message:
org.apache.hadoop.yarn.server.utils.BuilderUtils.newApplicationReport(Lorg/apache/hadoop/yarn/api/records/ApplicationId;Lorg/apache/hadoop/yarn/api/records/ApplicationAttemptId;Ljava/lang/String;Ljava/lang/String;Ljava/lang/String;Ljava/lang/String;ILorg/apache/hadoop/yarn/api/records/Token;Lorg/apache/hadoop/yarn/api/records/YarnApplicationState;Ljava/lang/String;Ljava/lang/String;JJLorg/apache/hadoop/yarn/api/records/FinalApplicationStatus;Lorg/apache/hadoop/yarn/api/records/ApplicationResourceUsageReport;Ljava/lang/String;FLjava/lang/String;Lorg/apache/hadoop/yarn/api/records/Token;Ljava/util/Set;Z)Lorg/apache/hadoop/yarn/api/records/ApplicationReport;

Stack Trace:
java.lang.NoSuchMethodError: org.apache.hadoop.yarn.server.utils.BuilderUtils.newApplicationReport(Lorg/apache/hadoop/yarn/api/records/ApplicationId;Lorg/apache/hadoop/yarn/api/records/ApplicationAttemptId;Ljava/lang/String;Ljava/lang/String;Ljava/lang/String;Ljava/lang/String;ILorg/apache/hadoop/yarn/api/records/Token;Lorg/apache/hadoop/yarn/api/records/YarnApplicationState;Ljava/lang/String;Ljava/lang/String;JJLorg/apache/hadoop/yarn/api/records/FinalApplicationStatus;Lorg/apache/hadoop/yarn/api/records/ApplicationResourceUsageReport;Ljava/lang/String;FLjava/lang/String;Lorg/apache/hadoop/yarn/api/records/Token;Ljava/util/Set;Z)Lorg/apache/hadoop/yarn/api/records/ApplicationReport;
	at org.apache.hadoop.yarn.server.resourcemanager.rmapp.RMAppImpl.createAndGetApplicationReport(RMAppImpl.java:660)
	at org.apache.hadoop.yarn.server.resourcemanager.ClientRMService.getApplicationReport(ClientRMService.java:334)
	at org.apache.hadoop.yarn.server.resourcemanager.MockRM.getApplicationReport(MockRM.java:732)
	at org.apache.hadoop.yarn.server.resourcemanager.TestSubmitApplicationWithRMHA.testGetApplicationReportIdempotent(TestSubmitApplicationWithRMHA.java:188)


REGRESSION:  org.apache.hadoop.yarn.server.resourcemanager.ahs.TestRMApplicationHistoryWriter.testParallelWrite

Error Message:
org.apache.hadoop.yarn.server.applicationhistoryservice.records.ApplicationStartData.newInstance(Lorg/apache/hadoop/yarn/api/records/ApplicationId;Ljava/lang/String;Ljava/lang/String;Ljava/lang/String;Ljava/lang/String;JJZ)Lorg/apache/hadoop/yarn/server/applicationhistoryservice/records/ApplicationStartData;

Stack Trace:
java.lang.NoSuchMethodError: org.apache.hadoop.yarn.server.applicationhistoryservice.records.ApplicationStartData.newInstance(Lorg/apache/hadoop/yarn/api/records/ApplicationId;Ljava/lang/String;Ljava/lang/String;Ljava/lang/String;Ljava/lang/String;JJZ)Lorg/apache/hadoop/yarn/server/applicationhistoryservice/records/ApplicationStartData;
	at org.apache.hadoop.yarn.server.resourcemanager.ahs.RMApplicationHistoryWriter.applicationStarted(RMApplicationHistoryWriter.java:227)
	at org.apache.hadoop.yarn.server.resourcemanager.ahs.TestRMApplicationHistoryWriter.testParallelWrite(TestRMApplicationHistoryWriter.java:337)


REGRESSION:  org.apache.hadoop.yarn.server.resourcemanager.ahs.TestRMApplicationHistoryWriter.testWriteApplication

Error Message:
org.apache.hadoop.yarn.server.applicationhistoryservice.records.ApplicationStartData.newInstance(Lorg/apache/hadoop/yarn/api/records/ApplicationId;Ljava/lang/String;Ljava/lang/String;Ljava/lang/String;Ljava/lang/String;JJZ)Lorg/apache/hadoop/yarn/server/applicationhistoryservice/records/ApplicationStartData;

Stack Trace:
java.lang.NoSuchMethodError: org.apache.hadoop.yarn.server.applicationhistoryservice.records.ApplicationStartData.newInstance(Lorg/apache/hadoop/yarn/api/records/ApplicationId;Ljava/lang/String;Ljava/lang/String;Ljava/lang/String;Ljava/lang/String;JJZ)Lorg/apache/hadoop/yarn/server/applicationhistoryservice/records/ApplicationStartData;
	at org.apache.hadoop.yarn.server.resourcemanager.ahs.RMApplicationHistoryWriter.applicationStarted(RMApplicationHistoryWriter.java:227)
	at org.apache.hadoop.yarn.server.resourcemanager.ahs.TestRMApplicationHistoryWriter.testWriteApplication(TestRMApplicationHistoryWriter.java:206)


REGRESSION:  org.apache.hadoop.yarn.server.resourcemanager.rmapp.TestRMAppTransitions.testGetAppReport[0]

Error Message:
org.apache.hadoop.yarn.server.utils.BuilderUtils.newApplicationReport(Lorg/apache/hadoop/yarn/api/records/ApplicationId;Lorg/apache/hadoop/yarn/api/records/ApplicationAttemptId;Ljava/lang/String;Ljava/lang/String;Ljava/lang/String;Ljava/lang/String;ILorg/apache/hadoop/yarn/api/records/Token;Lorg/apache/hadoop/yarn/api/records/YarnApplicationState;Ljava/lang/String;Ljava/lang/String;JJLorg/apache/hadoop/yarn/api/records/FinalApplicationStatus;Lorg/apache/hadoop/yarn/api/records/ApplicationResourceUsageReport;Ljava/lang/String;FLjava/lang/String;Lorg/apache/hadoop/yarn/api/records/Token;Ljava/util/Set;Z)Lorg/apache/hadoop/yarn/api/records/ApplicationReport;

Stack Trace:
java.lang.NoSuchMethodError: org.apache.hadoop.yarn.server.utils.BuilderUtils.newApplicationReport(Lorg/apache/hadoop/yarn/api/records/ApplicationId;Lorg/apache/hadoop/yarn/api/records/ApplicationAttemptId;Ljava/lang/String;Ljava/lang/String;Ljava/lang/String;Ljava/lang/String;ILorg/apache/hadoop/yarn/api/records/Token;Lorg/apache/hadoop/yarn/api/records/YarnApplicationState;Ljava/lang/String;Ljava/lang/String;JJLorg/apache/hadoop/yarn/api/records/FinalApplicationStatus;Lorg/apache/hadoop/yarn/api/records/ApplicationResourceUsageReport;Ljava/lang/String;FLjava/lang/String;Lorg/apache/hadoop/yarn/api/records/Token;Ljava/util/Set;Z)Lorg/apache/hadoop/yarn/api/records/ApplicationReport;
	at org.apache.hadoop.yarn.server.resourcemanager.rmapp.RMAppImpl.createAndGetApplicationReport(RMAppImpl.java:660)
	at org.apache.hadoop.yarn.server.resourcemanager.rmapp.TestRMAppTransitions.testGetAppReport(TestRMAppTransitions.java:1010)


REGRESSION:  org.apache.hadoop.yarn.server.resourcemanager.rmapp.TestRMAppTransitions.testGetAppReport[1]

Error Message:
org.apache.hadoop.yarn.server.utils.BuilderUtils.newApplicationReport(Lorg/apache/hadoop/yarn/api/records/ApplicationId;Lorg/apache/hadoop/yarn/api/records/ApplicationAttemptId;Ljava/lang/String;Ljava/lang/String;Ljava/lang/String;Ljava/lang/String;ILorg/apache/hadoop/yarn/api/records/Token;Lorg/apache/hadoop/yarn/api/records/YarnApplicationState;Ljava/lang/String;Ljava/lang/String;JJLorg/apache/hadoop/yarn/api/records/FinalApplicationStatus;Lorg/apache/hadoop/yarn/api/records/ApplicationResourceUsageReport;Ljava/lang/String;FLjava/lang/String;Lorg/apache/hadoop/yarn/api/records/Token;Ljava/util/Set;Z)Lorg/apache/hadoop/yarn/api/records/ApplicationReport;

Stack Trace:
java.lang.NoSuchMethodError: org.apache.hadoop.yarn.server.utils.BuilderUtils.newApplicationReport(Lorg/apache/hadoop/yarn/api/records/ApplicationId;Lorg/apache/hadoop/yarn/api/records/ApplicationAttemptId;Ljava/lang/String;Ljava/lang/String;Ljava/lang/String;Ljava/lang/String;ILorg/apache/hadoop/yarn/api/records/Token;Lorg/apache/hadoop/yarn/api/records/YarnApplicationState;Ljava/lang/String;Ljava/lang/String;JJLorg/apache/hadoop/yarn/api/records/FinalApplicationStatus;Lorg/apache/hadoop/yarn/api/records/ApplicationResourceUsageReport;Ljava/lang/String;FLjava/lang/String;Lorg/apache/hadoop/yarn/api/records/Token;Ljava/util/Set;Z)Lorg/apache/hadoop/yarn/api/records/ApplicationReport;
	at org.apache.hadoop.yarn.server.resourcemanager.rmapp.RMAppImpl.createAndGetApplicationReport(RMAppImpl.java:660)
	at org.apache.hadoop.yarn.server.resourcemanager.rmapp.TestRMAppTransitions.testGetAppReport(TestRMAppTransitions.java:1010)


REGRESSION:  org.apache.hadoop.yarn.server.resourcemanager.scheduler.capacity.TestCapacityScheduler.testMoveAllApps

Error Message:
org.apache.hadoop.yarn.server.utils.BuilderUtils.newApplicationReport(Lorg/apache/hadoop/yarn/api/records/ApplicationId;Lorg/apache/hadoop/yarn/api/records/ApplicationAttemptId;Ljava/lang/String;Ljava/lang/String;Ljava/lang/String;Ljava/lang/String;ILorg/apache/hadoop/yarn/api/records/Token;Lorg/apache/hadoop/yarn/api/records/YarnApplicationState;Ljava/lang/String;Ljava/lang/String;JJLorg/apache/hadoop/yarn/api/records/FinalApplicationStatus;Lorg/apache/hadoop/yarn/api/records/ApplicationResourceUsageReport;Ljava/lang/String;FLjava/lang/String;Lorg/apache/hadoop/yarn/api/records/Token;Ljava/util/Set;Z)Lorg/apache/hadoop/yarn/api/records/ApplicationReport;

Stack Trace:
java.lang.NoSuchMethodError: org.apache.hadoop.yarn.server.utils.BuilderUtils.newApplicationReport(Lorg/apache/hadoop/yarn/api/records/ApplicationId;Lorg/apache/hadoop/yarn/api/records/ApplicationAttemptId;Ljava/lang/String;Ljava/lang/String;Ljava/lang/String;Ljava/lang/String;ILorg/apache/hadoop/yarn/api/records/Token;Lorg/apache/hadoop/yarn/api/records/YarnApplicationState;Ljava/lang/String;Ljava/lang/String;JJLorg/apache/hadoop/yarn/api/records/FinalApplicationStatus;Lorg/apache/hadoop/yarn/api/records/ApplicationResourceUsageReport;Ljava/lang/String;FLjava/lang/String;Lorg/apache/hadoop/yarn/api/records/Token;Ljava/util/Set;Z)Lorg/apache/hadoop/yarn/api/records/ApplicationReport;
	at org.apache.hadoop.yarn.server.resourcemanager.rmapp.RMAppImpl.createAndGetApplicationReport(RMAppImpl.java:660)
	at org.apache.hadoop.yarn.server.resourcemanager.ClientRMService.getApplicationReport(ClientRMService.java:334)
	at org.apache.hadoop.yarn.server.resourcemanager.MockRM.getApplicationReport(MockRM.java:732)
	at org.apache.hadoop.yarn.server.resourcemanager.scheduler.capacity.TestCapacityScheduler.testMoveAllApps(TestCapacityScheduler.java:1781)


REGRESSION:  org.apache.hadoop.yarn.server.resourcemanager.scheduler.capacity.TestCapacityScheduler.testMoveAllAppsInvalidSource

Error Message:
org.apache.hadoop.yarn.server.utils.BuilderUtils.newApplicationReport(Lorg/apache/hadoop/yarn/api/records/ApplicationId;Lorg/apache/hadoop/yarn/api/records/ApplicationAttemptId;Ljava/lang/String;Ljava/lang/String;Ljava/lang/String;Ljava/lang/String;ILorg/apache/hadoop/yarn/api/records/Token;Lorg/apache/hadoop/yarn/api/records/YarnApplicationState;Ljava/lang/String;Ljava/lang/String;JJLorg/apache/hadoop/yarn/api/records/FinalApplicationStatus;Lorg/apache/hadoop/yarn/api/records/ApplicationResourceUsageReport;Ljava/lang/String;FLjava/lang/String;Lorg/apache/hadoop/yarn/api/records/Token;Ljava/util/Set;Z)Lorg/apache/hadoop/yarn/api/records/ApplicationReport;

Stack Trace:
java.lang.NoSuchMethodError: org.apache.hadoop.yarn.server.utils.BuilderUtils.newApplicationReport(Lorg/apache/hadoop/yarn/api/records/ApplicationId;Lorg/apache/hadoop/yarn/api/records/ApplicationAttemptId;Ljava/lang/String;Ljava/lang/String;Ljava/lang/String;Ljava/lang/String;ILorg/apache/hadoop/yarn/api/records/Token;Lorg/apache/hadoop/yarn/api/records/YarnApplicationState;Ljava/lang/String;Ljava/lang/String;JJLorg/apache/hadoop/yarn/api/records/FinalApplicationStatus;Lorg/apache/hadoop/yarn/api/records/ApplicationResourceUsageReport;Ljava/lang/String;FLjava/lang/String;Lorg/apache/hadoop/yarn/api/records/Token;Ljava/util/Set;Z)Lorg/apache/hadoop/yarn/api/records/ApplicationReport;
	at org.apache.hadoop.yarn.server.resourcemanager.rmapp.RMAppImpl.createAndGetApplicationReport(RMAppImpl.java:660)
	at org.apache.hadoop.yarn.server.resourcemanager.ClientRMService.getApplicationReport(ClientRMService.java:334)
	at org.apache.hadoop.yarn.server.resourcemanager.MockRM.getApplicationReport(MockRM.java:732)
	at org.apache.hadoop.yarn.server.resourcemanager.scheduler.capacity.TestCapacityScheduler.testMoveAllAppsInvalidSource(TestCapacityScheduler.java:1903)


REGRESSION:  org.apache.hadoop.yarn.server.resourcemanager.scheduler.capacity.TestCapacityScheduler.testMoveAllAppsInvalidDestination

Error Message:
org.apache.hadoop.yarn.server.utils.BuilderUtils.newApplicationReport(Lorg/apache/hadoop/yarn/api/records/ApplicationId;Lorg/apache/hadoop/yarn/api/records/ApplicationAttemptId;Ljava/lang/String;Ljava/lang/String;Ljava/lang/String;Ljava/lang/String;ILorg/apache/hadoop/yarn/api/records/Token;Lorg/apache/hadoop/yarn/api/records/YarnApplicationState;Ljava/lang/String;Ljava/lang/String;JJLorg/apache/hadoop/yarn/api/records/FinalApplicationStatus;Lorg/apache/hadoop/yarn/api/records/ApplicationResourceUsageReport;Ljava/lang/String;FLjava/lang/String;Lorg/apache/hadoop/yarn/api/records/Token;Ljava/util/Set;Z)Lorg/apache/hadoop/yarn/api/records/ApplicationReport;

Stack Trace:
java.lang.NoSuchMethodError: org.apache.hadoop.yarn.server.utils.BuilderUtils.newApplicationReport(Lorg/apache/hadoop/yarn/api/records/ApplicationId;Lorg/apache/hadoop/yarn/api/records/ApplicationAttemptId;Ljava/lang/String;Ljava/lang/String;Ljava/lang/String;Ljava/lang/String;ILorg/apache/hadoop/yarn/api/records/Token;Lorg/apache/hadoop/yarn/api/records/YarnApplicationState;Ljava/lang/String;Ljava/lang/String;JJLorg/apache/hadoop/yarn/api/records/FinalApplicationStatus;Lorg/apache/hadoop/yarn/api/records/ApplicationResourceUsageReport;Ljava/lang/String;FLjava/lang/String;Lorg/apache/hadoop/yarn/api/records/Token;Ljava/util/Set;Z)Lorg/apache/hadoop/yarn/api/records/ApplicationReport;
	at org.apache.hadoop.yarn.server.resourcemanager.rmapp.RMAppImpl.createAndGetApplicationReport(RMAppImpl.java:660)
	at org.apache.hadoop.yarn.server.resourcemanager.ClientRMService.getApplicationReport(ClientRMService.java:334)
	at org.apache.hadoop.yarn.server.resourcemanager.MockRM.getApplicationReport(MockRM.java:732)
	at org.apache.hadoop.yarn.server.resourcemanager.scheduler.capacity.TestCapacityScheduler.testMoveAllAppsInvalidDestination(TestCapacityScheduler.java:1844)


REGRESSION:  org.apache.hadoop.yarn.server.resourcemanager.scheduler.capacity.TestCapacityScheduler.testKillAllAppsInvalidSource

Error Message:
org.apache.hadoop.yarn.server.utils.BuilderUtils.newApplicationReport(Lorg/apache/hadoop/yarn/api/records/ApplicationId;Lorg/apache/hadoop/yarn/api/records/ApplicationAttemptId;Ljava/lang/String;Ljava/lang/String;Ljava/lang/String;Ljava/lang/String;ILorg/apache/hadoop/yarn/api/records/Token;Lorg/apache/hadoop/yarn/api/records/YarnApplicationState;Ljava/lang/String;Ljava/lang/String;JJLorg/apache/hadoop/yarn/api/records/FinalApplicationStatus;Lorg/apache/hadoop/yarn/api/records/ApplicationResourceUsageReport;Ljava/lang/String;FLjava/lang/String;Lorg/apache/hadoop/yarn/api/records/Token;Ljava/util/Set;Z)Lorg/apache/hadoop/yarn/api/records/ApplicationReport;

Stack Trace:
java.lang.NoSuchMethodError: org.apache.hadoop.yarn.server.utils.BuilderUtils.newApplicationReport(Lorg/apache/hadoop/yarn/api/records/ApplicationId;Lorg/apache/hadoop/yarn/api/records/ApplicationAttemptId;Ljava/lang/String;Ljava/lang/String;Ljava/lang/String;Ljava/lang/String;ILorg/apache/hadoop/yarn/api/records/Token;Lorg/apache/hadoop/yarn/api/records/YarnApplicationState;Ljava/lang/String;Ljava/lang/String;JJLorg/apache/hadoop/yarn/api/records/FinalApplicationStatus;Lorg/apache/hadoop/yarn/api/records/ApplicationResourceUsageReport;Ljava/lang/String;FLjava/lang/String;Lorg/apache/hadoop/yarn/api/records/Token;Ljava/util/Set;Z)Lorg/apache/hadoop/yarn/api/records/ApplicationReport;
	at org.apache.hadoop.yarn.server.resourcemanager.rmapp.RMAppImpl.createAndGetApplicationReport(RMAppImpl.java:660)
	at org.apache.hadoop.yarn.server.resourcemanager.ClientRMService.getApplicationReport(ClientRMService.java:334)
	at org.apache.hadoop.yarn.server.resourcemanager.MockRM.getApplicationReport(MockRM.java:732)
	at org.apache.hadoop.yarn.server.resourcemanager.scheduler.capacity.TestCapacityScheduler.testKillAllAppsInvalidSource(TestCapacityScheduler.java:2007)


REGRESSION:  org.apache.hadoop.yarn.server.resourcemanager.scheduler.capacity.TestCapacityScheduler.testKillAllAppsInQueue

Error Message:
org.apache.hadoop.yarn.server.utils.BuilderUtils.newApplicationReport(Lorg/apache/hadoop/yarn/api/records/ApplicationId;Lorg/apache/hadoop/yarn/api/records/ApplicationAttemptId;Ljava/lang/String;Ljava/lang/String;Ljava/lang/String;Ljava/lang/String;ILorg/apache/hadoop/yarn/api/records/Token;Lorg/apache/hadoop/yarn/api/records/YarnApplicationState;Ljava/lang/String;Ljava/lang/String;JJLorg/apache/hadoop/yarn/api/records/FinalApplicationStatus;Lorg/apache/hadoop/yarn/api/records/ApplicationResourceUsageReport;Ljava/lang/String;FLjava/lang/String;Lorg/apache/hadoop/yarn/api/records/Token;Ljava/util/Set;Z)Lorg/apache/hadoop/yarn/api/records/ApplicationReport;

Stack Trace:
java.lang.NoSuchMethodError: org.apache.hadoop.yarn.server.utils.BuilderUtils.newApplicationReport(Lorg/apache/hadoop/yarn/api/records/ApplicationId;Lorg/apache/hadoop/yarn/api/records/ApplicationAttemptId;Ljava/lang/String;Ljava/lang/String;Ljava/lang/String;Ljava/lang/String;ILorg/apache/hadoop/yarn/api/records/Token;Lorg/apache/hadoop/yarn/api/records/YarnApplicationState;Ljava/lang/String;Ljava/lang/String;JJLorg/apache/hadoop/yarn/api/records/FinalApplicationStatus;Lorg/apache/hadoop/yarn/api/records/ApplicationResourceUsageReport;Ljava/lang/String;FLjava/lang/String;Lorg/apache/hadoop/yarn/api/records/Token;Ljava/util/Set;Z)Lorg/apache/hadoop/yarn/api/records/ApplicationReport;
	at org.apache.hadoop.yarn.server.resourcemanager.rmapp.RMAppImpl.createAndGetApplicationReport(RMAppImpl.java:660)
	at org.apache.hadoop.yarn.server.resourcemanager.ClientRMService.getApplicationReport(ClientRMService.java:334)
	at org.apache.hadoop.yarn.server.resourcemanager.MockRM.getApplicationReport(MockRM.java:732)
	at org.apache.hadoop.yarn.server.resourcemanager.scheduler.capacity.TestCapacityScheduler.testKillAllAppsInQueue(TestCapacityScheduler.java:1962)


REGRESSION:  org.apache.hadoop.yarn.server.resourcemanager.scheduler.capacity.TestCapacityScheduler.testMoveAppSameParent

Error Message:
org.apache.hadoop.yarn.server.utils.BuilderUtils.newApplicationReport(Lorg/apache/hadoop/yarn/api/records/ApplicationId;Lorg/apache/hadoop/yarn/api/records/ApplicationAttemptId;Ljava/lang/String;Ljava/lang/String;Ljava/lang/String;Ljava/lang/String;ILorg/apache/hadoop/yarn/api/records/Token;Lorg/apache/hadoop/yarn/api/records/YarnApplicationState;Ljava/lang/String;Ljava/lang/String;JJLorg/apache/hadoop/yarn/api/records/FinalApplicationStatus;Lorg/apache/hadoop/yarn/api/records/ApplicationResourceUsageReport;Ljava/lang/String;FLjava/lang/String;Lorg/apache/hadoop/yarn/api/records/Token;Ljava/util/Set;Z)Lorg/apache/hadoop/yarn/api/records/ApplicationReport;

Stack Trace:
java.lang.NoSuchMethodError: org.apache.hadoop.yarn.server.utils.BuilderUtils.newApplicationReport(Lorg/apache/hadoop/yarn/api/records/ApplicationId;Lorg/apache/hadoop/yarn/api/records/ApplicationAttemptId;Ljava/lang/String;Ljava/lang/String;Ljava/lang/String;Ljava/lang/String;ILorg/apache/hadoop/yarn/api/records/Token;Lorg/apache/hadoop/yarn/api/records/YarnApplicationState;Ljava/lang/String;Ljava/lang/String;JJLorg/apache/hadoop/yarn/api/records/FinalApplicationStatus;Lorg/apache/hadoop/yarn/api/records/ApplicationResourceUsageReport;Ljava/lang/String;FLjava/lang/String;Lorg/apache/hadoop/yarn/api/records/Token;Ljava/util/Set;Z)Lorg/apache/hadoop/yarn/api/records/ApplicationReport;
	at org.apache.hadoop.yarn.server.resourcemanager.rmapp.RMAppImpl.createAndGetApplicationReport(RMAppImpl.java:660)
	at org.apache.hadoop.yarn.server.resourcemanager.ClientRMService.getApplicationReport(ClientRMService.java:334)
	at org.apache.hadoop.yarn.server.resourcemanager.MockRM.getApplicationReport(MockRM.java:732)
	at org.apache.hadoop.yarn.server.resourcemanager.scheduler.capacity.TestCapacityScheduler.testMoveAppSameParent(TestCapacityScheduler.java:1247)


REGRESSION:  org.apache.hadoop.yarn.server.resourcemanager.scheduler.capacity.TestCapacityScheduler.testMoveAppBasic

Error Message:
org.apache.hadoop.yarn.server.utils.BuilderUtils.newApplicationReport(Lorg/apache/hadoop/yarn/api/records/ApplicationId;Lorg/apache/hadoop/yarn/api/records/ApplicationAttemptId;Ljava/lang/String;Ljava/lang/String;Ljava/lang/String;Ljava/lang/String;ILorg/apache/hadoop/yarn/api/records/Token;Lorg/apache/hadoop/yarn/api/records/YarnApplicationState;Ljava/lang/String;Ljava/lang/String;JJLorg/apache/hadoop/yarn/api/records/FinalApplicationStatus;Lorg/apache/hadoop/yarn/api/records/ApplicationResourceUsageReport;Ljava/lang/String;FLjava/lang/String;Lorg/apache/hadoop/yarn/api/records/Token;Ljava/util/Set;Z)Lorg/apache/hadoop/yarn/api/records/ApplicationReport;

Stack Trace:
java.lang.NoSuchMethodError: org.apache.hadoop.yarn.server.utils.BuilderUtils.newApplicationReport(Lorg/apache/hadoop/yarn/api/records/ApplicationId;Lorg/apache/hadoop/yarn/api/records/ApplicationAttemptId;Ljava/lang/String;Ljava/lang/String;Ljava/lang/String;Ljava/lang/String;ILorg/apache/hadoop/yarn/api/records/Token;Lorg/apache/hadoop/yarn/api/records/YarnApplicationState;Ljava/lang/String;Ljava/lang/String;JJLorg/apache/hadoop/yarn/api/records/FinalApplicationStatus;Lorg/apache/hadoop/yarn/api/records/ApplicationResourceUsageReport;Ljava/lang/String;FLjava/lang/String;Lorg/apache/hadoop/yarn/api/records/Token;Ljava/util/Set;Z)Lorg/apache/hadoop/yarn/api/records/ApplicationReport;
	at org.apache.hadoop.yarn.server.resourcemanager.rmapp.RMAppImpl.createAndGetApplicationReport(RMAppImpl.java:660)
	at org.apache.hadoop.yarn.server.resourcemanager.ClientRMService.getApplicationReport(ClientRMService.java:334)
	at org.apache.hadoop.yarn.server.resourcemanager.MockRM.getApplicationReport(MockRM.java:732)
	at org.apache.hadoop.yarn.server.resourcemanager.scheduler.capacity.TestCapacityScheduler.testMoveAppBasic(TestCapacityScheduler.java:1185)


REGRESSION:  org.apache.hadoop.yarn.server.resourcemanager.scheduler.capacity.TestCapacitySchedulerDynamicBehavior.testMoveAppToPlanQueue

Error Message:
org.apache.hadoop.yarn.server.utils.BuilderUtils.newApplicationReport(Lorg/apache/hadoop/yarn/api/records/ApplicationId;Lorg/apache/hadoop/yarn/api/records/ApplicationAttemptId;Ljava/lang/String;Ljava/lang/String;Ljava/lang/String;Ljava/lang/String;ILorg/apache/hadoop/yarn/api/records/Token;Lorg/apache/hadoop/yarn/api/records/YarnApplicationState;Ljava/lang/String;Ljava/lang/String;JJLorg/apache/hadoop/yarn/api/records/FinalApplicationStatus;Lorg/apache/hadoop/yarn/api/records/ApplicationResourceUsageReport;Ljava/lang/String;FLjava/lang/String;Lorg/apache/hadoop/yarn/api/records/Token;Ljava/util/Set;Z)Lorg/apache/hadoop/yarn/api/records/ApplicationReport;

Stack Trace:
java.lang.NoSuchMethodError: org.apache.hadoop.yarn.server.utils.BuilderUtils.newApplicationReport(Lorg/apache/hadoop/yarn/api/records/ApplicationId;Lorg/apache/hadoop/yarn/api/records/ApplicationAttemptId;Ljava/lang/String;Ljava/lang/String;Ljava/lang/String;Ljava/lang/String;ILorg/apache/hadoop/yarn/api/records/Token;Lorg/apache/hadoop/yarn/api/records/YarnApplicationState;Ljava/lang/String;Ljava/lang/String;JJLorg/apache/hadoop/yarn/api/records/FinalApplicationStatus;Lorg/apache/hadoop/yarn/api/records/ApplicationResourceUsageReport;Ljava/lang/String;FLjava/lang/String;Lorg/apache/hadoop/yarn/api/records/Token;Ljava/util/Set;Z)Lorg/apache/hadoop/yarn/api/records/ApplicationReport;
	at org.apache.hadoop.yarn.server.resourcemanager.rmapp.RMAppImpl.createAndGetApplicationReport(RMAppImpl.java:660)
	at org.apache.hadoop.yarn.server.resourcemanager.ClientRMService.getApplicationReport(ClientRMService.java:334)
	at org.apache.hadoop.yarn.server.resourcemanager.MockRM.getApplicationReport(MockRM.java:732)
	at org.apache.hadoop.yarn.server.resourcemanager.scheduler.capacity.TestCapacitySchedulerDynamicBehavior.testMoveAppToPlanQueue(TestCapacitySchedulerDynamicBehavior.java:196)


REGRESSION:  org.apache.hadoop.yarn.server.resourcemanager.scheduler.capacity.TestCapacitySchedulerQueueACLs.testApplicationACLs

Error Message:
org.apache.hadoop.yarn.server.utils.BuilderUtils.newApplicationReport(Lorg/apache/hadoop/yarn/api/records/ApplicationId;Lorg/apache/hadoop/yarn/api/records/ApplicationAttemptId;Ljava/lang/String;Ljava/lang/String;Ljava/lang/String;Ljava/lang/String;ILorg/apache/hadoop/yarn/api/records/Token;Lorg/apache/hadoop/yarn/api/records/YarnApplicationState;Ljava/lang/String;Ljava/lang/String;JJLorg/apache/hadoop/yarn/api/records/FinalApplicationStatus;Lorg/apache/hadoop/yarn/api/records/ApplicationResourceUsageReport;Ljava/lang/String;FLjava/lang/String;Lorg/apache/hadoop/yarn/api/records/Token;Ljava/util/Set;Z)Lorg/apache/hadoop/yarn/api/records/ApplicationReport;
 at org.apache.hadoop.yarn.server.resourcemanager.rmapp.RMAppImpl.createAndGetApplicationReport(RMAppImpl.java:660)
 at org.apache.hadoop.yarn.server.resourcemanager.ClientRMService.getApplicationReport(ClientRMService.java:334)
 at org.apache.hadoop.yarn.api.impl.pb.service.ApplicationClientProtocolPBServiceImpl.getApplicationReport(ApplicationClientProtocolPBServiceImpl.java:175)
 at org.apache.hadoop.yarn.proto.ApplicationClientProtocol$ApplicationClientProtocolService$2.callBlockingMethod(ApplicationClientProtocol.java:417)
 at org.apache.hadoop.ipc.ProtobufRpcEngine$Server$ProtoBufRpcInvoker.call(ProtobufRpcEngine.java:636)
 at org.apache.hadoop.ipc.RPC$Server.call(RPC.java:976)
 at org.apache.hadoop.ipc.Server$Handler$1.run(Server.java:2171)
 at org.apache.hadoop.ipc.Server$Handler$1.run(Server.java:2167)
 at java.security.AccessController.doPrivileged(Native Method)
 at javax.security.auth.Subject.doAs(Subject.java:415)
 at org.apache.hadoop.security.UserGroupInformation.doAs(UserGroupInformation.java:1666)
 at org.apache.hadoop.ipc.Server$Handler.run(Server.java:2165)


Stack Trace:
org.apache.hadoop.ipc.RemoteException: org.apache.hadoop.yarn.server.utils.BuilderUtils.newApplicationReport(Lorg/apache/hadoop/yarn/api/records/ApplicationId;Lorg/apache/hadoop/yarn/api/records/ApplicationAttemptId;Ljava/lang/String;Ljava/lang/String;Ljava/lang/String;Ljava/lang/String;ILorg/apache/hadoop/yarn/api/records/Token;Lorg/apache/hadoop/yarn/api/records/YarnApplicationState;Ljava/lang/String;Ljava/lang/String;JJLorg/apache/hadoop/yarn/api/records/FinalApplicationStatus;Lorg/apache/hadoop/yarn/api/records/ApplicationResourceUsageReport;Ljava/lang/String;FLjava/lang/String;Lorg/apache/hadoop/yarn/api/records/Token;Ljava/util/Set;Z)Lorg/apache/hadoop/yarn/api/records/ApplicationReport;
	at org.apache.hadoop.yarn.server.resourcemanager.rmapp.RMAppImpl.createAndGetApplicationReport(RMAppImpl.java:660)
	at org.apache.hadoop.yarn.server.resourcemanager.ClientRMService.getApplicationReport(ClientRMService.java:334)
	at org.apache.hadoop.yarn.api.impl.pb.service.ApplicationClientProtocolPBServiceImpl.getApplicationReport(ApplicationClientProtocolPBServiceImpl.java:175)
	at org.apache.hadoop.yarn.proto.ApplicationClientProtocol$ApplicationClientProtocolService$2.callBlockingMethod(ApplicationClientProtocol.java:417)
	at org.apache.hadoop.ipc.ProtobufRpcEngine$Server$ProtoBufRpcInvoker.call(ProtobufRpcEngine.java:636)
	at org.apache.hadoop.ipc.RPC$Server.call(RPC.java:976)
	at org.apache.hadoop.ipc.Server$Handler$1.run(Server.java:2171)
	at org.apache.hadoop.ipc.Server$Handler$1.run(Server.java:2167)
	at java.security.AccessController.doPrivileged(Native Method)
	at javax.security.auth.Subject.doAs(Subject.java:415)
	at org.apache.hadoop.security.UserGroupInformation.doAs(UserGroupInformation.java:1666)
	at org.apache.hadoop.ipc.Server$Handler.run(Server.java:2165)

	at org.apache.hadoop.ipc.Client.call(Client.java:1489)
	at org.apache.hadoop.ipc.Client.call(Client.java:1420)
	at org.apache.hadoop.ipc.ProtobufRpcEngine$Invoker.invoke(ProtobufRpcEngine.java:229)
	at com.sun.proxy.$Proxy14.getApplicationReport(Unknown Source)
	at org.apache.hadoop.yarn.api.impl.pb.client.ApplicationClientProtocolPBClientImpl.getApplicationReport(ApplicationClientProtocolPBClientImpl.java:191)
	at org.apache.hadoop.yarn.server.resourcemanager.QueueACLsTestBase.verifyGetClientAMToken(QueueACLsTestBase.java:156)
	at org.apache.hadoop.yarn.server.resourcemanager.QueueACLsTestBase.testApplicationACLs(QueueACLsTestBase.java:142)
	at sun.reflect.NativeMethodAccessorImpl.invoke0(Native Method)
	at sun.reflect.NativeMethodAccessorImpl.invoke(NativeMethodAccessorImpl.java:57)
	at sun.reflect.DelegatingMethodAccessorImpl.invoke(DelegatingMethodAccessorImpl.java:43)
	at java.lang.reflect.Method.invoke(Method.java:606)
	at org.junit.runners.model.FrameworkMethod$1.runReflectiveCall(FrameworkMethod.java:47)
	at org.junit.internal.runners.model.ReflectiveCallable.run(ReflectiveCallable.java:12)
	at org.junit.runners.model.FrameworkMethod.invokeExplosively(FrameworkMethod.java:44)
	at org.junit.internal.runners.statements.InvokeMethod.evaluate(InvokeMethod.java:17)
	at org.junit.internal.runners.statements.RunBefores.evaluate(RunBefores.java:26)
	at org.junit.internal.runners.statements.RunAfters.evaluate(RunAfters.java:27)
	at org.junit.runners.ParentRunner.runLeaf(ParentRunner.java:271)
	at org.junit.runners.BlockJUnit4ClassRunner.runChild(BlockJUnit4ClassRunner.java:70)
	at org.junit.runners.BlockJUnit4ClassRunner.runChild(BlockJUnit4ClassRunner.java:50)
	at org.junit.runners.ParentRunner$3.run(ParentRunner.java:238)
	at org.junit.runners.ParentRunner$1.schedule(ParentRunner.java:63)
	at org.junit.runners.ParentRunner.runChildren(ParentRunner.java:236)
	at org.junit.runners.ParentRunner.access$000(ParentRunner.java:53)
	at org.junit.runners.ParentRunner$2.evaluate(ParentRunner.java:229)
	at org.junit.runners.ParentRunner.run(ParentRunner.java:309)
	at org.apache.maven.surefire.junit4.JUnit4Provider.execute(JUnit4Provider.java:264)
	at org.apache.maven.surefire.junit4.JUnit4Provider.executeTestSet(JUnit4Provider.java:153)
	at org.apache.maven.surefire.junit4.JUnit4Provider.invoke(JUnit4Provider.java:124)
	at org.apache.maven.surefire.booter.ForkedBooter.invokeProviderInSameClassLoader(ForkedBooter.java:200)
	at org.apache.maven.surefire.booter.ForkedBooter.runSuitesInProcess(ForkedBooter.java:153)
	at org.apache.maven.surefire.booter.ForkedBooter.main(ForkedBooter.java:103)


REGRESSION:  org.apache.hadoop.yarn.server.resourcemanager.scheduler.fair.TestFairSchedulerQueueACLs.testApplicationACLs

Error Message:
org.apache.hadoop.yarn.server.utils.BuilderUtils.newApplicationReport(Lorg/apache/hadoop/yarn/api/records/ApplicationId;Lorg/apache/hadoop/yarn/api/records/ApplicationAttemptId;Ljava/lang/String;Ljava/lang/String;Ljava/lang/String;Ljava/lang/String;ILorg/apache/hadoop/yarn/api/records/Token;Lorg/apache/hadoop/yarn/api/records/YarnApplicationState;Ljava/lang/String;Ljava/lang/String;JJLorg/apache/hadoop/yarn/api/records/FinalApplicationStatus;Lorg/apache/hadoop/yarn/api/records/ApplicationResourceUsageReport;Ljava/lang/String;FLjava/lang/String;Lorg/apache/hadoop/yarn/api/records/Token;Ljava/util/Set;Z)Lorg/apache/hadoop/yarn/api/records/ApplicationReport;
 at org.apache.hadoop.yarn.server.resourcemanager.rmapp.RMAppImpl.createAndGetApplicationReport(RMAppImpl.java:660)
 at org.apache.hadoop.yarn.server.resourcemanager.ClientRMService.getApplicationReport(ClientRMService.java:334)
 at org.apache.hadoop.yarn.api.impl.pb.service.ApplicationClientProtocolPBServiceImpl.getApplicationReport(ApplicationClientProtocolPBServiceImpl.java:175)
 at org.apache.hadoop.yarn.proto.ApplicationClientProtocol$ApplicationClientProtocolService$2.callBlockingMethod(ApplicationClientProtocol.java:417)
 at org.apache.hadoop.ipc.ProtobufRpcEngine$Server$ProtoBufRpcInvoker.call(ProtobufRpcEngine.java:636)
 at org.apache.hadoop.ipc.RPC$Server.call(RPC.java:976)
 at org.apache.hadoop.ipc.Server$Handler$1.run(Server.java:2171)
 at org.apache.hadoop.ipc.Server$Handler$1.run(Server.java:2167)
 at java.security.AccessController.doPrivileged(Native Method)
 at javax.security.auth.Subject.doAs(Subject.java:415)
 at org.apache.hadoop.security.UserGroupInformation.doAs(UserGroupInformation.java:1666)
 at org.apache.hadoop.ipc.Server$Handler.run(Server.java:2165)


Stack Trace:
org.apache.hadoop.ipc.RemoteException: org.apache.hadoop.yarn.server.utils.BuilderUtils.newApplicationReport(Lorg/apache/hadoop/yarn/api/records/ApplicationId;Lorg/apache/hadoop/yarn/api/records/ApplicationAttemptId;Ljava/lang/String;Ljava/lang/String;Ljava/lang/String;Ljava/lang/String;ILorg/apache/hadoop/yarn/api/records/Token;Lorg/apache/hadoop/yarn/api/records/YarnApplicationState;Ljava/lang/String;Ljava/lang/String;JJLorg/apache/hadoop/yarn/api/records/FinalApplicationStatus;Lorg/apache/hadoop/yarn/api/records/ApplicationResourceUsageReport;Ljava/lang/String;FLjava/lang/String;Lorg/apache/hadoop/yarn/api/records/Token;Ljava/util/Set;Z)Lorg/apache/hadoop/yarn/api/records/ApplicationReport;
	at org.apache.hadoop.yarn.server.resourcemanager.rmapp.RMAppImpl.createAndGetApplicationReport(RMAppImpl.java:660)
	at org.apache.hadoop.yarn.server.resourcemanager.ClientRMService.getApplicationReport(ClientRMService.java:334)
	at org.apache.hadoop.yarn.api.impl.pb.service.ApplicationClientProtocolPBServiceImpl.getApplicationReport(ApplicationClientProtocolPBServiceImpl.java:175)
	at org.apache.hadoop.yarn.proto.ApplicationClientProtocol$ApplicationClientProtocolService$2.callBlockingMethod(ApplicationClientProtocol.java:417)
	at org.apache.hadoop.ipc.ProtobufRpcEngine$Server$ProtoBufRpcInvoker.call(ProtobufRpcEngine.java:636)
	at org.apache.hadoop.ipc.RPC$Server.call(RPC.java:976)
	at org.apache.hadoop.ipc.Server$Handler$1.run(Server.java:2171)
	at org.apache.hadoop.ipc.Server$Handler$1.run(Server.java:2167)
	at java.security.AccessController.doPrivileged(Native Method)
	at javax.security.auth.Subject.doAs(Subject.java:415)
	at org.apache.hadoop.security.UserGroupInformation.doAs(UserGroupInformation.java:1666)
	at org.apache.hadoop.ipc.Server$Handler.run(Server.java:2165)

	at org.apache.hadoop.ipc.Client.call(Client.java:1489)
	at org.apache.hadoop.ipc.Client.call(Client.java:1420)
	at org.apache.hadoop.ipc.ProtobufRpcEngine$Invoker.invoke(ProtobufRpcEngine.java:229)
	at com.sun.proxy.$Proxy14.getApplicationReport(Unknown Source)
	at org.apache.hadoop.yarn.api.impl.pb.client.ApplicationClientProtocolPBClientImpl.getApplicationReport(ApplicationClientProtocolPBClientImpl.java:191)
	at org.apache.hadoop.yarn.server.resourcemanager.QueueACLsTestBase.verifyGetClientAMToken(QueueACLsTestBase.java:156)
	at org.apache.hadoop.yarn.server.resourcemanager.QueueACLsTestBase.testApplicationACLs(QueueACLsTestBase.java:142)
	at sun.reflect.NativeMethodAccessorImpl.invoke0(Native Method)
	at sun.reflect.NativeMethodAccessorImpl.invoke(NativeMethodAccessorImpl.java:57)
	at sun.reflect.DelegatingMethodAccessorImpl.invoke(DelegatingMethodAccessorImpl.java:43)
	at java.lang.reflect.Method.invoke(Method.java:606)
	at org.junit.runners.model.FrameworkMethod$1.runReflectiveCall(FrameworkMethod.java:47)
	at org.junit.internal.runners.model.ReflectiveCallable.run(ReflectiveCallable.java:12)
	at org.junit.runners.model.FrameworkMethod.invokeExplosively(FrameworkMethod.java:44)
	at org.junit.internal.runners.statements.InvokeMethod.evaluate(InvokeMethod.java:17)
	at org.junit.internal.runners.statements.RunBefores.evaluate(RunBefores.java:26)
	at org.junit.internal.runners.statements.RunAfters.evaluate(RunAfters.java:27)
	at org.junit.runners.ParentRunner.runLeaf(ParentRunner.java:271)
	at org.junit.runners.BlockJUnit4ClassRunner.runChild(BlockJUnit4ClassRunner.java:70)
	at org.junit.runners.BlockJUnit4ClassRunner.runChild(BlockJUnit4ClassRunner.java:50)
	at org.junit.runners.ParentRunner$3.run(ParentRunner.java:238)
	at org.junit.runners.ParentRunner$1.schedule(ParentRunner.java:63)
	at org.junit.runners.ParentRunner.runChildren(ParentRunner.java:236)
	at org.junit.runners.ParentRunner.access$000(ParentRunner.java:53)
	at org.junit.runners.ParentRunner$2.evaluate(ParentRunner.java:229)
	at org.junit.runners.ParentRunner.run(ParentRunner.java:309)
	at org.apache.maven.surefire.junit4.JUnit4Provider.execute(JUnit4Provider.java:264)
	at org.apache.maven.surefire.junit4.JUnit4Provider.executeTestSet(JUnit4Provider.java:153)
	at org.apache.maven.surefire.junit4.JUnit4Provider.invoke(JUnit4Provider.java:124)
	at org.apache.maven.surefire.booter.ForkedBooter.invokeProviderInSameClassLoader(ForkedBooter.java:200)
	at org.apache.maven.surefire.booter.ForkedBooter.runSuitesInProcess(ForkedBooter.java:153)
	at org.apache.maven.surefire.booter.ForkedBooter.main(ForkedBooter.java:103)


REGRESSION:  org.apache.hadoop.yarn.server.resourcemanager.security.TestClientToAMTokens.testClientToAMTokens[0]

Error Message:
org.apache.hadoop.yarn.server.utils.BuilderUtils.newApplicationReport(Lorg/apache/hadoop/yarn/api/records/ApplicationId;Lorg/apache/hadoop/yarn/api/records/ApplicationAttemptId;Ljava/lang/String;Ljava/lang/String;Ljava/lang/String;Ljava/lang/String;ILorg/apache/hadoop/yarn/api/records/Token;Lorg/apache/hadoop/yarn/api/records/YarnApplicationState;Ljava/lang/String;Ljava/lang/String;JJLorg/apache/hadoop/yarn/api/records/FinalApplicationStatus;Lorg/apache/hadoop/yarn/api/records/ApplicationResourceUsageReport;Ljava/lang/String;FLjava/lang/String;Lorg/apache/hadoop/yarn/api/records/Token;Ljava/util/Set;Z)Lorg/apache/hadoop/yarn/api/records/ApplicationReport;

Stack Trace:
java.lang.NoSuchMethodError: org.apache.hadoop.yarn.server.utils.BuilderUtils.newApplicationReport(Lorg/apache/hadoop/yarn/api/records/ApplicationId;Lorg/apache/hadoop/yarn/api/records/ApplicationAttemptId;Ljava/lang/String;Ljava/lang/String;Ljava/lang/String;Ljava/lang/String;ILorg/apache/hadoop/yarn/api/records/Token;Lorg/apache/hadoop/yarn/api/records/YarnApplicationState;Ljava/lang/String;Ljava/lang/String;JJLorg/apache/hadoop/yarn/api/records/FinalApplicationStatus;Lorg/apache/hadoop/yarn/api/records/ApplicationResourceUsageReport;Ljava/lang/String;FLjava/lang/String;Lorg/apache/hadoop/yarn/api/records/Token;Ljava/util/Set;Z)Lorg/apache/hadoop/yarn/api/records/ApplicationReport;
	at org.apache.hadoop.yarn.server.resourcemanager.rmapp.RMAppImpl.createAndGetApplicationReport(RMAppImpl.java:660)
	at org.apache.hadoop.yarn.server.resourcemanager.ClientRMService.getApplicationReport(ClientRMService.java:334)
	at org.apache.hadoop.yarn.server.resourcemanager.security.TestClientToAMTokens.testClientToAMTokens(TestClientToAMTokens.java:247)


REGRESSION:  org.apache.hadoop.yarn.server.resourcemanager.security.TestClientToAMTokens.testClientTokenRace[0]

Error Message:
java.net.BindException: Problem binding to [0.0.0.0:8032] java.net.BindException: Address already in use; For more details see:  http://wiki.apache.org/hadoop/BindException

Stack Trace:
org.apache.hadoop.yarn.exceptions.YarnRuntimeException: java.net.BindException: Problem binding to [0.0.0.0:8032] java.net.BindException: Address already in use; For more details see:  http://wiki.apache.org/hadoop/BindException
	at sun.nio.ch.Net.bind0(Native Method)
	at sun.nio.ch.Net.bind(Net.java:444)
	at sun.nio.ch.Net.bind(Net.java:436)
	at sun.nio.ch.ServerSocketChannelImpl.bind(ServerSocketChannelImpl.java:214)
	at sun.nio.ch.ServerSocketAdaptor.bind(ServerSocketAdaptor.java:74)
	at org.apache.hadoop.ipc.Server.bind(Server.java:413)
	at org.apache.hadoop.ipc.Server$Listener.<init>(Server.java:590)
	at org.apache.hadoop.ipc.Server.<init>(Server.java:2337)
	at org.apache.hadoop.ipc.RPC$Server.<init>(RPC.java:945)
	at org.apache.hadoop.ipc.ProtobufRpcEngine$Server.<init>(ProtobufRpcEngine.java:534)
	at org.apache.hadoop.ipc.ProtobufRpcEngine.getServer(ProtobufRpcEngine.java:509)
	at org.apache.hadoop.ipc.RPC$Builder.build(RPC.java:787)
	at org.apache.hadoop.yarn.factories.impl.pb.RpcServerFactoryPBImpl.createServer(RpcServerFactoryPBImpl.java:169)
	at org.apache.hadoop.yarn.factories.impl.pb.RpcServerFactoryPBImpl.getServer(RpcServerFactoryPBImpl.java:132)
	at org.apache.hadoop.yarn.ipc.HadoopYarnProtoRPC.getServer(HadoopYarnProtoRPC.java:65)
	at org.apache.hadoop.yarn.ipc.YarnRPC.getServer(YarnRPC.java:54)
	at org.apache.hadoop.yarn.server.resourcemanager.ClientRMService.serviceStart(ClientRMService.java:219)
	at org.apache.hadoop.service.AbstractService.start(AbstractService.java:193)
	at org.apache.hadoop.service.CompositeService.serviceStart(CompositeService.java:120)
	at org.apache.hadoop.yarn.server.resourcemanager.ResourceManager$RMActiveServices.serviceStart(ResourceManager.java:588)
	at org.apache.hadoop.service.AbstractService.start(AbstractService.java:193)
	at org.apache.hadoop.yarn.server.resourcemanager.ResourceManager.startActiveServices(ResourceManager.java:998)
	at org.apache.hadoop.yarn.server.resourcemanager.ResourceManager$1.run(ResourceManager.java:1039)
	at org.apache.hadoop.yarn.server.resourcemanager.ResourceManager$1.run(ResourceManager.java:1035)
	at java.security.AccessController.doPrivileged(Native Method)
	at javax.security.auth.Subject.doAs(Subject.java:415)
	at org.apache.hadoop.security.UserGroupInformation.doAs(UserGroupInformation.java:1666)
	at org.apache.hadoop.yarn.server.resourcemanager.ResourceManager.transitionToActive(ResourceManager.java:1035)
	at org.apache.hadoop.yarn.server.resourcemanager.ResourceManager.serviceStart(ResourceManager.java:1075)
	at org.apache.hadoop.service.AbstractService.start(AbstractService.java:193)
	at org.apache.hadoop.yarn.server.resourcemanager.security.TestClientToAMTokens.testClientTokenRace(TestClientToAMTokens.java:449)


REGRESSION:  org.apache.hadoop.yarn.server.resourcemanager.security.TestClientToAMTokens.testClientToAMTokens[1]

Error Message:
org.apache.hadoop.yarn.server.resourcemanager.scheduler.capacity.CSQueueMetrics cannot be cast to org.apache.hadoop.yarn.server.resourcemanager.scheduler.fair.FSQueueMetrics

Stack Trace:
java.lang.ClassCastException: org.apache.hadoop.yarn.server.resourcemanager.scheduler.capacity.CSQueueMetrics cannot be cast to org.apache.hadoop.yarn.server.resourcemanager.scheduler.fair.FSQueueMetrics
	at org.apache.hadoop.yarn.server.resourcemanager.scheduler.fair.FSQueueMetrics.forQueue(FSQueueMetrics.java:118)
	at org.apache.hadoop.yarn.server.resourcemanager.scheduler.fair.FairScheduler.initScheduler(FairScheduler.java:1337)
	at org.apache.hadoop.yarn.server.resourcemanager.scheduler.fair.FairScheduler.serviceInit(FairScheduler.java:1390)
	at org.apache.hadoop.service.AbstractService.init(AbstractService.java:163)
	at org.apache.hadoop.service.CompositeService.serviceInit(CompositeService.java:107)
	at org.apache.hadoop.yarn.server.resourcemanager.ResourceManager$RMActiveServices.serviceInit(ResourceManager.java:560)
	at org.apache.hadoop.service.AbstractService.init(AbstractService.java:163)
	at org.apache.hadoop.yarn.server.resourcemanager.ResourceManager.createAndInitActiveServices(ResourceManager.java:988)
	at org.apache.hadoop.yarn.server.resourcemanager.ResourceManager.serviceInit(ResourceManager.java:255)
	at org.apache.hadoop.service.AbstractService.init(AbstractService.java:163)
	at org.apache.hadoop.yarn.server.resourcemanager.MockRM.<init>(MockRM.java:112)
	at org.apache.hadoop.yarn.server.resourcemanager.MockRM.<init>(MockRM.java:107)
	at org.apache.hadoop.yarn.server.resourcemanager.MockRMWithCustomAMLauncher.<init>(MockRMWithCustomAMLauncher.java:45)
	at org.apache.hadoop.yarn.server.resourcemanager.security.TestClientToAMTokens$1.<init>(TestClientToAMTokens.java:192)
	at org.apache.hadoop.yarn.server.resourcemanager.security.TestClientToAMTokens.testClientToAMTokens(TestClientToAMTokens.java:192)


REGRESSION:  org.apache.hadoop.yarn.server.resourcemanager.security.TestClientToAMTokens.testClientTokenRace[1]

Error Message:
org.apache.hadoop.yarn.server.resourcemanager.scheduler.capacity.CSQueueMetrics cannot be cast to org.apache.hadoop.yarn.server.resourcemanager.scheduler.fair.FSQueueMetrics

Stack Trace:
java.lang.ClassCastException: org.apache.hadoop.yarn.server.resourcemanager.scheduler.capacity.CSQueueMetrics cannot be cast to org.apache.hadoop.yarn.server.resourcemanager.scheduler.fair.FSQueueMetrics
	at org.apache.hadoop.yarn.server.resourcemanager.scheduler.fair.FSQueueMetrics.forQueue(FSQueueMetrics.java:118)
	at org.apache.hadoop.yarn.server.resourcemanager.scheduler.fair.FairScheduler.initScheduler(FairScheduler.java:1337)
	at org.apache.hadoop.yarn.server.resourcemanager.scheduler.fair.FairScheduler.serviceInit(FairScheduler.java:1390)
	at org.apache.hadoop.service.AbstractService.init(AbstractService.java:163)
	at org.apache.hadoop.service.CompositeService.serviceInit(CompositeService.java:107)
	at org.apache.hadoop.yarn.server.resourcemanager.ResourceManager$RMActiveServices.serviceInit(ResourceManager.java:560)
	at org.apache.hadoop.service.AbstractService.init(AbstractService.java:163)
	at org.apache.hadoop.yarn.server.resourcemanager.ResourceManager.createAndInitActiveServices(ResourceManager.java:988)
	at org.apache.hadoop.yarn.server.resourcemanager.ResourceManager.serviceInit(ResourceManager.java:255)
	at org.apache.hadoop.service.AbstractService.init(AbstractService.java:163)
	at org.apache.hadoop.yarn.server.resourcemanager.MockRM.<init>(MockRM.java:112)
	at org.apache.hadoop.yarn.server.resourcemanager.MockRM.<init>(MockRM.java:107)
	at org.apache.hadoop.yarn.server.resourcemanager.MockRMWithCustomAMLauncher.<init>(MockRMWithCustomAMLauncher.java:45)
	at org.apache.hadoop.yarn.server.resourcemanager.security.TestClientToAMTokens$6.<init>(TestClientToAMTokens.java:433)
	at org.apache.hadoop.yarn.server.resourcemanager.security.TestClientToAMTokens.testClientTokenRace(TestClientToAMTokens.java:433)


REGRESSION:  org.apache.hadoop.yarn.server.resourcemanager.webapp.TestAppPage.testAppBlockRenderWithNullCurrentAppAttempt

Error Message:
org/apache/hadoop/yarn/server/security/BaseContainerTokenSecretManager

Stack Trace:
java.lang.NoClassDefFoundError: org/apache/hadoop/yarn/server/security/BaseContainerTokenSecretManager
	at java.net.URLClassLoader$1.run(URLClassLoader.java:366)
	at java.net.URLClassLoader$1.run(URLClassLoader.java:355)
	at java.security.AccessController.doPrivileged(Native Method)
	at java.net.URLClassLoader.findClass(URLClassLoader.java:354)
	at java.lang.ClassLoader.loadClass(ClassLoader.java:425)
	at sun.misc.Launcher$AppClassLoader.loadClass(Launcher.java:308)
	at java.lang.ClassLoader.loadClass(ClassLoader.java:358)
	at java.lang.ClassLoader.defineClass1(Native Method)
	at java.lang.ClassLoader.defineClass(ClassLoader.java:800)
	at java.security.SecureClassLoader.defineClass(SecureClassLoader.java:142)
	at java.net.URLClassLoader.defineClass(URLClassLoader.java:449)
	at java.net.URLClassLoader.access$100(URLClassLoader.java:71)
	at java.net.URLClassLoader$1.run(URLClassLoader.java:361)
	at java.net.URLClassLoader$1.run(URLClassLoader.java:355)
	at java.security.AccessController.doPrivileged(Native Method)
	at java.net.URLClassLoader.findClass(URLClassLoader.java:354)
	at java.lang.ClassLoader.loadClass(ClassLoader.java:425)
	at sun.misc.Launcher$AppClassLoader.loadClass(Launcher.java:308)
	at java.lang.ClassLoader.loadClass(ClassLoader.java:358)
	at java.lang.Class.getDeclaredMethods0(Native Method)
	at java.lang.Class.privateGetDeclaredMethods(Class.java:2531)
	at java.lang.Class.getDeclaredMethods(Class.java:1855)
	at com.google.inject.spi.InjectionPoint.getInjectionPoints(InjectionPoint.java:662)
	at com.google.inject.spi.InjectionPoint.forInstanceMethodsAndFields(InjectionPoint.java:356)
	at com.google.inject.spi.InjectionPoint.forInstanceMethodsAndFields(InjectionPoint.java:375)
	at com.google.inject.internal.BindingBuilder.toInstance(BindingBuilder.java:82)
	at org.apache.hadoop.yarn.webapp.test.WebAppTests$1.configure(WebAppTests.java:67)
	at com.google.inject.AbstractModule.configure(AbstractModule.java:59)
	at com.google.inject.spi.Elements$RecordingBinder.install(Elements.java:223)
	at com.google.inject.spi.Elements.getElements(Elements.java:101)
	at com.google.inject.internal.InjectorShell$Builder.build(InjectorShell.java:133)
	at com.google.inject.internal.InternalInjectorCreator.build(InternalInjectorCreator.java:103)
	at com.google.inject.Guice.createInjector(Guice.java:95)
	at com.google.inject.Guice.createInjector(Guice.java:72)
	at com.google.inject.Guice.createInjector(Guice.java:62)
	at org.apache.hadoop.yarn.webapp.test.WebAppTests.createMockInjector(WebAppTests.java:59)
	at org.apache.hadoop.yarn.server.resourcemanager.webapp.TestAppPage.testAppBlockRenderWithNullCurrentAppAttempt(TestAppPage.java:74)


REGRESSION:  org.apache.hadoop.yarn.server.resourcemanager.webapp.TestRMWebServicesApps.testAppsQueryFinishEnd

Error Message:
expected:<application/json> but was:<text/html; charset=ISO-8859-1>

Stack Trace:
java.lang.AssertionError: expected:<application/json> but was:<text/html; charset=ISO-8859-1>
	at org.junit.Assert.fail(Assert.java:88)
	at org.junit.Assert.failNotEquals(Assert.java:743)
	at org.junit.Assert.assertEquals(Assert.java:118)
	at org.junit.Assert.assertEquals(Assert.java:144)
	at org.apache.hadoop.yarn.server.resourcemanager.webapp.TestRMWebServicesApps.testAppsQueryFinishEnd(TestRMWebServicesApps.java:747)


REGRESSION:  org.apache.hadoop.yarn.server.resourcemanager.webapp.TestRMWebServicesApps.testAppsQueryLimit

Error Message:
Guice creation errors:

1) An exception was caught and reported. Message: java.util.zip.ZipException: invalid stored block lengths
  at com.google.inject.internal.InjectorShell$Builder.build(InjectorShell.java:133)

1 error

Stack Trace:
com.google.inject.CreationException: Guice creation errors:

1) An exception was caught and reported. Message: java.util.zip.ZipException: invalid stored block lengths
  at com.google.inject.internal.InjectorShell$Builder.build(InjectorShell.java:133)

1 error
	at java.util.zip.InflaterInputStream.read(InflaterInputStream.java:164)
	at java.util.zip.InflaterInputStream.read(InflaterInputStream.java:122)
	at java.io.FilterInputStream.read(FilterInputStream.java:83)
	at org.apache.xerces.impl.XMLEntityManager$RewindableInputStream.read(Unknown Source)
	at org.apache.xerces.impl.XMLEntityManager.setupCurrentEntity(Unknown Source)
	at org.apache.xerces.impl.XMLVersionDetector.determineDocVersion(Unknown Source)
	at org.apache.xerces.parsers.XML11Configuration.parse(Unknown Source)
	at org.apache.xerces.parsers.XML11Configuration.parse(Unknown Source)
	at org.apache.xerces.parsers.XMLParser.parse(Unknown Source)
	at org.apache.xerces.parsers.DOMParser.parse(Unknown Source)
	at org.apache.xerces.jaxp.DocumentBuilderImpl.parse(Unknown Source)
	at javax.xml.parsers.DocumentBuilder.parse(DocumentBuilder.java:150)
	at org.apache.hadoop.conf.Configuration.parse(Configuration.java:2546)
	at org.apache.hadoop.conf.Configuration.parse(Configuration.java:2534)
	at org.apache.hadoop.conf.Configuration.loadResource(Configuration.java:2605)
	at org.apache.hadoop.conf.Configuration.loadResources(Configuration.java:2558)
	at org.apache.hadoop.conf.Configuration.getProps(Configuration.java:2469)
	at org.apache.hadoop.conf.Configuration.set(Configuration.java:1205)
	at org.apache.hadoop.conf.Configuration.set(Configuration.java:1177)
	at org.apache.hadoop.conf.Configuration.setInt(Configuration.java:1349)
	at org.apache.hadoop.yarn.server.resourcemanager.webapp.TestRMWebServicesApps$1.configureServlets(TestRMWebServicesApps.java:86)
	at com.google.inject.servlet.ServletModule.configure(ServletModule.java:53)
	at com.google.inject.AbstractModule.configure(AbstractModule.java:59)
	at com.google.inject.spi.Elements$RecordingBinder.install(Elements.java:223)
	at com.google.inject.spi.Elements.getElements(Elements.java:101)
	at com.google.inject.internal.InjectorShell$Builder.build(InjectorShell.java:133)
	at com.google.inject.internal.InternalInjectorCreator.build(InternalInjectorCreator.java:103)
	at com.google.inject.Guice.createInjector(Guice.java:95)
	at com.google.inject.Guice.createInjector(Guice.java:72)
	at com.google.inject.Guice.createInjector(Guice.java:62)
	at org.apache.hadoop.yarn.server.resourcemanager.webapp.TestRMWebServicesApps.<init>(TestRMWebServicesApps.java:79)


REGRESSION:  org.apache.hadoop.yarn.server.resourcemanager.webapp.TestRMWebServicesApps.testAppsQueryQueue

Error Message:
java.net.BindException: Address already in use

Stack Trace:
com.sun.jersey.test.framework.spi.container.TestContainerException: java.net.BindException: Address already in use
	at sun.nio.ch.Net.bind0(Native Method)
	at sun.nio.ch.Net.bind(Net.java:444)
	at sun.nio.ch.Net.bind(Net.java:436)
	at sun.nio.ch.ServerSocketChannelImpl.bind(ServerSocketChannelImpl.java:214)
	at sun.nio.ch.ServerSocketAdaptor.bind(ServerSocketAdaptor.java:74)
	at org.glassfish.grizzly.nio.transport.TCPNIOTransport.bind(TCPNIOTransport.java:413)
	at org.glassfish.grizzly.nio.transport.TCPNIOTransport.bind(TCPNIOTransport.java:384)
	at org.glassfish.grizzly.nio.transport.TCPNIOTransport.bind(TCPNIOTransport.java:375)
	at org.glassfish.grizzly.http.server.NetworkListener.start(NetworkListener.java:549)
	at org.glassfish.grizzly.http.server.HttpServer.start(HttpServer.java:255)
	at com.sun.jersey.api.container.grizzly2.GrizzlyServerFactory.createHttpServer(GrizzlyServerFactory.java:326)
	at com.sun.jersey.api.container.grizzly2.GrizzlyServerFactory.createHttpServer(GrizzlyServerFactory.java:343)
	at com.sun.jersey.test.framework.spi.container.grizzly2.web.GrizzlyWebTestContainerFactory$GrizzlyWebTestContainer.instantiateGrizzlyWebServer(GrizzlyWebTestContainerFactory.java:219)
	at com.sun.jersey.test.framework.spi.container.grizzly2.web.GrizzlyWebTestContainerFactory$GrizzlyWebTestContainer.<init>(GrizzlyWebTestContainerFactory.java:129)
	at com.sun.jersey.test.framework.spi.container.grizzly2.web.GrizzlyWebTestContainerFactory$GrizzlyWebTestContainer.<init>(GrizzlyWebTestContainerFactory.java:86)
	at com.sun.jersey.test.framework.spi.container.grizzly2.web.GrizzlyWebTestContainerFactory.create(GrizzlyWebTestContainerFactory.java:79)
	at com.sun.jersey.test.framework.JerseyTest.getContainer(JerseyTest.java:342)
	at com.sun.jersey.test.framework.JerseyTest.<init>(JerseyTest.java:217)
	at org.apache.hadoop.yarn.webapp.JerseyTestBase.<init>(JerseyTestBase.java:27)
	at org.apache.hadoop.yarn.server.resourcemanager.webapp.TestRMWebServicesApps.<init>(TestRMWebServicesApps.java:111)


REGRESSION:  org.apache.hadoop.yarn.server.resourcemanager.webapp.TestRMWebServicesApps.testAppsQueryState

Error Message:
java.net.BindException: Address already in use

Stack Trace:
com.sun.jersey.test.framework.spi.container.TestContainerException: java.net.BindException: Address already in use
	at sun.nio.ch.Net.bind0(Native Method)
	at sun.nio.ch.Net.bind(Net.java:444)
	at sun.nio.ch.Net.bind(Net.java:436)
	at sun.nio.ch.ServerSocketChannelImpl.bind(ServerSocketChannelImpl.java:214)
	at sun.nio.ch.ServerSocketAdaptor.bind(ServerSocketAdaptor.java:74)
	at org.glassfish.grizzly.nio.transport.TCPNIOTransport.bind(TCPNIOTransport.java:413)
	at org.glassfish.grizzly.nio.transport.TCPNIOTransport.bind(TCPNIOTransport.java:384)
	at org.glassfish.grizzly.nio.transport.TCPNIOTransport.bind(TCPNIOTransport.java:375)
	at org.glassfish.grizzly.http.server.NetworkListener.start(NetworkListener.java:549)
	at org.glassfish.grizzly.http.server.HttpServer.start(HttpServer.java:255)
	at com.sun.jersey.api.container.grizzly2.GrizzlyServerFactory.createHttpServer(GrizzlyServerFactory.java:326)
	at com.sun.jersey.api.container.grizzly2.GrizzlyServerFactory.createHttpServer(GrizzlyServerFactory.java:343)
	at com.sun.jersey.test.framework.spi.container.grizzly2.web.GrizzlyWebTestContainerFactory$GrizzlyWebTestContainer.instantiateGrizzlyWebServer(GrizzlyWebTestContainerFactory.java:219)
	at com.sun.jersey.test.framework.spi.container.grizzly2.web.GrizzlyWebTestContainerFactory$GrizzlyWebTestContainer.<init>(GrizzlyWebTestContainerFactory.java:129)
	at com.sun.jersey.test.framework.spi.container.grizzly2.web.GrizzlyWebTestContainerFactory$GrizzlyWebTestContainer.<init>(GrizzlyWebTestContainerFactory.java:86)
	at com.sun.jersey.test.framework.spi.container.grizzly2.web.GrizzlyWebTestContainerFactory.create(GrizzlyWebTestContainerFactory.java:79)
	at com.sun.jersey.test.framework.JerseyTest.getContainer(JerseyTest.java:342)
	at com.sun.jersey.test.framework.JerseyTest.<init>(JerseyTest.java:217)
	at org.apache.hadoop.yarn.webapp.JerseyTestBase.<init>(JerseyTestBase.java:27)
	at org.apache.hadoop.yarn.server.resourcemanager.webapp.TestRMWebServicesApps.<init>(TestRMWebServicesApps.java:111)


REGRESSION:  org.apache.hadoop.yarn.server.resourcemanager.webapp.TestRMWebServicesApps.testSingleAppsDefault

Error Message:
java.net.BindException: Address already in use

Stack Trace:
com.sun.jersey.test.framework.spi.container.TestContainerException: java.net.BindException: Address already in use
	at sun.nio.ch.Net.bind0(Native Method)
	at sun.nio.ch.Net.bind(Net.java:444)
	at sun.nio.ch.Net.bind(Net.java:436)
	at sun.nio.ch.ServerSocketChannelImpl.bind(ServerSocketChannelImpl.java:214)
	at sun.nio.ch.ServerSocketAdaptor.bind(ServerSocketAdaptor.java:74)
	at org.glassfish.grizzly.nio.transport.TCPNIOTransport.bind(TCPNIOTransport.java:413)
	at org.glassfish.grizzly.nio.transport.TCPNIOTransport.bind(TCPNIOTransport.java:384)
	at org.glassfish.grizzly.nio.transport.TCPNIOTransport.bind(TCPNIOTransport.java:375)
	at org.glassfish.grizzly.http.server.NetworkListener.start(NetworkListener.java:549)
	at org.glassfish.grizzly.http.server.HttpServer.start(HttpServer.java:255)
	at com.sun.jersey.api.container.grizzly2.GrizzlyServerFactory.createHttpServer(GrizzlyServerFactory.java:326)
	at com.sun.jersey.api.container.grizzly2.GrizzlyServerFactory.createHttpServer(GrizzlyServerFactory.java:343)
	at com.sun.jersey.test.framework.spi.container.grizzly2.web.GrizzlyWebTestContainerFactory$GrizzlyWebTestContainer.instantiateGrizzlyWebServer(GrizzlyWebTestContainerFactory.java:219)
	at com.sun.jersey.test.framework.spi.container.grizzly2.web.GrizzlyWebTestContainerFactory$GrizzlyWebTestContainer.<init>(GrizzlyWebTestContainerFactory.java:129)
	at com.sun.jersey.test.framework.spi.container.grizzly2.web.GrizzlyWebTestContainerFactory$GrizzlyWebTestContainer.<init>(GrizzlyWebTestContainerFactory.java:86)
	at com.sun.jersey.test.framework.spi.container.grizzly2.web.GrizzlyWebTestContainerFactory.create(GrizzlyWebTestContainerFactory.java:79)
	at com.sun.jersey.test.framework.JerseyTest.getContainer(JerseyTest.java:342)
	at com.sun.jersey.test.framework.JerseyTest.<init>(JerseyTest.java:217)
	at org.apache.hadoop.yarn.webapp.JerseyTestBase.<init>(JerseyTestBase.java:27)
	at org.apache.hadoop.yarn.server.resourcemanager.webapp.TestRMWebServicesApps.<init>(TestRMWebServicesApps.java:111)


REGRESSION:  org.apache.hadoop.yarn.server.resourcemanager.webapp.TestRMWebServicesApps.testAppsQueryStateInvalid

Error Message:
java.net.BindException: Address already in use

Stack Trace:
com.sun.jersey.test.framework.spi.container.TestContainerException: java.net.BindException: Address already in use
	at sun.nio.ch.Net.bind0(Native Method)
	at sun.nio.ch.Net.bind(Net.java:444)
	at sun.nio.ch.Net.bind(Net.java:436)
	at sun.nio.ch.ServerSocketChannelImpl.bind(ServerSocketChannelImpl.java:214)
	at sun.nio.ch.ServerSocketAdaptor.bind(ServerSocketAdaptor.java:74)
	at org.glassfish.grizzly.nio.transport.TCPNIOTransport.bind(TCPNIOTransport.java:413)
	at org.glassfish.grizzly.nio.transport.TCPNIOTransport.bind(TCPNIOTransport.java:384)
	at org.glassfish.grizzly.nio.transport.TCPNIOTransport.bind(TCPNIOTransport.java:375)
	at org.glassfish.grizzly.http.server.NetworkListener.start(NetworkListener.java:549)
	at org.glassfish.grizzly.http.server.HttpServer.start(HttpServer.java:255)
	at com.sun.jersey.api.container.grizzly2.GrizzlyServerFactory.createHttpServer(GrizzlyServerFactory.java:326)
	at com.sun.jersey.api.container.grizzly2.GrizzlyServerFactory.createHttpServer(GrizzlyServerFactory.java:343)
	at com.sun.jersey.test.framework.spi.container.grizzly2.web.GrizzlyWebTestContainerFactory$GrizzlyWebTestContainer.instantiateGrizzlyWebServer(GrizzlyWebTestContainerFactory.java:219)
	at com.sun.jersey.test.framework.spi.container.grizzly2.web.GrizzlyWebTestContainerFactory$GrizzlyWebTestContainer.<init>(GrizzlyWebTestContainerFactory.java:129)
	at com.sun.jersey.test.framework.spi.container.grizzly2.web.GrizzlyWebTestContainerFactory$GrizzlyWebTestContainer.<init>(GrizzlyWebTestContainerFactory.java:86)
	at com.sun.jersey.test.framework.spi.container.grizzly2.web.GrizzlyWebTestContainerFactory.create(GrizzlyWebTestContainerFactory.java:79)
	at com.sun.jersey.test.framework.JerseyTest.getContainer(JerseyTest.java:342)
	at com.sun.jersey.test.framework.JerseyTest.<init>(JerseyTest.java:217)
	at org.apache.hadoop.yarn.webapp.JerseyTestBase.<init>(JerseyTestBase.java:27)
	at org.apache.hadoop.yarn.server.resourcemanager.webapp.TestRMWebServicesApps.<init>(TestRMWebServicesApps.java:111)


REGRESSION:  org.apache.hadoop.yarn.server.resourcemanager.webapp.TestRMWebServicesApps.testAppsQueryAppTypes

Error Message:
java.net.BindException: Address already in use

Stack Trace:
com.sun.jersey.test.framework.spi.container.TestContainerException: java.net.BindException: Address already in use
	at sun.nio.ch.Net.bind0(Native Method)
	at sun.nio.ch.Net.bind(Net.java:444)
	at sun.nio.ch.Net.bind(Net.java:436)
	at sun.nio.ch.ServerSocketChannelImpl.bind(ServerSocketChannelImpl.java:214)
	at sun.nio.ch.ServerSocketAdaptor.bind(ServerSocketAdaptor.java:74)
	at org.glassfish.grizzly.nio.transport.TCPNIOTransport.bind(TCPNIOTransport.java:413)
	at org.glassfish.grizzly.nio.transport.TCPNIOTransport.bind(TCPNIOTransport.java:384)
	at org.glassfish.grizzly.nio.transport.TCPNIOTransport.bind(TCPNIOTransport.java:375)
	at org.glassfish.grizzly.http.server.NetworkListener.start(NetworkListener.java:549)
	at org.glassfish.grizzly.http.server.HttpServer.start(HttpServer.java:255)
	at com.sun.jersey.api.container.grizzly2.GrizzlyServerFactory.createHttpServer(GrizzlyServerFactory.java:326)
	at com.sun.jersey.api.container.grizzly2.GrizzlyServerFactory.createHttpServer(GrizzlyServerFactory.java:343)
	at com.sun.jersey.test.framework.spi.container.grizzly2.web.GrizzlyWebTestContainerFactory$GrizzlyWebTestContainer.instantiateGrizzlyWebServer(GrizzlyWebTestContainerFactory.java:219)
	at com.sun.jersey.test.framework.spi.container.grizzly2.web.GrizzlyWebTestContainerFactory$GrizzlyWebTestContainer.<init>(GrizzlyWebTestContainerFactory.java:129)
	at com.sun.jersey.test.framework.spi.container.grizzly2.web.GrizzlyWebTestContainerFactory$GrizzlyWebTestContainer.<init>(GrizzlyWebTestContainerFactory.java:86)
	at com.sun.jersey.test.framework.spi.container.grizzly2.web.GrizzlyWebTestContainerFactory.create(GrizzlyWebTestContainerFactory.java:79)
	at com.sun.jersey.test.framework.JerseyTest.getContainer(JerseyTest.java:342)
	at com.sun.jersey.test.framework.JerseyTest.<init>(JerseyTest.java:217)
	at org.apache.hadoop.yarn.webapp.JerseyTestBase.<init>(JerseyTestBase.java:27)
	at org.apache.hadoop.yarn.server.resourcemanager.webapp.TestRMWebServicesApps.<init>(TestRMWebServicesApps.java:111)


REGRESSION:  org.apache.hadoop.yarn.server.resourcemanager.webapp.TestRMWebServicesApps.testAppsQueryFinalStatusInvalid

Error Message:
java.net.BindException: Address already in use

Stack Trace:
com.sun.jersey.test.framework.spi.container.TestContainerException: java.net.BindException: Address already in use
	at sun.nio.ch.Net.bind0(Native Method)
	at sun.nio.ch.Net.bind(Net.java:444)
	at sun.nio.ch.Net.bind(Net.java:436)
	at sun.nio.ch.ServerSocketChannelImpl.bind(ServerSocketChannelImpl.java:214)
	at sun.nio.ch.ServerSocketAdaptor.bind(ServerSocketAdaptor.java:74)
	at org.glassfish.grizzly.nio.transport.TCPNIOTransport.bind(TCPNIOTransport.java:413)
	at org.glassfish.grizzly.nio.transport.TCPNIOTransport.bind(TCPNIOTransport.java:384)
	at org.glassfish.grizzly.nio.transport.TCPNIOTransport.bind(TCPNIOTransport.java:375)
	at org.glassfish.grizzly.http.server.NetworkListener.start(NetworkListener.java:549)
	at org.glassfish.grizzly.http.server.HttpServer.start(HttpServer.java:255)
	at com.sun.jersey.api.container.grizzly2.GrizzlyServerFactory.createHttpServer(GrizzlyServerFactory.java:326)
	at com.sun.jersey.api.container.grizzly2.GrizzlyServerFactory.createHttpServer(GrizzlyServerFactory.java:343)
	at com.sun.jersey.test.framework.spi.container.grizzly2.web.GrizzlyWebTestContainerFactory$GrizzlyWebTestContainer.instantiateGrizzlyWebServer(GrizzlyWebTestContainerFactory.java:219)
	at com.sun.jersey.test.framework.spi.container.grizzly2.web.GrizzlyWebTestContainerFactory$GrizzlyWebTestContainer.<init>(GrizzlyWebTestContainerFactory.java:129)
	at com.sun.jersey.test.framework.spi.container.grizzly2.web.GrizzlyWebTestContainerFactory$GrizzlyWebTestContainer.<init>(GrizzlyWebTestContainerFactory.java:86)
	at com.sun.jersey.test.framework.spi.container.grizzly2.web.GrizzlyWebTestContainerFactory.create(GrizzlyWebTestContainerFactory.java:79)
	at com.sun.jersey.test.framework.JerseyTest.getContainer(JerseyTest.java:342)
	at com.sun.jersey.test.framework.JerseyTest.<init>(JerseyTest.java:217)
	at org.apache.hadoop.yarn.webapp.JerseyTestBase.<init>(JerseyTestBase.java:27)
	at org.apache.hadoop.yarn.server.resourcemanager.webapp.TestRMWebServicesApps.<init>(TestRMWebServicesApps.java:111)


REGRESSION:  org.apache.hadoop.yarn.server.resourcemanager.webapp.TestRMWebServicesApps.testInvalidApp

Error Message:
java.net.BindException: Address already in use

Stack Trace:
com.sun.jersey.test.framework.spi.container.TestContainerException: java.net.BindException: Address already in use
	at sun.nio.ch.Net.bind0(Native Method)
	at sun.nio.ch.Net.bind(Net.java:444)
	at sun.nio.ch.Net.bind(Net.java:436)
	at sun.nio.ch.ServerSocketChannelImpl.bind(ServerSocketChannelImpl.java:214)
	at sun.nio.ch.ServerSocketAdaptor.bind(ServerSocketAdaptor.java:74)
	at org.glassfish.grizzly.nio.transport.TCPNIOTransport.bind(TCPNIOTransport.java:413)
	at org.glassfish.grizzly.nio.transport.TCPNIOTransport.bind(TCPNIOTransport.java:384)
	at org.glassfish.grizzly.nio.transport.TCPNIOTransport.bind(TCPNIOTransport.java:375)
	at org.glassfish.grizzly.http.server.NetworkListener.start(NetworkListener.java:549)
	at org.glassfish.grizzly.http.server.HttpServer.start(HttpServer.java:255)
	at com.sun.jersey.api.container.grizzly2.GrizzlyServerFactory.createHttpServer(GrizzlyServerFactory.java:326)
	at com.sun.jersey.api.container.grizzly2.GrizzlyServerFactory.createHttpServer(GrizzlyServerFactory.java:343)
	at com.sun.jersey.test.framework.spi.container.grizzly2.web.GrizzlyWebTestContainerFactory$GrizzlyWebTestContainer.instantiateGrizzlyWebServer(GrizzlyWebTestContainerFactory.java:219)
	at com.sun.jersey.test.framework.spi.container.grizzly2.web.GrizzlyWebTestContainerFactory$GrizzlyWebTestContainer.<init>(GrizzlyWebTestContainerFactory.java:129)
	at com.sun.jersey.test.framework.spi.container.grizzly2.web.GrizzlyWebTestContainerFactory$GrizzlyWebTestContainer.<init>(GrizzlyWebTestContainerFactory.java:86)
	at com.sun.jersey.test.framework.spi.container.grizzly2.web.GrizzlyWebTestContainerFactory.create(GrizzlyWebTestContainerFactory.java:79)
	at com.sun.jersey.test.framework.JerseyTest.getContainer(JerseyTest.java:342)
	at com.sun.jersey.test.framework.JerseyTest.<init>(JerseyTest.java:217)
	at org.apache.hadoop.yarn.webapp.JerseyTestBase.<init>(JerseyTestBase.java:27)
	at org.apache.hadoop.yarn.server.resourcemanager.webapp.TestRMWebServicesApps.<init>(TestRMWebServicesApps.java:111)


REGRESSION:  org.apache.hadoop.yarn.server.resourcemanager.webapp.TestRMWebServicesApps.testAppsQueryStartEnd

Error Message:
java.net.BindException: Address already in use

Stack Trace:
com.sun.jersey.test.framework.spi.container.TestContainerException: java.net.BindException: Address already in use
	at sun.nio.ch.Net.bind0(Native Method)
	at sun.nio.ch.Net.bind(Net.java:444)
	at sun.nio.ch.Net.bind(Net.java:436)
	at sun.nio.ch.ServerSocketChannelImpl.bind(ServerSocketChannelImpl.java:214)
	at sun.nio.ch.ServerSocketAdaptor.bind(ServerSocketAdaptor.java:74)
	at org.glassfish.grizzly.nio.transport.TCPNIOTransport.bind(TCPNIOTransport.java:413)
	at org.glassfish.grizzly.nio.transport.TCPNIOTransport.bind(TCPNIOTransport.java:384)
	at org.glassfish.grizzly.nio.transport.TCPNIOTransport.bind(TCPNIOTransport.java:375)
	at org.glassfish.grizzly.http.server.NetworkListener.start(NetworkListener.java:549)
	at org.glassfish.grizzly.http.server.HttpServer.start(HttpServer.java:255)
	at com.sun.jersey.api.container.grizzly2.GrizzlyServerFactory.createHttpServer(GrizzlyServerFactory.java:326)
	at com.sun.jersey.api.container.grizzly2.GrizzlyServerFactory.createHttpServer(GrizzlyServerFactory.java:343)
	at com.sun.jersey.test.framework.spi.container.grizzly2.web.GrizzlyWebTestContainerFactory$GrizzlyWebTestContainer.instantiateGrizzlyWebServer(GrizzlyWebTestContainerFactory.java:219)
	at com.sun.jersey.test.framework.spi.container.grizzly2.web.GrizzlyWebTestContainerFactory$GrizzlyWebTestContainer.<init>(GrizzlyWebTestContainerFactory.java:129)
	at com.sun.jersey.test.framework.spi.container.grizzly2.web.GrizzlyWebTestContainerFactory$GrizzlyWebTestContainer.<init>(GrizzlyWebTestContainerFactory.java:86)
	at com.sun.jersey.test.framework.spi.container.grizzly2.web.GrizzlyWebTestContainerFactory.create(GrizzlyWebTestContainerFactory.java:79)
	at com.sun.jersey.test.framework.JerseyTest.getContainer(JerseyTest.java:342)
	at com.sun.jersey.test.framework.JerseyTest.<init>(JerseyTest.java:217)
	at org.apache.hadoop.yarn.webapp.JerseyTestBase.<init>(JerseyTestBase.java:27)
	at org.apache.hadoop.yarn.server.resourcemanager.webapp.TestRMWebServicesApps.<init>(TestRMWebServicesApps.java:111)


REGRESSION:  org.apache.hadoop.yarn.server.resourcemanager.webapp.TestRMWebServicesApps.testAppsDefault

Error Message:
java.net.BindException: Address already in use

Stack Trace:
com.sun.jersey.test.framework.spi.container.TestContainerException: java.net.BindException: Address already in use
	at sun.nio.ch.Net.bind0(Native Method)
	at sun.nio.ch.Net.bind(Net.java:444)
	at sun.nio.ch.Net.bind(Net.java:436)
	at sun.nio.ch.ServerSocketChannelImpl.bind(ServerSocketChannelImpl.java:214)
	at sun.nio.ch.ServerSocketAdaptor.bind(ServerSocketAdaptor.java:74)
	at org.glassfish.grizzly.nio.transport.TCPNIOTransport.bind(TCPNIOTransport.java:413)
	at org.glassfish.grizzly.nio.transport.TCPNIOTransport.bind(TCPNIOTransport.java:384)
	at org.glassfish.grizzly.nio.transport.TCPNIOTransport.bind(TCPNIOTransport.java:375)
	at org.glassfish.grizzly.http.server.NetworkListener.start(NetworkListener.java:549)
	at org.glassfish.grizzly.http.server.HttpServer.start(HttpServer.java:255)
	at com.sun.jersey.api.container.grizzly2.GrizzlyServerFactory.createHttpServer(GrizzlyServerFactory.java:326)
	at com.sun.jersey.api.container.grizzly2.GrizzlyServerFactory.createHttpServer(GrizzlyServerFactory.java:343)
	at com.sun.jersey.test.framework.spi.container.grizzly2.web.GrizzlyWebTestContainerFactory$GrizzlyWebTestContainer.instantiateGrizzlyWebServer(GrizzlyWebTestContainerFactory.java:219)
	at com.sun.jersey.test.framework.spi.container.grizzly2.web.GrizzlyWebTestContainerFactory$GrizzlyWebTestContainer.<init>(GrizzlyWebTestContainerFactory.java:129)
	at com.sun.jersey.test.framework.spi.container.grizzly2.web.GrizzlyWebTestContainerFactory$GrizzlyWebTestContainer.<init>(GrizzlyWebTestContainerFactory.java:86)
	at com.sun.jersey.test.framework.spi.container.grizzly2.web.GrizzlyWebTestContainerFactory.create(GrizzlyWebTestContainerFactory.java:79)
	at com.sun.jersey.test.framework.JerseyTest.getContainer(JerseyTest.java:342)
	at com.sun.jersey.test.framework.JerseyTest.<init>(JerseyTest.java:217)
	at org.apache.hadoop.yarn.webapp.JerseyTestBase.<init>(JerseyTestBase.java:27)
	at org.apache.hadoop.yarn.server.resourcemanager.webapp.TestRMWebServicesApps.<init>(TestRMWebServicesApps.java:111)


REGRESSION:  org.apache.hadoop.yarn.server.resourcemanager.webapp.TestRMWebServicesApps.testAppsQueryFinishBeginEnd

Error Message:
java.net.BindException: Address already in use

Stack Trace:
com.sun.jersey.test.framework.spi.container.TestContainerException: java.net.BindException: Address already in use
	at sun.nio.ch.Net.bind0(Native Method)
	at sun.nio.ch.Net.bind(Net.java:444)
	at sun.nio.ch.Net.bind(Net.java:436)
	at sun.nio.ch.ServerSocketChannelImpl.bind(ServerSocketChannelImpl.java:214)
	at sun.nio.ch.ServerSocketAdaptor.bind(ServerSocketAdaptor.java:74)
	at org.glassfish.grizzly.nio.transport.TCPNIOTransport.bind(TCPNIOTransport.java:413)
	at org.glassfish.grizzly.nio.transport.TCPNIOTransport.bind(TCPNIOTransport.java:384)
	at org.glassfish.grizzly.nio.transport.TCPNIOTransport.bind(TCPNIOTransport.java:375)
	at org.glassfish.grizzly.http.server.NetworkListener.start(NetworkListener.java:549)
	at org.glassfish.grizzly.http.server.HttpServer.start(HttpServer.java:255)
	at com.sun.jersey.api.container.grizzly2.GrizzlyServerFactory.createHttpServer(GrizzlyServerFactory.java:326)
	at com.sun.jersey.api.container.grizzly2.GrizzlyServerFactory.createHttpServer(GrizzlyServerFactory.java:343)
	at com.sun.jersey.test.framework.spi.container.grizzly2.web.GrizzlyWebTestContainerFactory$GrizzlyWebTestContainer.instantiateGrizzlyWebServer(GrizzlyWebTestContainerFactory.java:219)
	at com.sun.jersey.test.framework.spi.container.grizzly2.web.GrizzlyWebTestContainerFactory$GrizzlyWebTestContainer.<init>(GrizzlyWebTestContainerFactory.java:129)
	at com.sun.jersey.test.framework.spi.container.grizzly2.web.GrizzlyWebTestContainerFactory$GrizzlyWebTestContainer.<init>(GrizzlyWebTestContainerFactory.java:86)
	at com.sun.jersey.test.framework.spi.container.grizzly2.web.GrizzlyWebTestContainerFactory.create(GrizzlyWebTestContainerFactory.java:79)
	at com.sun.jersey.test.framework.JerseyTest.getContainer(JerseyTest.java:342)
	at com.sun.jersey.test.framework.JerseyTest.<init>(JerseyTest.java:217)
	at org.apache.hadoop.yarn.webapp.JerseyTestBase.<init>(JerseyTestBase.java:27)
	at org.apache.hadoop.yarn.server.resourcemanager.webapp.TestRMWebServicesApps.<init>(TestRMWebServicesApps.java:111)


REGRESSION:  org.apache.hadoop.yarn.server.resourcemanager.webapp.TestRMWebServicesFairScheduler.testClusterScheduler

Error Message:
org/apache/hadoop/yarn/security/ContainerTokenIdentifier

Stack Trace:
java.lang.NoClassDefFoundError: org/apache/hadoop/yarn/security/ContainerTokenIdentifier
	at java.net.URLClassLoader$1.run(URLClassLoader.java:366)
	at java.net.URLClassLoader$1.run(URLClassLoader.java:355)
	at java.security.AccessController.doPrivileged(Native Method)
	at java.net.URLClassLoader.findClass(URLClassLoader.java:354)
	at java.lang.ClassLoader.loadClass(ClassLoader.java:425)
	at sun.misc.Launcher$AppClassLoader.loadClass(Launcher.java:308)
	at java.lang.ClassLoader.loadClass(ClassLoader.java:358)
	at org.apache.hadoop.yarn.server.resourcemanager.RMSecretManagerService.createContainerTokenSecretManager(RMSecretManagerService.java:109)
	at org.apache.hadoop.yarn.server.resourcemanager.RMSecretManagerService.<init>(RMSecretManagerService.java:57)
	at org.apache.hadoop.yarn.server.resourcemanager.ResourceManager.createRMSecretManagerService(ResourceManager.java:1136)
	at org.apache.hadoop.yarn.server.resourcemanager.ResourceManager$RMActiveServices.serviceInit(ResourceManager.java:414)
	at org.apache.hadoop.service.AbstractService.init(AbstractService.java:163)
	at org.apache.hadoop.yarn.server.resourcemanager.ResourceManager.createAndInitActiveServices(ResourceManager.java:988)
	at org.apache.hadoop.yarn.server.resourcemanager.ResourceManager.serviceInit(ResourceManager.java:255)
	at org.apache.hadoop.service.AbstractService.init(AbstractService.java:163)
	at org.apache.hadoop.yarn.server.resourcemanager.MockRM.<init>(MockRM.java:112)
	at org.apache.hadoop.yarn.server.resourcemanager.MockRM.<init>(MockRM.java:107)
	at org.apache.hadoop.yarn.server.resourcemanager.webapp.TestRMWebServicesFairScheduler$1.configureServlets(TestRMWebServicesFairScheduler.java:58)
	at com.google.inject.servlet.ServletModule.configure(ServletModule.java:53)
	at com.google.inject.AbstractModule.configure(AbstractModule.java:59)
	at com.google.inject.spi.Elements$RecordingBinder.install(Elements.java:223)
	at com.google.inject.spi.Elements.getElements(Elements.java:101)
	at com.google.inject.internal.InjectorShell$Builder.build(InjectorShell.java:133)
	at com.google.inject.internal.InternalInjectorCreator.build(InternalInjectorCreator.java:103)
	at com.google.inject.Guice.createInjector(Guice.java:95)
	at com.google.inject.Guice.createInjector(Guice.java:72)
	at com.google.inject.Guice.createInjector(Guice.java:62)
	at org.apache.hadoop.yarn.server.resourcemanager.webapp.TestRMWebServicesFairScheduler.<init>(TestRMWebServicesFairScheduler.java:49)


REGRESSION:  org.apache.hadoop.yarn.server.resourcemanager.webapp.TestRMWebServicesFairScheduler.testClusterSchedulerSlash

Error Message:
java.net.BindException: Address already in use

Stack Trace:
com.sun.jersey.test.framework.spi.container.TestContainerException: java.net.BindException: Address already in use
	at sun.nio.ch.Net.bind0(Native Method)
	at sun.nio.ch.Net.bind(Net.java:444)
	at sun.nio.ch.Net.bind(Net.java:436)
	at sun.nio.ch.ServerSocketChannelImpl.bind(ServerSocketChannelImpl.java:214)
	at sun.nio.ch.ServerSocketAdaptor.bind(ServerSocketAdaptor.java:74)
	at org.glassfish.grizzly.nio.transport.TCPNIOTransport.bind(TCPNIOTransport.java:413)
	at org.glassfish.grizzly.nio.transport.TCPNIOTransport.bind(TCPNIOTransport.java:384)
	at org.glassfish.grizzly.nio.transport.TCPNIOTransport.bind(TCPNIOTransport.java:375)
	at org.glassfish.grizzly.http.server.NetworkListener.start(NetworkListener.java:549)
	at org.glassfish.grizzly.http.server.HttpServer.start(HttpServer.java:255)
	at com.sun.jersey.api.container.grizzly2.GrizzlyServerFactory.createHttpServer(GrizzlyServerFactory.java:326)
	at com.sun.jersey.api.container.grizzly2.GrizzlyServerFactory.createHttpServer(GrizzlyServerFactory.java:343)
	at com.sun.jersey.test.framework.spi.container.grizzly2.web.GrizzlyWebTestContainerFactory$GrizzlyWebTestContainer.instantiateGrizzlyWebServer(GrizzlyWebTestContainerFactory.java:219)
	at com.sun.jersey.test.framework.spi.container.grizzly2.web.GrizzlyWebTestContainerFactory$GrizzlyWebTestContainer.<init>(GrizzlyWebTestContainerFactory.java:129)
	at com.sun.jersey.test.framework.spi.container.grizzly2.web.GrizzlyWebTestContainerFactory$GrizzlyWebTestContainer.<init>(GrizzlyWebTestContainerFactory.java:86)
	at com.sun.jersey.test.framework.spi.container.grizzly2.web.GrizzlyWebTestContainerFactory.create(GrizzlyWebTestContainerFactory.java:79)
	at com.sun.jersey.test.framework.JerseyTest.getContainer(JerseyTest.java:342)
	at com.sun.jersey.test.framework.JerseyTest.<init>(JerseyTest.java:217)
	at org.apache.hadoop.yarn.webapp.JerseyTestBase.<init>(JerseyTestBase.java:27)
	at org.apache.hadoop.yarn.server.resourcemanager.webapp.TestRMWebServicesFairScheduler.<init>(TestRMWebServicesFairScheduler.java:73)


FAILED:  org.apache.hadoop.yarn.server.resourcemanager.webapp.TestRMWebServicesHttpStaticUserPermissions.org.apache.hadoop.yarn.server.resourcemanager.webapp.TestRMWebServicesHttpStaticUserPermissions

Error Message:
org/apache/hadoop/yarn/server/applicationhistoryservice/ApplicationHistoryWriter

Stack Trace:
java.lang.NoClassDefFoundError: org/apache/hadoop/yarn/server/applicationhistoryservice/ApplicationHistoryWriter
	at java.net.URLClassLoader$1.run(URLClassLoader.java:366)
	at java.net.URLClassLoader$1.run(URLClassLoader.java:355)
	at java.security.AccessController.doPrivileged(Native Method)
	at java.net.URLClassLoader.findClass(URLClassLoader.java:354)
	at java.lang.ClassLoader.loadClass(ClassLoader.java:425)
	at sun.misc.Launcher$AppClassLoader.loadClass(Launcher.java:308)
	at java.lang.ClassLoader.loadClass(ClassLoader.java:358)
	at org.apache.hadoop.yarn.server.resourcemanager.ResourceManager.createRMApplicationHistoryWriter(ResourceManager.java:354)
	at org.apache.hadoop.yarn.server.resourcemanager.ResourceManager$RMActiveServices.serviceInit(ResourceManager.java:470)
	at org.apache.hadoop.service.AbstractService.init(AbstractService.java:163)
	at org.apache.hadoop.yarn.server.resourcemanager.ResourceManager.createAndInitActiveServices(ResourceManager.java:988)
	at org.apache.hadoop.yarn.server.resourcemanager.ResourceManager.serviceInit(ResourceManager.java:255)
	at org.apache.hadoop.service.AbstractService.init(AbstractService.java:163)
	at org.apache.hadoop.yarn.server.resourcemanager.MockRM.<init>(MockRM.java:112)
	at org.apache.hadoop.yarn.server.resourcemanager.MockRM.<init>(MockRM.java:107)
	at org.apache.hadoop.yarn.server.resourcemanager.webapp.TestRMWebServicesHttpStaticUserPermissions.setupAndStartRM(TestRMWebServicesHttpStaticUserPermissions.java:112)
	at org.apache.hadoop.yarn.server.resourcemanager.webapp.TestRMWebServicesHttpStaticUserPermissions.setUp(TestRMWebServicesHttpStaticUserPermissions.java:78)


REGRESSION:  org.apache.hadoop.yarn.server.resourcemanager.webapp.TestRMWebappAuthentication.testSimpleAuth[0]

Error Message:
org/apache/hadoop/yarn/api/ApplicationClientProtocol

Stack Trace:
java.lang.NoClassDefFoundError: org/apache/hadoop/yarn/api/ApplicationClientProtocol
	at java.net.URLClassLoader$1.run(URLClassLoader.java:366)
	at java.net.URLClassLoader$1.run(URLClassLoader.java:355)
	at java.security.AccessController.doPrivileged(Native Method)
	at java.net.URLClassLoader.findClass(URLClassLoader.java:354)
	at java.lang.ClassLoader.loadClass(ClassLoader.java:425)
	at sun.misc.Launcher$AppClassLoader.loadClass(Launcher.java:308)
	at java.lang.ClassLoader.loadClass(ClassLoader.java:358)
	at org.apache.hadoop.yarn.server.resourcemanager.webapp.TestRMWebappAuthentication.setupAndStartRM(TestRMWebappAuthentication.java:138)
	at org.apache.hadoop.yarn.server.resourcemanager.webapp.TestRMWebappAuthentication.<init>(TestRMWebappAuthentication.java:103)


REGRESSION:  org.apache.hadoop.yarn.server.resourcemanager.webapp.TestRMWebappAuthentication.testSimpleAuth[1]

Error Message:
org/apache/hadoop/yarn/api/ApplicationClientProtocol

Stack Trace:
java.lang.NoClassDefFoundError: org/apache/hadoop/yarn/api/ApplicationClientProtocol
	at java.net.URLClassLoader$1.run(URLClassLoader.java:366)
	at java.net.URLClassLoader$1.run(URLClassLoader.java:355)
	at java.security.AccessController.doPrivileged(Native Method)
	at java.net.URLClassLoader.findClass(URLClassLoader.java:354)
	at java.lang.ClassLoader.loadClass(ClassLoader.java:425)
	at sun.misc.Launcher$AppClassLoader.loadClass(Launcher.java:308)
	at java.lang.ClassLoader.loadClass(ClassLoader.java:358)
	at org.apache.hadoop.yarn.server.resourcemanager.webapp.TestRMWebappAuthentication.setupAndStartRM(TestRMWebappAuthentication.java:138)
	at org.apache.hadoop.yarn.server.resourcemanager.webapp.TestRMWebappAuthentication.<init>(TestRMWebappAuthentication.java:103)