You are viewing a plain text version of this content. The canonical link for it is here.
Posted to dev@lucene.apache.org by Policeman Jenkins Server <je...@thetaphi.de> on 2016/02/20 23:40:11 UTC

[JENKINS] Lucene-Solr-5.x-Linux (64bit/jdk1.7.0_80) - Build # 15628 - Failure!

Build: http://jenkins.thetaphi.de/job/Lucene-Solr-5.x-Linux/15628/
Java: 64bit/jdk1.7.0_80 -XX:-UseCompressedOops -XX:+UseParallelGC

2 tests failed.
FAILED:  junit.framework.TestSuite.org.apache.solr.cloud.HttpPartitionTest

Error Message:
ObjectTracker found 1 object(s) that were not released!!! [RawDirectoryWrapper]

Stack Trace:
java.lang.AssertionError: ObjectTracker found 1 object(s) that were not released!!! [RawDirectoryWrapper]
	at __randomizedtesting.SeedInfo.seed([E8435E692B7981E0]:0)
	at org.junit.Assert.fail(Assert.java:93)
	at org.junit.Assert.assertTrue(Assert.java:43)
	at org.junit.Assert.assertNull(Assert.java:551)
	at org.apache.solr.SolrTestCaseJ4.afterClass(SolrTestCaseJ4.java:228)
	at sun.reflect.GeneratedMethodAccessor18.invoke(Unknown Source)
	at sun.reflect.DelegatingMethodAccessorImpl.invoke(DelegatingMethodAccessorImpl.java:43)
	at java.lang.reflect.Method.invoke(Method.java:606)
	at com.carrotsearch.randomizedtesting.RandomizedRunner.invoke(RandomizedRunner.java:1764)
	at com.carrotsearch.randomizedtesting.RandomizedRunner$7.evaluate(RandomizedRunner.java:834)
	at com.carrotsearch.randomizedtesting.rules.StatementAdapter.evaluate(StatementAdapter.java:36)
	at com.carrotsearch.randomizedtesting.rules.SystemPropertiesRestoreRule$1.evaluate(SystemPropertiesRestoreRule.java:57)
	at org.apache.lucene.util.AbstractBeforeAfterRule$1.evaluate(AbstractBeforeAfterRule.java:45)
	at com.carrotsearch.randomizedtesting.rules.StatementAdapter.evaluate(StatementAdapter.java:36)
	at org.apache.lucene.util.TestRuleStoreClassName$1.evaluate(TestRuleStoreClassName.java:41)
	at com.carrotsearch.randomizedtesting.rules.NoShadowingOrOverridesOnMethodsRule$1.evaluate(NoShadowingOrOverridesOnMethodsRule.java:40)
	at com.carrotsearch.randomizedtesting.rules.NoShadowingOrOverridesOnMethodsRule$1.evaluate(NoShadowingOrOverridesOnMethodsRule.java:40)
	at com.carrotsearch.randomizedtesting.rules.StatementAdapter.evaluate(StatementAdapter.java:36)
	at com.carrotsearch.randomizedtesting.rules.StatementAdapter.evaluate(StatementAdapter.java:36)
	at com.carrotsearch.randomizedtesting.rules.StatementAdapter.evaluate(StatementAdapter.java:36)
	at org.apache.lucene.util.TestRuleAssertionsRequired$1.evaluate(TestRuleAssertionsRequired.java:53)
	at org.apache.lucene.util.TestRuleMarkFailure$1.evaluate(TestRuleMarkFailure.java:47)
	at org.apache.lucene.util.TestRuleIgnoreAfterMaxFailures$1.evaluate(TestRuleIgnoreAfterMaxFailures.java:64)
	at org.apache.lucene.util.TestRuleIgnoreTestSuites$1.evaluate(TestRuleIgnoreTestSuites.java:54)
	at com.carrotsearch.randomizedtesting.rules.StatementAdapter.evaluate(StatementAdapter.java:36)
	at com.carrotsearch.randomizedtesting.ThreadLeakControl$StatementRunner.run(ThreadLeakControl.java:367)
	at java.lang.Thread.run(Thread.java:745)


FAILED:  org.apache.solr.search.mlt.SimpleMLTQParserTest.doTest

Error Message:
Exception during query

Stack Trace:
java.lang.RuntimeException: Exception during query
	at __randomizedtesting.SeedInfo.seed([E8435E692B7981E0:4F07E6CD46C29259]:0)
	at org.apache.solr.SolrTestCaseJ4.assertQ(SolrTestCaseJ4.java:754)
	at org.apache.solr.SolrTestCaseJ4.assertQ(SolrTestCaseJ4.java:721)
	at org.apache.solr.search.mlt.SimpleMLTQParserTest.doTest(SimpleMLTQParserTest.java:86)
	at sun.reflect.NativeMethodAccessorImpl.invoke0(Native Method)
	at sun.reflect.NativeMethodAccessorImpl.invoke(NativeMethodAccessorImpl.java:57)
	at sun.reflect.DelegatingMethodAccessorImpl.invoke(DelegatingMethodAccessorImpl.java:43)
	at java.lang.reflect.Method.invoke(Method.java:606)
	at com.carrotsearch.randomizedtesting.RandomizedRunner.invoke(RandomizedRunner.java:1764)
	at com.carrotsearch.randomizedtesting.RandomizedRunner$8.evaluate(RandomizedRunner.java:871)
	at com.carrotsearch.randomizedtesting.RandomizedRunner$9.evaluate(RandomizedRunner.java:907)
	at com.carrotsearch.randomizedtesting.RandomizedRunner$10.evaluate(RandomizedRunner.java:921)
	at com.carrotsearch.randomizedtesting.rules.SystemPropertiesRestoreRule$1.evaluate(SystemPropertiesRestoreRule.java:57)
	at org.apache.lucene.util.TestRuleSetupTeardownChained$1.evaluate(TestRuleSetupTeardownChained.java:49)
	at org.apache.lucene.util.AbstractBeforeAfterRule$1.evaluate(AbstractBeforeAfterRule.java:45)
	at org.apache.lucene.util.TestRuleThreadAndTestName$1.evaluate(TestRuleThreadAndTestName.java:48)
	at org.apache.lucene.util.TestRuleIgnoreAfterMaxFailures$1.evaluate(TestRuleIgnoreAfterMaxFailures.java:64)
	at org.apache.lucene.util.TestRuleMarkFailure$1.evaluate(TestRuleMarkFailure.java:47)
	at com.carrotsearch.randomizedtesting.rules.StatementAdapter.evaluate(StatementAdapter.java:36)
	at com.carrotsearch.randomizedtesting.ThreadLeakControl$StatementRunner.run(ThreadLeakControl.java:367)
	at com.carrotsearch.randomizedtesting.ThreadLeakControl.forkTimeoutingTask(ThreadLeakControl.java:809)
	at com.carrotsearch.randomizedtesting.ThreadLeakControl$3.evaluate(ThreadLeakControl.java:460)
	at com.carrotsearch.randomizedtesting.RandomizedRunner.runSingleTest(RandomizedRunner.java:880)
	at com.carrotsearch.randomizedtesting.RandomizedRunner$5.evaluate(RandomizedRunner.java:781)
	at com.carrotsearch.randomizedtesting.RandomizedRunner$6.evaluate(RandomizedRunner.java:816)
	at com.carrotsearch.randomizedtesting.RandomizedRunner$7.evaluate(RandomizedRunner.java:827)
	at com.carrotsearch.randomizedtesting.rules.StatementAdapter.evaluate(StatementAdapter.java:36)
	at com.carrotsearch.randomizedtesting.rules.SystemPropertiesRestoreRule$1.evaluate(SystemPropertiesRestoreRule.java:57)
	at org.apache.lucene.util.AbstractBeforeAfterRule$1.evaluate(AbstractBeforeAfterRule.java:45)
	at com.carrotsearch.randomizedtesting.rules.StatementAdapter.evaluate(StatementAdapter.java:36)
	at org.apache.lucene.util.TestRuleStoreClassName$1.evaluate(TestRuleStoreClassName.java:41)
	at com.carrotsearch.randomizedtesting.rules.NoShadowingOrOverridesOnMethodsRule$1.evaluate(NoShadowingOrOverridesOnMethodsRule.java:40)
	at com.carrotsearch.randomizedtesting.rules.NoShadowingOrOverridesOnMethodsRule$1.evaluate(NoShadowingOrOverridesOnMethodsRule.java:40)
	at com.carrotsearch.randomizedtesting.rules.StatementAdapter.evaluate(StatementAdapter.java:36)
	at com.carrotsearch.randomizedtesting.rules.StatementAdapter.evaluate(StatementAdapter.java:36)
	at com.carrotsearch.randomizedtesting.rules.StatementAdapter.evaluate(StatementAdapter.java:36)
	at org.apache.lucene.util.TestRuleAssertionsRequired$1.evaluate(TestRuleAssertionsRequired.java:53)
	at org.apache.lucene.util.TestRuleMarkFailure$1.evaluate(TestRuleMarkFailure.java:47)
	at org.apache.lucene.util.TestRuleIgnoreAfterMaxFailures$1.evaluate(TestRuleIgnoreAfterMaxFailures.java:64)
	at org.apache.lucene.util.TestRuleIgnoreTestSuites$1.evaluate(TestRuleIgnoreTestSuites.java:54)
	at com.carrotsearch.randomizedtesting.rules.StatementAdapter.evaluate(StatementAdapter.java:36)
	at com.carrotsearch.randomizedtesting.ThreadLeakControl$StatementRunner.run(ThreadLeakControl.java:367)
	at java.lang.Thread.run(Thread.java:745)
Caused by: java.lang.RuntimeException: REQUEST FAILED: xpath=//result/doc[1]/int[@name='id'][.='13']
	xml response was: <?xml version="1.0" encoding="UTF-8"?>
<response>
<lst name="responseHeader"><int name="status">0</int><int name="QTime">1</int></lst><result name="response" numFound="16" start="0"><doc><int name="id">24</int><arr name="range_facet_l"><long>24</long></arr><arr name="range_facet_l_dv"><long>24</long></arr><arr name="range_facet_i_dv"><int>24</int></arr><arr name="lowerfilt"><str>The file red fox jumped over the lazy brown dogs.</str></arr><arr name="lowerfilt1and2"><str>The file red fox jumped over the lazy brown dogs.</str></arr><long name="_version_">1526734954292051968</long><arr name="multiDefault"><str>muLti-Default</str></arr><int name="intDefault">42</int><date name="timestamp">2016-02-20T22:38:33.868Z</date></doc><doc><int name="id">30</int><arr name="range_facet_l"><long>30</long></arr><arr name="range_facet_l_dv"><long>30</long></arr><arr name="range_facet_i_dv"><int>30</int></arr><arr name="lowerfilt"><str>The quote red fox jumped over the lazy brown dogs.</str></arr><arr name="lowerfilt1and2"><str>The quote red fox jumped over the lazy brown dogs.</str><str>red green yellow</str></arr><arr name="lowerfilt1"><str>red green yellow</str></arr><long name="_version_">1526734954297294848</long><arr name="multiDefault"><str>muLti-Default</str></arr><int name="intDefault">42</int><date name="timestamp">2016-02-20T22:38:33.872Z</date></doc><doc><int name="id">31</int><arr name="range_facet_l"><long>31</long></arr><arr name="range_facet_l_dv"><long>31</long></arr><arr name="range_facet_i_dv"><int>31</int></arr><arr name="lowerfilt"><str>The fat red fox jumped over the lazy brown dogs.</str></arr><arr name="lowerfilt1and2"><str>The fat red fox jumped over the lazy brown dogs.</str><str>green blue yellow</str></arr><arr name="lowerfilt1"><str>green blue yellow</str></arr><long name="_version_">1526734954297294849</long><arr name="multiDefault"><str>muLti-Default</str></arr><int name="intDefault">42</int><date name="timestamp">2016-02-20T22:38:33.873Z</date></doc><doc><int name="id">32</int><arr name="range_facet_l"><long>32</long></arr><arr name="range_facet_l_dv"><long>32</long></arr><arr name="range_facet_i_dv"><int>32</int></arr><arr name="lowerfilt"><str>The slim red fox jumped over the lazy brown dogs.</str></arr><arr name="lowerfilt1and2"><str>The slim red fox jumped over the lazy brown dogs.</str><str>yellow white black</str></arr><arr name="lowerfilt1"><str>yellow white black</str></arr><long name="_version_">1526734954298343424</long><arr name="multiDefault"><str>muLti-Default</str></arr><int name="intDefault">42</int><date name="timestamp">2016-02-20T22:38:33.874Z</date></doc><doc><int name="id">13</int><arr name="range_facet_l"><long>13</long></arr><arr name="range_facet_l_dv"><long>13</long></arr><arr name="range_facet_i_dv"><int>13</int></arr><arr name="lowerfilt"><str>The quote red fox jumped over the lazy brown dogs.</str></arr><arr name="lowerfilt1and2"><str>The quote red fox jumped over the lazy brown dogs.</str></arr><long name="_version_">1526734954281566208</long><arr name="multiDefault"><str>muLti-Default</str></arr><int name="intDefault">42</int><date name="timestamp">2016-02-20T22:38:33.858Z</date></doc><doc><int name="id">14</int><arr name="range_facet_l"><long>14</long></arr><arr name="range_facet_l_dv"><long>14</long></arr><arr name="range_facet_i_dv"><int>14</int></arr><arr name="lowerfilt"><str>The quote red fox jumped over the lazy brown dogs.</str></arr><arr name="lowerfilt1and2"><str>The quote red fox jumped over the lazy brown dogs.</str></arr><long name="_version_">1526734954282614784</long><arr name="multiDefault"><str>muLti-Default</str></arr><int name="intDefault">42</int><date name="timestamp">2016-02-20T22:38:33.859Z</date></doc><doc><int name="id">15</int><arr name="range_facet_l"><long>15</long></arr><arr name="range_facet_l_dv"><long>15</long></arr><arr name="range_facet_i_dv"><int>15</int></arr><arr name="lowerfilt"><str>The fat red fox jumped over the lazy brown dogs.</str></arr><arr name="lowerfilt1and2"><str>The fat red fox jumped over the lazy brown dogs.</str></arr><long name="_version_">1526734954283663360</long><arr name="multiDefault"><str>muLti-Default</str></arr><int name="intDefault">42</int><date name="timestamp">2016-02-20T22:38:33.859Z</date></doc><doc><int name="id">16</int><arr name="range_facet_l"><long>16</long></arr><arr name="range_facet_l_dv"><long>16</long></arr><arr name="range_facet_i_dv"><int>16</int></arr><arr name="lowerfilt"><str>The slim red fox jumped over the lazy brown dogs.</str></arr><arr name="lowerfilt1and2"><str>The slim red fox jumped over the lazy brown dogs.</str></arr><long name="_version_">1526734954283663361</long><arr name="multiDefault"><str>muLti-Default</str></arr><int name="intDefault">42</int><date name="timestamp">2016-02-20T22:38:33.86Z</date></doc><doc><int name="id">18</int><arr name="range_facet_l"><long>18</long></arr><arr name="range_facet_l_dv"><long>18</long></arr><arr name="range_facet_i_dv"><int>18</int></arr><arr name="lowerfilt"><str>The quote red fox jumped over the lazy brown dogs.</str></arr><arr name="lowerfilt1and2"><str>The quote red fox jumped over the lazy brown dogs.</str></arr><long name="_version_">1526734954285760512</long><arr name="multiDefault"><str>muLti-Default</str></arr><int name="intDefault">42</int><date name="timestamp">2016-02-20T22:38:33.862Z</date></doc><doc><int name="id">19</int><arr name="range_facet_l"><long>19</long></arr><arr name="range_facet_l_dv"><long>19</long></arr><arr name="range_facet_i_dv"><int>19</int></arr><arr name="lowerfilt"><str>The hose red fox jumped over the lazy brown dogs.</str></arr><arr name="lowerfilt1and2"><str>The hose red fox jumped over the lazy brown dogs.</str></arr><long name="_version_">1526734954286809088</long><arr name="multiDefault"><str>muLti-Default</str></arr><int name="intDefault">42</int><date name="timestamp">2016-02-20T22:38:33.863Z</date></doc></result>
</response>

	request was:q={!mlt+qf%3Dlowerfilt}17
	at org.apache.solr.SolrTestCaseJ4.assertQ(SolrTestCaseJ4.java:747)
	... 41 more




Build Log:
[...truncated 11924 lines...]
   [junit4] Suite: org.apache.solr.cloud.HttpPartitionTest
   [junit4]   2> Creating dataDir: /home/jenkins/workspace/Lucene-Solr-5.x-Linux/solr/build/solr-core/test/J1/temp/solr.cloud.HttpPartitionTest_E8435E692B7981E0-001/init-core-data-001
   [junit4]   2> 1318822 INFO  (SUITE-HttpPartitionTest-seed#[E8435E692B7981E0]-worker) [    ] o.a.s.BaseDistributedSearchTestCase Setting hostContext system property: /
   [junit4]   2> 1318824 INFO  (TEST-HttpPartitionTest.test-seed#[E8435E692B7981E0]) [    ] o.a.s.c.ZkTestServer STARTING ZK TEST SERVER
   [junit4]   2> 1318825 INFO  (Thread-4155) [    ] o.a.s.c.ZkTestServer client port:0.0.0.0/0.0.0.0:0
   [junit4]   2> 1318825 INFO  (Thread-4155) [    ] o.a.s.c.ZkTestServer Starting server
   [junit4]   2> 1318925 INFO  (TEST-HttpPartitionTest.test-seed#[E8435E692B7981E0]) [    ] o.a.s.c.ZkTestServer start zk server on port:46308
   [junit4]   2> 1318925 INFO  (TEST-HttpPartitionTest.test-seed#[E8435E692B7981E0]) [    ] o.a.s.c.c.SolrZkClient Using default ZkCredentialsProvider
   [junit4]   2> 1318925 INFO  (TEST-HttpPartitionTest.test-seed#[E8435E692B7981E0]) [    ] o.a.s.c.c.ConnectionManager Waiting for client to connect to ZooKeeper
   [junit4]   2> 1318927 INFO  (zkCallback-1507-thread-1) [    ] o.a.s.c.c.ConnectionManager Watcher org.apache.solr.common.cloud.ConnectionManager@389c1356 name:ZooKeeperConnection Watcher:127.0.0.1:46308 got event WatchedEvent state:SyncConnected type:None path:null path:null type:None
   [junit4]   2> 1318927 INFO  (TEST-HttpPartitionTest.test-seed#[E8435E692B7981E0]) [    ] o.a.s.c.c.ConnectionManager Client is connected to ZooKeeper
   [junit4]   2> 1318928 INFO  (TEST-HttpPartitionTest.test-seed#[E8435E692B7981E0]) [    ] o.a.s.c.c.SolrZkClient Using default ZkACLProvider
   [junit4]   2> 1318928 INFO  (TEST-HttpPartitionTest.test-seed#[E8435E692B7981E0]) [    ] o.a.s.c.c.SolrZkClient makePath: /solr
   [junit4]   2> 1318929 INFO  (TEST-HttpPartitionTest.test-seed#[E8435E692B7981E0]) [    ] o.a.s.c.c.SolrZkClient Using default ZkCredentialsProvider
   [junit4]   2> 1318929 INFO  (TEST-HttpPartitionTest.test-seed#[E8435E692B7981E0]) [    ] o.a.s.c.c.ConnectionManager Waiting for client to connect to ZooKeeper
   [junit4]   2> 1318930 INFO  (zkCallback-1508-thread-1) [    ] o.a.s.c.c.ConnectionManager Watcher org.apache.solr.common.cloud.ConnectionManager@574b4b62 name:ZooKeeperConnection Watcher:127.0.0.1:46308/solr got event WatchedEvent state:SyncConnected type:None path:null path:null type:None
   [junit4]   2> 1318930 INFO  (TEST-HttpPartitionTest.test-seed#[E8435E692B7981E0]) [    ] o.a.s.c.c.ConnectionManager Client is connected to ZooKeeper
   [junit4]   2> 1318930 INFO  (TEST-HttpPartitionTest.test-seed#[E8435E692B7981E0]) [    ] o.a.s.c.c.SolrZkClient Using default ZkACLProvider
   [junit4]   2> 1318931 INFO  (TEST-HttpPartitionTest.test-seed#[E8435E692B7981E0]) [    ] o.a.s.c.c.SolrZkClient makePath: /collections/collection1
   [junit4]   2> 1318931 INFO  (TEST-HttpPartitionTest.test-seed#[E8435E692B7981E0]) [    ] o.a.s.c.c.SolrZkClient makePath: /collections/collection1/shards
   [junit4]   2> 1318932 INFO  (TEST-HttpPartitionTest.test-seed#[E8435E692B7981E0]) [    ] o.a.s.c.c.SolrZkClient makePath: /collections/control_collection
   [junit4]   2> 1318932 INFO  (TEST-HttpPartitionTest.test-seed#[E8435E692B7981E0]) [    ] o.a.s.c.c.SolrZkClient makePath: /collections/control_collection/shards
   [junit4]   2> 1318933 INFO  (TEST-HttpPartitionTest.test-seed#[E8435E692B7981E0]) [    ] o.a.s.c.AbstractZkTestCase put /home/jenkins/workspace/Lucene-Solr-5.x-Linux/solr/core/src/test-files/solr/collection1/conf/solrconfig-tlog.xml to /configs/conf1/solrconfig.xml
   [junit4]   2> 1318933 INFO  (TEST-HttpPartitionTest.test-seed#[E8435E692B7981E0]) [    ] o.a.s.c.c.SolrZkClient makePath: /configs/conf1/solrconfig.xml
   [junit4]   2> 1318934 INFO  (TEST-HttpPartitionTest.test-seed#[E8435E692B7981E0]) [    ] o.a.s.c.AbstractZkTestCase put /home/jenkins/workspace/Lucene-Solr-5.x-Linux/solr/core/src/test-files/solr/collection1/conf/schema.xml to /configs/conf1/schema.xml
   [junit4]   2> 1318934 INFO  (TEST-HttpPartitionTest.test-seed#[E8435E692B7981E0]) [    ] o.a.s.c.c.SolrZkClient makePath: /configs/conf1/schema.xml
   [junit4]   2> 1318935 INFO  (TEST-HttpPartitionTest.test-seed#[E8435E692B7981E0]) [    ] o.a.s.c.AbstractZkTestCase put /home/jenkins/workspace/Lucene-Solr-5.x-Linux/solr/core/src/test-files/solr/collection1/conf/solrconfig.snippet.randomindexconfig.xml to /configs/conf1/solrconfig.snippet.randomindexconfig.xml
   [junit4]   2> 1318935 INFO  (TEST-HttpPartitionTest.test-seed#[E8435E692B7981E0]) [    ] o.a.s.c.c.SolrZkClient makePath: /configs/conf1/solrconfig.snippet.randomindexconfig.xml
   [junit4]   2> 1318935 INFO  (TEST-HttpPartitionTest.test-seed#[E8435E692B7981E0]) [    ] o.a.s.c.AbstractZkTestCase put /home/jenkins/workspace/Lucene-Solr-5.x-Linux/solr/core/src/test-files/solr/collection1/conf/stopwords.txt to /configs/conf1/stopwords.txt
   [junit4]   2> 1318935 INFO  (TEST-HttpPartitionTest.test-seed#[E8435E692B7981E0]) [    ] o.a.s.c.c.SolrZkClient makePath: /configs/conf1/stopwords.txt
   [junit4]   2> 1318936 INFO  (TEST-HttpPartitionTest.test-seed#[E8435E692B7981E0]) [    ] o.a.s.c.AbstractZkTestCase put /home/jenkins/workspace/Lucene-Solr-5.x-Linux/solr/core/src/test-files/solr/collection1/conf/protwords.txt to /configs/conf1/protwords.txt
   [junit4]   2> 1318936 INFO  (TEST-HttpPartitionTest.test-seed#[E8435E692B7981E0]) [    ] o.a.s.c.c.SolrZkClient makePath: /configs/conf1/protwords.txt
   [junit4]   2> 1318936 INFO  (TEST-HttpPartitionTest.test-seed#[E8435E692B7981E0]) [    ] o.a.s.c.AbstractZkTestCase put /home/jenkins/workspace/Lucene-Solr-5.x-Linux/solr/core/src/test-files/solr/collection1/conf/currency.xml to /configs/conf1/currency.xml
   [junit4]   2> 1318936 INFO  (TEST-HttpPartitionTest.test-seed#[E8435E692B7981E0]) [    ] o.a.s.c.c.SolrZkClient makePath: /configs/conf1/currency.xml
   [junit4]   2> 1318937 INFO  (TEST-HttpPartitionTest.test-seed#[E8435E692B7981E0]) [    ] o.a.s.c.AbstractZkTestCase put /home/jenkins/workspace/Lucene-Solr-5.x-Linux/solr/core/src/test-files/solr/collection1/conf/enumsConfig.xml to /configs/conf1/enumsConfig.xml
   [junit4]   2> 1318937 INFO  (TEST-HttpPartitionTest.test-seed#[E8435E692B7981E0]) [    ] o.a.s.c.c.SolrZkClient makePath: /configs/conf1/enumsConfig.xml
   [junit4]   2> 1318938 INFO  (TEST-HttpPartitionTest.test-seed#[E8435E692B7981E0]) [    ] o.a.s.c.AbstractZkTestCase put /home/jenkins/workspace/Lucene-Solr-5.x-Linux/solr/core/src/test-files/solr/collection1/conf/open-exchange-rates.json to /configs/conf1/open-exchange-rates.json
   [junit4]   2> 1318938 INFO  (TEST-HttpPartitionTest.test-seed#[E8435E692B7981E0]) [    ] o.a.s.c.c.SolrZkClient makePath: /configs/conf1/open-exchange-rates.json
   [junit4]   2> 1318938 INFO  (TEST-HttpPartitionTest.test-seed#[E8435E692B7981E0]) [    ] o.a.s.c.AbstractZkTestCase put /home/jenkins/workspace/Lucene-Solr-5.x-Linux/solr/core/src/test-files/solr/collection1/conf/mapping-ISOLatin1Accent.txt to /configs/conf1/mapping-ISOLatin1Accent.txt
   [junit4]   2> 1318939 INFO  (TEST-HttpPartitionTest.test-seed#[E8435E692B7981E0]) [    ] o.a.s.c.c.SolrZkClient makePath: /configs/conf1/mapping-ISOLatin1Accent.txt
   [junit4]   2> 1318939 INFO  (TEST-HttpPartitionTest.test-seed#[E8435E692B7981E0]) [    ] o.a.s.c.AbstractZkTestCase put /home/jenkins/workspace/Lucene-Solr-5.x-Linux/solr/core/src/test-files/solr/collection1/conf/old_synonyms.txt to /configs/conf1/old_synonyms.txt
   [junit4]   2> 1318939 INFO  (TEST-HttpPartitionTest.test-seed#[E8435E692B7981E0]) [    ] o.a.s.c.c.SolrZkClient makePath: /configs/conf1/old_synonyms.txt
   [junit4]   2> 1318940 INFO  (TEST-HttpPartitionTest.test-seed#[E8435E692B7981E0]) [    ] o.a.s.c.AbstractZkTestCase put /home/jenkins/workspace/Lucene-Solr-5.x-Linux/solr/core/src/test-files/solr/collection1/conf/synonyms.txt to /configs/conf1/synonyms.txt
   [junit4]   2> 1318940 INFO  (TEST-HttpPartitionTest.test-seed#[E8435E692B7981E0]) [    ] o.a.s.c.c.SolrZkClient makePath: /configs/conf1/synonyms.txt
   [junit4]   2> 1318986 INFO  (TEST-HttpPartitionTest.test-seed#[E8435E692B7981E0]) [    ] o.a.s.SolrTestCaseJ4 Writing core.properties file to /home/jenkins/workspace/Lucene-Solr-5.x-Linux/solr/build/solr-core/test/J1/temp/solr.cloud.HttpPartitionTest_E8435E692B7981E0-001/control-001/cores/collection1
   [junit4]   2> 1318987 INFO  (TEST-HttpPartitionTest.test-seed#[E8435E692B7981E0]) [    ] o.e.j.s.Server jetty-9.2.13.v20150730
   [junit4]   2> 1318988 INFO  (TEST-HttpPartitionTest.test-seed#[E8435E692B7981E0]) [    ] o.e.j.s.h.ContextHandler Started o.e.j.s.ServletContextHandler@70bb9f85{/,null,AVAILABLE}
   [junit4]   2> 1318988 INFO  (TEST-HttpPartitionTest.test-seed#[E8435E692B7981E0]) [    ] o.e.j.s.ServerConnector Started ServerConnector@5ac76fbd{HTTP/1.1}{127.0.0.1:45536}
   [junit4]   2> 1318988 INFO  (TEST-HttpPartitionTest.test-seed#[E8435E692B7981E0]) [    ] o.e.j.s.Server Started @1320543ms
   [junit4]   2> 1318988 INFO  (TEST-HttpPartitionTest.test-seed#[E8435E692B7981E0]) [    ] o.a.s.c.s.e.JettySolrRunner Jetty properties: {hostPort=38908, coreRootDirectory=/home/jenkins/workspace/Lucene-Solr-5.x-Linux/solr/build/solr-core/test/J1/temp/solr.cloud.HttpPartitionTest_E8435E692B7981E0-001/control-001/cores, solr.data.dir=/home/jenkins/workspace/Lucene-Solr-5.x-Linux/solr/build/solr-core/test/J1/temp/solr.cloud.HttpPartitionTest_E8435E692B7981E0-001/tempDir-001/control/data, hostContext=/}
   [junit4]   2> 1318988 INFO  (TEST-HttpPartitionTest.test-seed#[E8435E692B7981E0]) [    ] o.a.s.s.SolrDispatchFilter SolrDispatchFilter.init(): sun.misc.Launcher$AppClassLoader@3033b503
   [junit4]   2> 1318988 INFO  (TEST-HttpPartitionTest.test-seed#[E8435E692B7981E0]) [    ] o.a.s.c.SolrResourceLoader new SolrResourceLoader for directory: '/home/jenkins/workspace/Lucene-Solr-5.x-Linux/solr/build/solr-core/test/J1/temp/solr.cloud.HttpPartitionTest_E8435E692B7981E0-001/control-001'
   [junit4]   2> 1318988 INFO  (TEST-HttpPartitionTest.test-seed#[E8435E692B7981E0]) [    ] o.a.s.c.SolrResourceLoader JNDI not configured for solr (NoInitialContextEx)
   [junit4]   2> 1318988 INFO  (TEST-HttpPartitionTest.test-seed#[E8435E692B7981E0]) [    ] o.a.s.c.SolrResourceLoader solr home defaulted to 'solr/' (could not find system property or JNDI)
   [junit4]   2> 1318989 INFO  (TEST-HttpPartitionTest.test-seed#[E8435E692B7981E0]) [    ] o.a.s.c.c.SolrZkClient Using default ZkCredentialsProvider
   [junit4]   2> 1318989 INFO  (TEST-HttpPartitionTest.test-seed#[E8435E692B7981E0]) [    ] o.a.s.c.c.ConnectionManager Waiting for client to connect to ZooKeeper
   [junit4]   2> 1318990 INFO  (zkCallback-1509-thread-1) [    ] o.a.s.c.c.ConnectionManager Watcher org.apache.solr.common.cloud.ConnectionManager@5b86c38f name:ZooKeeperConnection Watcher:127.0.0.1:46308/solr got event WatchedEvent state:SyncConnected type:None path:null path:null type:None
   [junit4]   2> 1318990 INFO  (TEST-HttpPartitionTest.test-seed#[E8435E692B7981E0]) [    ] o.a.s.c.c.ConnectionManager Client is connected to ZooKeeper
   [junit4]   2> 1318990 INFO  (TEST-HttpPartitionTest.test-seed#[E8435E692B7981E0]) [    ] o.a.s.c.c.SolrZkClient Using default ZkACLProvider
   [junit4]   2> 1318991 INFO  (TEST-HttpPartitionTest.test-seed#[E8435E692B7981E0]) [    ] o.a.s.s.SolrDispatchFilter Loading solr.xml from SolrHome (not found in ZooKeeper)
   [junit4]   2> 1318991 INFO  (TEST-HttpPartitionTest.test-seed#[E8435E692B7981E0]) [    ] o.a.s.c.SolrXmlConfig Loading container configuration from /home/jenkins/workspace/Lucene-Solr-5.x-Linux/solr/build/solr-core/test/J1/temp/solr.cloud.HttpPartitionTest_E8435E692B7981E0-001/control-001/solr.xml
   [junit4]   2> 1318999 INFO  (TEST-HttpPartitionTest.test-seed#[E8435E692B7981E0]) [    ] o.a.s.c.CorePropertiesLocator Config-defined core root directory: /home/jenkins/workspace/Lucene-Solr-5.x-Linux/solr/build/solr-core/test/J1/temp/solr.cloud.HttpPartitionTest_E8435E692B7981E0-001/control-001/cores
   [junit4]   2> 1318999 INFO  (TEST-HttpPartitionTest.test-seed#[E8435E692B7981E0]) [    ] o.a.s.c.CoreContainer New CoreContainer 1080214786
   [junit4]   2> 1318999 INFO  (TEST-HttpPartitionTest.test-seed#[E8435E692B7981E0]) [    ] o.a.s.c.CoreContainer Loading cores into CoreContainer [instanceDir=/home/jenkins/workspace/Lucene-Solr-5.x-Linux/solr/build/solr-core/test/J1/temp/solr.cloud.HttpPartitionTest_E8435E692B7981E0-001/control-001]
   [junit4]   2> 1318999 WARN  (TEST-HttpPartitionTest.test-seed#[E8435E692B7981E0]) [    ] o.a.s.c.CoreContainer Couldn't add files from /home/jenkins/workspace/Lucene-Solr-5.x-Linux/solr/build/solr-core/test/J1/temp/solr.cloud.HttpPartitionTest_E8435E692B7981E0-001/control-001/lib to classpath: /home/jenkins/workspace/Lucene-Solr-5.x-Linux/solr/build/solr-core/test/J1/temp/solr.cloud.HttpPartitionTest_E8435E692B7981E0-001/control-001/lib
   [junit4]   2> 1319000 INFO  (TEST-HttpPartitionTest.test-seed#[E8435E692B7981E0]) [    ] o.a.s.h.c.HttpShardHandlerFactory created with socketTimeout : 90000,urlScheme : ,connTimeout : 15000,maxConnectionsPerHost : 20,maxConnections : 10000,corePoolSize : 0,maximumPoolSize : 2147483647,maxThreadIdleTime : 5,sizeOfQueue : -1,fairnessPolicy : false,useRetries : false,
   [junit4]   2> 1319000 INFO  (TEST-HttpPartitionTest.test-seed#[E8435E692B7981E0]) [    ] o.a.s.u.UpdateShardHandler Creating UpdateShardHandler HTTP client with params: socketTimeout=340000&connTimeout=45000&retry=true
   [junit4]   2> 1319001 INFO  (TEST-HttpPartitionTest.test-seed#[E8435E692B7981E0]) [    ] o.a.s.l.LogWatcher SLF4J impl is org.slf4j.impl.Log4jLoggerFactory
   [junit4]   2> 1319001 INFO  (TEST-HttpPartitionTest.test-seed#[E8435E692B7981E0]) [    ] o.a.s.l.LogWatcher Registering Log Listener [Log4j (org.slf4j.impl.Log4jLoggerFactory)]
   [junit4]   2> 1319001 INFO  (TEST-HttpPartitionTest.test-seed#[E8435E692B7981E0]) [    ] o.a.s.c.ZkContainer Zookeeper client=127.0.0.1:46308/solr
   [junit4]   2> 1319001 INFO  (TEST-HttpPartitionTest.test-seed#[E8435E692B7981E0]) [    ] o.a.s.c.ZkController zkHost includes chroot
   [junit4]   2> 1319001 INFO  (TEST-HttpPartitionTest.test-seed#[E8435E692B7981E0]) [    ] o.a.s.c.c.SolrZkClient Using default ZkCredentialsProvider
   [junit4]   2> 1319001 INFO  (TEST-HttpPartitionTest.test-seed#[E8435E692B7981E0]) [    ] o.a.s.c.c.ConnectionManager Waiting for client to connect to ZooKeeper
   [junit4]   2> 1319002 INFO  (zkCallback-1512-thread-1) [    ] o.a.s.c.c.ConnectionManager Watcher org.apache.solr.common.cloud.ConnectionManager@7e6cfeaa name:ZooKeeperConnection Watcher:127.0.0.1:46308 got event WatchedEvent state:SyncConnected type:None path:null path:null type:None
   [junit4]   2> 1319002 INFO  (TEST-HttpPartitionTest.test-seed#[E8435E692B7981E0]) [    ] o.a.s.c.c.ConnectionManager Client is connected to ZooKeeper
   [junit4]   2> 1319003 INFO  (TEST-HttpPartitionTest.test-seed#[E8435E692B7981E0]) [    ] o.a.s.c.c.SolrZkClient Using default ZkACLProvider
   [junit4]   2> 1319003 INFO  (TEST-HttpPartitionTest.test-seed#[E8435E692B7981E0]) [n:127.0.0.1:38908_    ] o.a.s.c.c.ConnectionManager Waiting for client to connect to ZooKeeper
   [junit4]   2> 1319004 INFO  (zkCallback-1513-thread-1-processing-n:127.0.0.1:38908_) [n:127.0.0.1:38908_    ] o.a.s.c.c.ConnectionManager Watcher org.apache.solr.common.cloud.ConnectionManager@1e536960 name:ZooKeeperConnection Watcher:127.0.0.1:46308/solr got event WatchedEvent state:SyncConnected type:None path:null path:null type:None
   [junit4]   2> 1319004 INFO  (TEST-HttpPartitionTest.test-seed#[E8435E692B7981E0]) [n:127.0.0.1:38908_    ] o.a.s.c.c.ConnectionManager Client is connected to ZooKeeper
   [junit4]   2> 1319004 INFO  (TEST-HttpPartitionTest.test-seed#[E8435E692B7981E0]) [n:127.0.0.1:38908_    ] o.a.s.c.c.SolrZkClient makePath: /overseer/queue
   [junit4]   2> 1319005 INFO  (TEST-HttpPartitionTest.test-seed#[E8435E692B7981E0]) [n:127.0.0.1:38908_    ] o.a.s.c.c.SolrZkClient makePath: /overseer/collection-queue-work
   [junit4]   2> 1319007 INFO  (TEST-HttpPartitionTest.test-seed#[E8435E692B7981E0]) [n:127.0.0.1:38908_    ] o.a.s.c.c.SolrZkClient makePath: /overseer/collection-map-running
   [junit4]   2> 1319007 INFO  (TEST-HttpPartitionTest.test-seed#[E8435E692B7981E0]) [n:127.0.0.1:38908_    ] o.a.s.c.c.SolrZkClient makePath: /overseer/collection-map-completed
   [junit4]   2> 1319008 INFO  (TEST-HttpPartitionTest.test-seed#[E8435E692B7981E0]) [n:127.0.0.1:38908_    ] o.a.s.c.c.SolrZkClient makePath: /overseer/collection-map-failure
   [junit4]   2> 1319009 INFO  (TEST-HttpPartitionTest.test-seed#[E8435E692B7981E0]) [n:127.0.0.1:38908_    ] o.a.s.c.c.SolrZkClient makePath: /live_nodes
   [junit4]   2> 1319010 INFO  (TEST-HttpPartitionTest.test-seed#[E8435E692B7981E0]) [n:127.0.0.1:38908_    ] o.a.s.c.c.SolrZkClient makePath: /aliases.json
   [junit4]   2> 1319011 INFO  (TEST-HttpPartitionTest.test-seed#[E8435E692B7981E0]) [n:127.0.0.1:38908_    ] o.a.s.c.c.SolrZkClient makePath: /clusterstate.json
   [junit4]   2> 1319011 INFO  (TEST-HttpPartitionTest.test-seed#[E8435E692B7981E0]) [n:127.0.0.1:38908_    ] o.a.s.c.c.SolrZkClient makePath: /security.json
   [junit4]   2> 1319012 INFO  (TEST-HttpPartitionTest.test-seed#[E8435E692B7981E0]) [n:127.0.0.1:38908_    ] o.a.s.c.ZkController Register node as live in ZooKeeper:/live_nodes/127.0.0.1:38908_
   [junit4]   2> 1319012 INFO  (TEST-HttpPartitionTest.test-seed#[E8435E692B7981E0]) [n:127.0.0.1:38908_    ] o.a.s.c.c.SolrZkClient makePath: /live_nodes/127.0.0.1:38908_
   [junit4]   2> 1319012 INFO  (TEST-HttpPartitionTest.test-seed#[E8435E692B7981E0]) [n:127.0.0.1:38908_    ] o.a.s.c.c.SolrZkClient makePath: /overseer_elect
   [junit4]   2> 1319013 INFO  (TEST-HttpPartitionTest.test-seed#[E8435E692B7981E0]) [n:127.0.0.1:38908_    ] o.a.s.c.c.SolrZkClient makePath: /overseer_elect/election
   [junit4]   2> 1319013 INFO  (TEST-HttpPartitionTest.test-seed#[E8435E692B7981E0]) [n:127.0.0.1:38908_    ] o.a.s.c.Overseer Overseer (id=null) closing
   [junit4]   2> 1319014 INFO  (TEST-HttpPartitionTest.test-seed#[E8435E692B7981E0]) [n:127.0.0.1:38908_    ] o.a.s.c.LeaderElector Joined leadership election with path: /overseer_elect/election/95420877681655812-127.0.0.1:38908_-n_0000000000
   [junit4]   2> 1319014 INFO  (TEST-HttpPartitionTest.test-seed#[E8435E692B7981E0]) [n:127.0.0.1:38908_    ] o.a.s.c.OverseerElectionContext I am going to be the leader 127.0.0.1:38908_
   [junit4]   2> 1319014 INFO  (TEST-HttpPartitionTest.test-seed#[E8435E692B7981E0]) [n:127.0.0.1:38908_    ] o.a.s.c.c.SolrZkClient makePath: /overseer_elect/leader
   [junit4]   2> 1319015 INFO  (TEST-HttpPartitionTest.test-seed#[E8435E692B7981E0]) [n:127.0.0.1:38908_    ] o.a.s.c.Overseer Overseer (id=95420877681655812-127.0.0.1:38908_-n_0000000000) starting
   [junit4]   2> 1319015 INFO  (TEST-HttpPartitionTest.test-seed#[E8435E692B7981E0]) [n:127.0.0.1:38908_    ] o.a.s.c.c.SolrZkClient makePath: /overseer/queue-work
   [junit4]   2> 1319018 INFO  (TEST-HttpPartitionTest.test-seed#[E8435E692B7981E0]) [n:127.0.0.1:38908_    ] o.a.s.c.OverseerAutoReplicaFailoverThread Starting OverseerAutoReplicaFailoverThread autoReplicaFailoverWorkLoopDelay=10000 autoReplicaFailoverWaitAfterExpiration=30000 autoReplicaFailoverBadNodeExpiration=60000
   [junit4]   2> 1319019 INFO  (TEST-HttpPartitionTest.test-seed#[E8435E692B7981E0]) [n:127.0.0.1:38908_    ] o.a.s.c.c.ZkStateReader Updating cluster state from ZooKeeper... 
   [junit4]   2> 1319019 INFO  (OverseerCollectionConfigSetProcessor-95420877681655812-127.0.0.1:38908_-n_0000000000) [n:127.0.0.1:38908_    ] o.a.s.c.OverseerTaskProcessor Process current queue of overseer operations
   [junit4]   2> 1319019 INFO  (OverseerStateUpdate-95420877681655812-127.0.0.1:38908_-n_0000000000) [n:127.0.0.1:38908_    ] o.a.s.c.Overseer Starting to work on the main queue
   [junit4]   2> 1319032 INFO  (TEST-HttpPartitionTest.test-seed#[E8435E692B7981E0]) [n:127.0.0.1:38908_    ] o.a.s.c.CoreContainer Security conf doesn't exist. Skipping setup for authorization module.
   [junit4]   2> 1319032 INFO  (TEST-HttpPartitionTest.test-seed#[E8435E692B7981E0]) [n:127.0.0.1:38908_    ] o.a.s.c.CoreContainer No authentication plugin used.
   [junit4]   2> 1319033 INFO  (TEST-HttpPartitionTest.test-seed#[E8435E692B7981E0]) [n:127.0.0.1:38908_    ] o.a.s.c.CorePropertiesLocator Looking for core definitions underneath /home/jenkins/workspace/Lucene-Solr-5.x-Linux/solr/build/solr-core/test/J1/temp/solr.cloud.HttpPartitionTest_E8435E692B7981E0-001/control-001/cores
   [junit4]   2> 1319034 INFO  (TEST-HttpPartitionTest.test-seed#[E8435E692B7981E0]) [n:127.0.0.1:38908_    ] o.a.s.c.CoreDescriptor Created CoreDescriptor: {coreNodeName=, schema=schema.xml, name=collection1, config=solrconfig.xml, transient=false, shard=, collection=control_collection, dataDir=data/, loadOnStartup=true, configSetProperties=configsetprops.json}
   [junit4]   2> 1319034 INFO  (TEST-HttpPartitionTest.test-seed#[E8435E692B7981E0]) [n:127.0.0.1:38908_    ] o.a.s.c.CorePropertiesLocator Found core collection1 in /home/jenkins/workspace/Lucene-Solr-5.x-Linux/solr/build/solr-core/test/J1/temp/solr.cloud.HttpPartitionTest_E8435E692B7981E0-001/control-001/cores/collection1
   [junit4]   2> 1319034 INFO  (TEST-HttpPartitionTest.test-seed#[E8435E692B7981E0]) [n:127.0.0.1:38908_    ] o.a.s.c.CorePropertiesLocator Found 1 core definitions
   [junit4]   2> 1319034 INFO  (TEST-HttpPartitionTest.test-seed#[E8435E692B7981E0]) [n:127.0.0.1:38908_    ] o.a.s.s.SolrDispatchFilter user.dir=/home/jenkins/workspace/Lucene-Solr-5.x-Linux/solr/build/solr-core/test/J1
   [junit4]   2> 1319034 INFO  (TEST-HttpPartitionTest.test-seed#[E8435E692B7981E0]) [n:127.0.0.1:38908_    ] o.a.s.s.SolrDispatchFilter SolrDispatchFilter.init() done
   [junit4]   2> 1319034 INFO  (coreLoadExecutor-5054-thread-1-processing-n:127.0.0.1:38908_) [n:127.0.0.1:38908_ c:control_collection   x:collection1] o.a.s.c.ZkController publishing state=down
   [junit4]   2> 1319035 INFO  (coreLoadExecutor-5054-thread-1-processing-n:127.0.0.1:38908_) [n:127.0.0.1:38908_ c:control_collection   x:collection1] o.a.s.c.ZkController numShards not found on descriptor - reading it from system property
   [junit4]   2> 1319035 INFO  (OverseerStateUpdate-95420877681655812-127.0.0.1:38908_-n_0000000000) [n:127.0.0.1:38908_    ] o.a.s.c.Overseer processMessage: queueSize: 1, message = {
   [junit4]   2>   "roles":null,
   [junit4]   2>   "numShards":"1",
   [junit4]   2>   "node_name":"127.0.0.1:38908_",
   [junit4]   2>   "operation":"state",
   [junit4]   2>   "collection":"control_collection",
   [junit4]   2>   "shard":null,
   [junit4]   2>   "core":"collection1",
   [junit4]   2>   "base_url":"http://127.0.0.1:38908",
   [junit4]   2>   "state":"down"} current state version: 0
   [junit4]   2> 1319035 INFO  (coreLoadExecutor-5054-thread-1-processing-n:127.0.0.1:38908_) [n:127.0.0.1:38908_ c:control_collection   x:collection1] o.a.s.c.ZkController look for our core node name
   [junit4]   2> 1319036 INFO  (OverseerStateUpdate-95420877681655812-127.0.0.1:38908_-n_0000000000) [n:127.0.0.1:38908_    ] o.a.s.c.o.ReplicaMutator Update state numShards=1 message={
   [junit4]   2>   "roles":null,
   [junit4]   2>   "numShards":"1",
   [junit4]   2>   "node_name":"127.0.0.1:38908_",
   [junit4]   2>   "operation":"state",
   [junit4]   2>   "collection":"control_collection",
   [junit4]   2>   "shard":null,
   [junit4]   2>   "core":"collection1",
   [junit4]   2>   "base_url":"http://127.0.0.1:38908",
   [junit4]   2>   "state":"down"}
   [junit4]   2> 1319036 INFO  (OverseerStateUpdate-95420877681655812-127.0.0.1:38908_-n_0000000000) [n:127.0.0.1:38908_    ] o.a.s.c.o.ClusterStateMutator building a new cName: control_collection
   [junit4]   2> 1319036 INFO  (OverseerStateUpdate-95420877681655812-127.0.0.1:38908_-n_0000000000) [n:127.0.0.1:38908_    ] o.a.s.c.o.ReplicaMutator Assigning new node to shard shard=shard1
   [junit4]   2> 1319037 INFO  (zkCallback-1513-thread-1-processing-n:127.0.0.1:38908_) [n:127.0.0.1:38908_    ] o.a.s.c.c.ZkStateReader A cluster state change: [WatchedEvent state:SyncConnected type:NodeDataChanged path:/clusterstate.json], has occurred - updating... (live nodes size: [1])
   [junit4]   2> 1320036 INFO  (coreLoadExecutor-5054-thread-1-processing-n:127.0.0.1:38908_) [n:127.0.0.1:38908_ c:control_collection   x:collection1] o.a.s.c.ZkController waiting to find shard id in clusterstate for collection1
   [junit4]   2> 1320036 INFO  (coreLoadExecutor-5054-thread-1-processing-n:127.0.0.1:38908_) [n:127.0.0.1:38908_ c:control_collection   x:collection1] o.a.s.c.ZkController Check for collection zkNode:control_collection
   [junit4]   2> 1320036 INFO  (coreLoadExecutor-5054-thread-1-processing-n:127.0.0.1:38908_) [n:127.0.0.1:38908_ c:control_collection   x:collection1] o.a.s.c.ZkController Collection zkNode exists
   [junit4]   2> 1320036 INFO  (coreLoadExecutor-5054-thread-1-processing-n:127.0.0.1:38908_) [n:127.0.0.1:38908_ c:control_collection   x:collection1] o.a.s.c.c.ZkStateReader Load collection config from: [/collections/control_collection]
   [junit4]   2> 1320036 INFO  (coreLoadExecutor-5054-thread-1-processing-n:127.0.0.1:38908_) [n:127.0.0.1:38908_ c:control_collection   x:collection1] o.a.s.c.c.ZkStateReader path=[/collections/control_collection] [configName]=[conf1] specified config exists in ZooKeeper
   [junit4]   2> 1320036 INFO  (coreLoadExecutor-5054-thread-1-processing-n:127.0.0.1:38908_) [n:127.0.0.1:38908_ c:control_collection   x:collection1] o.a.s.c.SolrResourceLoader new SolrResourceLoader for directory: '/home/jenkins/workspace/Lucene-Solr-5.x-Linux/solr/build/solr-core/test/J1/temp/solr.cloud.HttpPartitionTest_E8435E692B7981E0-001/control-001/cores/collection1'
   [junit4]   2> 1320037 INFO  (coreLoadExecutor-5054-thread-1-processing-n:127.0.0.1:38908_) [n:127.0.0.1:38908_ c:control_collection   x:collection1] o.a.s.c.SolrResourceLoader JNDI not configured for solr (NoInitialContextEx)
   [junit4]   2> 1320037 INFO  (coreLoadExecutor-5054-thread-1-processing-n:127.0.0.1:38908_) [n:127.0.0.1:38908_ c:control_collection   x:collection1] o.a.s.c.SolrResourceLoader solr home defaulted to 'solr/' (could not find system property or JNDI)
   [junit4]   2> 1320038 INFO  (coreLoadExecutor-5054-thread-1-processing-n:127.0.0.1:38908_) [n:127.0.0.1:38908_ c:control_collection   x:collection1] o.a.s.c.Config loaded config solrconfig.xml with version 0 
   [junit4]   2> 1320041 INFO  (coreLoadExecutor-5054-thread-1-processing-n:127.0.0.1:38908_) [n:127.0.0.1:38908_ c:control_collection   x:collection1] o.a.s.c.SolrConfig current version of requestparams : -1
   [junit4]   2> 1320049 INFO  (coreLoadExecutor-5054-thread-1-processing-n:127.0.0.1:38908_) [n:127.0.0.1:38908_ c:control_collection   x:collection1] o.a.s.c.SolrConfig Using Lucene MatchVersion: 5.5.0
   [junit4]   2> 1320072 INFO  (coreLoadExecutor-5054-thread-1-processing-n:127.0.0.1:38908_) [n:127.0.0.1:38908_ c:control_collection   x:collection1] o.a.s.c.SolrConfig Loaded SolrConfig: solrconfig.xml
   [junit4]   2> 1320077 INFO  (coreLoadExecutor-5054-thread-1-processing-n:127.0.0.1:38908_) [n:127.0.0.1:38908_ c:control_collection   x:collection1] o.a.s.s.IndexSchema [collection1] Schema name=test
   [junit4]   2> 1320216 INFO  (coreLoadExecutor-5054-thread-1-processing-n:127.0.0.1:38908_) [n:127.0.0.1:38908_ c:control_collection   x:collection1] o.a.s.s.OpenExchangeRatesOrgProvider Initialized with rates=open-exchange-rates.json, refreshInterval=1440.
   [junit4]   2> 1320221 INFO  (coreLoadExecutor-5054-thread-1-processing-n:127.0.0.1:38908_) [n:127.0.0.1:38908_ c:control_collection   x:collection1] o.a.s.s.IndexSchema default search field in schema is text
   [junit4]   2> 1320222 INFO  (coreLoadExecutor-5054-thread-1-processing-n:127.0.0.1:38908_) [n:127.0.0.1:38908_ c:control_collection   x:collection1] o.a.s.s.IndexSchema unique key field: id
   [junit4]   2> 1320226 INFO  (coreLoadExecutor-5054-thread-1-processing-n:127.0.0.1:38908_) [n:127.0.0.1:38908_ c:control_collection   x:collection1] o.a.s.s.FileExchangeRateProvider Reloading exchange rates from file currency.xml
   [junit4]   2> 1320228 INFO  (coreLoadExecutor-5054-thread-1-processing-n:127.0.0.1:38908_) [n:127.0.0.1:38908_ c:control_collection   x:collection1] o.a.s.s.FileExchangeRateProvider Reloading exchange rates from file currency.xml
   [junit4]   2> 1320229 INFO  (coreLoadExecutor-5054-thread-1-processing-n:127.0.0.1:38908_) [n:127.0.0.1:38908_ c:control_collection   x:collection1] o.a.s.s.OpenExchangeRatesOrgProvider Reloading exchange rates from open-exchange-rates.json
   [junit4]   2> 1320230 INFO  (coreLoadExecutor-5054-thread-1-processing-n:127.0.0.1:38908_) [n:127.0.0.1:38908_ c:control_collection   x:collection1] o.a.s.s.OpenExchangeRatesOrgProvider Reloading exchange rates from open-exchange-rates.json
   [junit4]   2> 1320231 INFO  (coreLoadExecutor-5054-thread-1-processing-n:127.0.0.1:38908_) [n:127.0.0.1:38908_ c:control_collection   x:collection1] o.a.s.c.ConfigSetProperties Did not find ConfigSet properties, assuming default properties: Can't find resource 'configsetprops.json' in classpath or '/configs/conf1', cwd=/home/jenkins/workspace/Lucene-Solr-5.x-Linux/solr/build/solr-core/test/J1
   [junit4]   2> 1320231 INFO  (coreLoadExecutor-5054-thread-1-processing-n:127.0.0.1:38908_) [n:127.0.0.1:38908_ c:control_collection   x:collection1] o.a.s.c.CoreContainer Creating SolrCore 'collection1' using configuration from collection control_collection
   [junit4]   2> 1320231 INFO  (coreLoadExecutor-5054-thread-1-processing-n:127.0.0.1:38908_) [n:127.0.0.1:38908_ c:control_collection s:shard1 r:core_node1 x:collection1] o.a.s.c.SolrCore org.apache.solr.core.MockDirectoryFactory
   [junit4]   2> 1320231 INFO  (coreLoadExecutor-5054-thread-1-processing-n:127.0.0.1:38908_) [n:127.0.0.1:38908_ c:control_collection s:shard1 r:core_node1 x:collection1] o.a.s.c.SolrCore [[collection1] ] Opening new SolrCore at [/home/jenkins/workspace/Lucene-Solr-5.x-Linux/solr/build/solr-core/test/J1/temp/solr.cloud.HttpPartitionTest_E8435E692B7981E0-001/control-001/cores/collection1], dataDir=[/home/jenkins/workspace/Lucene-Solr-5.x-Linux/solr/build/solr-core/test/J1/temp/solr.cloud.HttpPartitionTest_E8435E692B7981E0-001/control-001/cores/collection1/data/]
   [junit4]   2> 1320231 INFO  (coreLoadExecutor-5054-thread-1-processing-n:127.0.0.1:38908_) [n:127.0.0.1:38908_ c:control_collection s:shard1 r:core_node1 x:collection1] o.a.s.c.JmxMonitoredMap JMX monitoring is enabled. Adding Solr mbeans to JMX Server: com.sun.jmx.mbeanserver.JmxMBeanServer@62bb3825
   [junit4]   2> 1320231 INFO  (coreLoadExecutor-5054-thread-1-processing-n:127.0.0.1:38908_) [n:127.0.0.1:38908_ c:control_collection s:shard1 r:core_node1 x:collection1] o.a.s.c.CachingDirectoryFactory return new directory for /home/jenkins/workspace/Lucene-Solr-5.x-Linux/solr/build/solr-core/test/J1/temp/solr.cloud.HttpPartitionTest_E8435E692B7981E0-001/control-001/cores/collection1/data
   [junit4]   2> 1320231 INFO  (coreLoadExecutor-5054-thread-1-processing-n:127.0.0.1:38908_) [n:127.0.0.1:38908_ c:control_collection s:shard1 r:core_node1 x:collection1] o.a.s.c.SolrCore New index directory detected: old=null new=/home/jenkins/workspace/Lucene-Solr-5.x-Linux/solr/build/solr-core/test/J1/temp/solr.cloud.HttpPartitionTest_E8435E692B7981E0-001/control-001/cores/collection1/data/index/
   [junit4]   2> 1320232 WARN  (coreLoadExecutor-5054-thread-1-processing-n:127.0.0.1:38908_) [n:127.0.0.1:38908_ c:control_collection s:shard1 r:core_node1 x:collection1] o.a.s.c.SolrCore [collection1] Solr index directory '/home/jenkins/workspace/Lucene-Solr-5.x-Linux/solr/build/solr-core/test/J1/temp/solr.cloud.HttpPartitionTest_E8435E692B7981E0-001/control-001/cores/collection1/data/index' doesn't exist. Creating new index...
   [junit4]   2> 1320232 INFO  (coreLoadExecutor-5054-thread-1-processing-n:127.0.0.1:38908_) [n:127.0.0.1:38908_ c:control_collection s:shard1 r:core_node1 x:collection1] o.a.s.c.CachingDirectoryFactory return new directory for /home/jenkins/workspace/Lucene-Solr-5.x-Linux/solr/build/solr-core/test/J1/temp/solr.cloud.HttpPartitionTest_E8435E692B7981E0-001/control-001/cores/collection1/data/index
   [junit4]   2> 1320232 INFO  (coreLoadExecutor-5054-thread-1-processing-n:127.0.0.1:38908_) [n:127.0.0.1:38908_ c:control_collection s:shard1 r:core_node1 x:collection1] o.a.s.u.RandomMergePolicy RandomMergePolicy wrapping class org.apache.lucene.index.AlcoholicMergePolicy: [AlcoholicMergePolicy: minMergeSize=0, mergeFactor=10, maxMergeSize=1047339682, maxMergeSizeForForcedMerge=9223372036854775807, calibrateSizeByDeletes=true, maxMergeDocs=2147483647, maxCFSSegmentSizeMB=8.796093022207999E12, noCFSRatio=0.1]
   [junit4]   2> 1320232 INFO  (coreLoadExecutor-5054-thread-1-processing-n:127.0.0.1:38908_) [n:127.0.0.1:38908_ c:control_collection s:shard1 r:core_node1 x:collection1] o.a.s.c.SolrDeletionPolicy SolrDeletionPolicy.onCommit: commits: num=1
   [junit4]   2> 	commit{dir=MockDirectoryWrapper(RAMDirectory@1c0216c6 lockFactory=org.apache.lucene.store.SingleInstanceLockFactory@4d252f87),segFN=segments_1,generation=1}
   [junit4]   2> 1320232 INFO  (coreLoadExecutor-5054-thread-1-processing-n:127.0.0.1:38908_) [n:127.0.0.1:38908_ c:control_collection s:shard1 r:core_node1 x:collection1] o.a.s.c.SolrDeletionPolicy newest commit generation = 1
   [junit4]   2> 1320233 INFO  (OldIndexDirectoryCleanupThreadForCore-collection1) [n:127.0.0.1:38908_ c:control_collection s:shard1 r:core_node1 x:collection1] o.a.s.c.SolrCore Looking for old index directories to cleanup for core collection1 in /home/jenkins/workspace/Lucene-Solr-5.x-Linux/solr/build/solr-core/test/J1/temp/solr.cloud.HttpPartitionTest_E8435E692B7981E0-001/control-001/cores/collection1/data/
   [junit4]   2> 1320233 WARN  (OldIndexDirectoryCleanupThreadForCore-collection1) [n:127.0.0.1:38908_ c:control_collection s:shard1 r:core_node1 x:collection1] o.a.s.c.DirectoryFactory /home/jenkins/workspace/Lucene-Solr-5.x-Linux/solr/build/solr-core/test/J1/temp/solr.cloud.HttpPartitionTest_E8435E692B7981E0-001/control-001/cores/collection1/data/ does not point to a valid data directory; skipping clean-up of old index directories.
   [junit4]   2> 1320235 INFO  (coreLoadExecutor-5054-thread-1-processing-n:127.0.0.1:38908_) [n:127.0.0.1:38908_ c:control_collection s:shard1 r:core_node1 x:collection1] o.a.s.u.p.UpdateRequestProcessorChain creating updateRequestProcessorChain "nodistrib"
   [junit4]   2> 1320235 INFO  (coreLoadExecutor-5054-thread-1-processing-n:127.0.0.1:38908_) [n:127.0.0.1:38908_ c:control_collection s:shard1 r:core_node1 x:collection1] o.a.s.u.p.UpdateRequestProcessorChain creating updateRequestProcessorChain "dedupe"
   [junit4]   2> 1320235 INFO  (coreLoadExecutor-5054-thread-1-processing-n:127.0.0.1:38908_) [n:127.0.0.1:38908_ c:control_collection s:shard1 r:core_node1 x:collection1] o.a.s.u.p.UpdateRequestProcessorChain inserting DistributedUpdateProcessorFactory into updateRequestProcessorChain "dedupe"
   [junit4]   2> 1320235 INFO  (coreLoadExecutor-5054-thread-1-processing-n:127.0.0.1:38908_) [n:127.0.0.1:38908_ c:control_collection s:shard1 r:core_node1 x:collection1] o.a.s.u.p.UpdateRequestProcessorChain creating updateRequestProcessorChain "stored_sig"
   [junit4]   2> 1320235 INFO  (coreLoadExecutor-5054-thread-1-processing-n:127.0.0.1:38908_) [n:127.0.0.1:38908_ c:control_collection s:shard1 r:core_node1 x:collection1] o.a.s.u.p.UpdateRequestProcessorChain inserting DistributedUpdateProcessorFactory into updateRequestProcessorChain "stored_sig"
   [junit4]   2> 1320235 INFO  (coreLoadExecutor-5054-thread-1-processing-n:127.0.0.1:38908_) [n:127.0.0.1:38908_ c:control_collection s:shard1 r:core_node1 x:collection1] o.a.s.u.p.UpdateRequestProcessorChain creating updateRequestProcessorChain "distrib-dup-test-chain-explicit"
   [junit4]   2> 1320235 INFO  (coreLoadExecutor-5054-thread-1-processing-n:127.0.0.1:38908_) [n:127.0.0.1:38908_ c:control_collection s:shard1 r:core_node1 x:collection1] o.a.s.u.p.UpdateRequestProcessorChain creating updateRequestProcessorChain "distrib-dup-test-chain-implicit"
   [junit4]   2> 1320235 INFO  (coreLoadExecutor-5054-thread-1-processing-n:127.0.0.1:38908_) [n:127.0.0.1:38908_ c:control_collection s:shard1 r:core_node1 x:collection1] o.a.s.u.p.UpdateRequestProcessorChain inserting DistributedUpdateProcessorFactory into updateRequestProcessorChain "distrib-dup-test-chain-implicit"
   [junit4]   2> 1320235 INFO  (coreLoadExecutor-5054-thread-1-processing-n:127.0.0.1:38908_) [n:127.0.0.1:38908_ c:control_collection s:shard1 r:core_node1 x:collection1] o.a.s.c.SolrCore no updateRequestProcessorChain defined as default, creating implicit default
   [junit4]   2> 1320235 WARN  (coreLoadExecutor-5054-thread-1-processing-n:127.0.0.1:38908_) [n:127.0.0.1:38908_ c:control_collection s:shard1 r:core_node1 x:collection1] o.a.s.c.RequestHandlers INVALID paramSet a in requestHandler {type = requestHandler,name = /dump,class = DumpRequestHandler,args = {defaults={a=A,b=B}}}
   [junit4]   2> 1320237 INFO  (coreLoadExecutor-5054-thread-1-processing-n:127.0.0.1:38908_) [n:127.0.0.1:38908_ c:control_collection s:shard1 r:core_node1 x:collection1] o.a.s.h.l.XMLLoader xsltCacheLifetimeSeconds=60
   [junit4]   2> 1320237 INFO  (coreLoadExecutor-5054-thread-1-processing-n:127.0.0.1:38908_) [n:127.0.0.1:38908_ c:control_collection s:shard1 r:core_node1 x:collection1] o.a.s.h.l.XMLLoader xsltCacheLifetimeSeconds=60
   [junit4]   2> 1320238 INFO  (coreLoadExecutor-5054-thread-1-processing-n:127.0.0.1:38908_) [n:127.0.0.1:38908_ c:control_collection s:shard1 r:core_node1 x:collection1] o.a.s.h.l.XMLLoader xsltCacheLifetimeSeconds=60
   [junit4]   2> 1320239 INFO  (coreLoadExecutor-5054-thread-1-processing-n:127.0.0.1:38908_) [n:127.0.0.1:38908_ c:control_collection s:shard1 r:core_node1 x:collection1] o.a.s.h.l.XMLLoader xsltCacheLifetimeSeconds=60
   [junit4]   2> 1320241 INFO  (coreLoadExecutor-5054-thread-1-processing-n:127.0.0.1:38908_) [n:127.0.0.1:38908_ c:control_collection s:shard1 r:core_node1 x:collection1] o.a.s.c.RequestHandlers Registered paths: /schema,/admin/threads,/update,/admin/segments,/admin/ping,/replication,/admin/mbeans,/admin/logging,/get,/config,/admin/properties,/admin/system,/dump,/admin/plugins,/admin/file,standard,/admin/luke,/update/json/docs,/update/csv,/update/json
   [junit4]   2> 1320242 INFO  (coreLoadExecutor-5054-thread-1-processing-n:127.0.0.1:38908_) [n:127.0.0.1:38908_ c:control_collection s:shard1 r:core_node1 x:collection1] o.a.s.c.SolrCore Using default statsCache cache: org.apache.solr.search.stats.LocalStatsCache
   [junit4]   2> 1320242 INFO  (coreLoadExecutor-5054-thread-1-processing-n:127.0.0.1:38908_) [n:127.0.0.1:38908_ c:control_collection s:shard1 r:core_node1 x:collection1] o.a.s.u.UpdateHandler Using UpdateLog implementation: org.apache.solr.update.UpdateLog
   [junit4]   2> 1320242 INFO  (coreLoadExecutor-5054-thread-1-processing-n:127.0.0.1:38908_) [n:127.0.0.1:38908_ c:control_collection s:shard1 r:core_node1 x:collection1] o.a.s.u.UpdateLog Initializing UpdateLog: dataDir= defaultSyncLevel=FLUSH numRecordsToKeep=100 maxNumLogsToKeep=10 numVersionBuckets=65536
   [junit4]   2> 1320243 INFO  (coreLoadExecutor-5054-thread-1-processing-n:127.0.0.1:38908_) [n:127.0.0.1:38908_ c:control_collection s:shard1 r:core_node1 x:collection1] o.a.s.u.CommitTracker Hard AutoCommit: disabled
   [junit4]   2> 1320243 INFO  (coreLoadExecutor-5054-thread-1-processing-n:127.0.0.1:38908_) [n:127.0.0.1:38908_ c:control_collection s:shard1 r:core_node1 x:collection1] o.a.s.u.CommitTracker Soft AutoCommit: disabled
   [junit4]   2> 1320243 INFO  (coreLoadExecutor-5054-thread-1-processing-n:127.0.0.1:38908_) [n:127.0.0.1:38908_ c:control_collection s:shard1 r:core_node1 x:collection1] o.a.s.u.RandomMergePolicy RandomMergePolicy wrapping class org.apache.lucene.index.TieredMergePolicy: [TieredMergePolicy: maxMergeAtOnce=15, maxMergeAtOnceExplicit=44, maxMergedSegmentMB=14.2822265625, floorSegmentMB=1.3916015625, forceMergeDeletesPctAllowed=18.012071983338572, segmentsPerTier=15.0, maxCFSSegmentSizeMB=8.796093022207999E12, noCFSRatio=1.0
   [junit4]   2> 1320243 INFO  (coreLoadExecutor-5054-thread-1-processing-n:127.0.0.1:38908_) [n:127.0.0.1:38908_ c:control_collection s:shard1 r:core_node1 x:collection1] o.a.s.c.SolrDeletionPolicy SolrDeletionPolicy.onInit: commits: num=1
   [junit4]   2> 	commit{dir=MockDirectoryWrapper(RAMDirectory@1c0216c6 lockFactory=org.apache.lucene.store.SingleInstanceLockFactory@4d252f87),segFN=segments_1,generation=1}
   [junit4]   2> 1320243 INFO  (coreLoadExecutor-5054-thread-1-processing-n:127.0.0.1:38908_) [n:127.0.0.1:38908_ c:control_collection s:shard1 r:core_node1 x:collection1] o.a.s.c.SolrDeletionPolicy newest commit generation = 1
   [junit4]   2> 1320243 INFO  (coreLoadExecutor-5054-thread-1-processing-n:127.0.0.1:38908_) [n:127.0.0.1:38908_ c:control_collection s:shard1 r:core_node1 x:collection1] o.a.s.s.SolrIndexSearcher Opening Searcher@4cb2bb7[collection1] main
   [junit4]   2> 1320243 INFO  (coreLoadExecutor-5054-thread-1-processing-n:127.0.0.1:38908_) [n:127.0.0.1:38908_ c:control_collection s:shard1 r:core_node1 x:collection1] o.a.s.c.c.ZkStateReader Load collection config from: [/collections/control_collection]
   [junit4]   2> 1320244 INFO  (coreLoadExecutor-5054-thread-1-processing-n:127.0.0.1:38908_) [n:127.0.0.1:38908_ c:control_collection s:shard1 r:core_node1 x:collection1] o.a.s.c.c.ZkStateReader path=[/collections/control_collection] [configName]=[conf1] specified config exists in ZooKeeper
   [junit4]   2> 1320244 INFO  (coreLoadExecutor-5054-thread-1-processing-n:127.0.0.1:38908_) [n:127.0.0.1:38908_ c:control_collection s:shard1 r:core_node1 x:collection1] o.a.s.r.ManagedResourceStorage Setting up ZooKeeper-based storage for the RestManager with znodeBase: /configs/conf1
   [junit4]   2> 1320244 INFO  (coreLoadExecutor-5054-thread-1-processing-n:127.0.0.1:38908_) [n:127.0.0.1:38908_ c:control_collection s:shard1 r:core_node1 x:collection1] o.a.s.r.ManagedResourceStorage Configured ZooKeeperStorageIO with znodeBase: /configs/conf1
   [junit4]   2> 1320244 INFO  (coreLoadExecutor-5054-thread-1-processing-n:127.0.0.1:38908_) [n:127.0.0.1:38908_ c:control_collection s:shard1 r:core_node1 x:collection1] o.a.s.r.RestManager Initializing RestManager with initArgs: {}
   [junit4]   2> 1320244 INFO  (coreLoadExecutor-5054-thread-1-processing-n:127.0.0.1:38908_) [n:127.0.0.1:38908_ c:control_collection s:shard1 r:core_node1 x:collection1] o.a.s.r.ManagedResourceStorage Reading _rest_managed.json using ZooKeeperStorageIO:path=/configs/conf1
   [junit4]   2> 1320244 INFO  (coreLoadExecutor-5054-thread-1-processing-n:127.0.0.1:38908_) [n:127.0.0.1:38908_ c:control_collection s:shard1 r:core_node1 x:collection1] o.a.s.r.ManagedResourceStorage No data found for znode /configs/conf1/_rest_managed.json
   [junit4]   2> 1320244 INFO  (coreLoadExecutor-5054-thread-1-processing-n:127.0.0.1:38908_) [n:127.0.0.1:38908_ c:control_collection s:shard1 r:core_node1 x:collection1] o.a.s.r.ManagedResourceStorage Loaded null at path _rest_managed.json using ZooKeeperStorageIO:path=/configs/conf1
   [junit4]   2> 1320244 INFO  (coreLoadExecutor-5054-thread-1-processing-n:127.0.0.1:38908_) [n:127.0.0.1:38908_ c:control_collection s:shard1 r:core_node1 x:collection1] o.a.s.r.RestManager Initializing 0 registered ManagedResources
   [junit4]   2> 1320244 INFO  (coreLoadExecutor-5054-thread-1-processing-n:127.0.0.1:38908_) [n:127.0.0.1:38908_ c:control_collection s:shard1 r:core_node1 x:collection1] o.a.s.h.ReplicationHandler Commits will be reserved for  10000
   [junit4]   2> 1320245 INFO  (searcherExecutor-5055-thread-1-processing-n:127.0.0.1:38908_ c:control_collection s:shard1 x:collection1 r:core_node1) [n:127.0.0.1:38908_ c:control_collection s:shard1 r:core_node1 x:collection1] o.a.s.c.SolrCore [collection1] Registered new searcher Searcher@4cb2bb7[collection1] main{ExitableDirectoryReader(UninvertingDirectoryReader())}
   [junit4]   2> 1320245 INFO  (coreLoadExecutor-5054-thread-1-processing-n:127.0.0.1:38908_) [n:127.0.0.1:38908_ c:control_collection s:shard1 r:core_node1 x:collection1] o.a.s.u.UpdateLog Looking up max value of version field to seed version buckets
   [junit4]   2> 1320245 INFO  (coreLoadExecutor-5054-thread-1-processing-n:127.0.0.1:38908_) [n:127.0.0.1:38908_ c:control_collection s:shard1 r:core_node1 x:collection1] o.a.s.u.VersionInfo Refreshing highest value of _version_ for 65536 version buckets from index
   [junit4]   2> 1320245 INFO  (coreLoadExecutor-5054-thread-1-processing-n:127.0.0.1:38908_) [n:127.0.0.1:38908_ c:control_collection s:shard1 r:core_node1 x:collection1] o.a.s.u.VersionInfo No terms found for _version_, cannot seed version bucket highest value from index
   [junit4]   2> 1320245 INFO  (coreLoadExecutor-5054-thread-1-processing-n:127.0.0.1:38908_) [n:127.0.0.1:38908_ c:control_collection s:shard1 r:core_node1 x:collection1] o.a.s.u.UpdateLog Could not find max version in index or recent updates, using new clock 1526734044394422272
   [junit4]   2> 1320247 INFO  (coreLoadExecutor-5054-thread-1-processing-n:127.0.0.1:38908_) [n:127.0.0.1:38908_ c:control_collection s:shard1 r:core_node1 x:collection1] o.a.s.u.UpdateLog Took 1.0ms to seed version buckets with highest version 1526734044394422272
   [junit4]   2> 1320247 INFO  (coreLoadExecutor-5054-thread-1-processing-n:127.0.0.1:38908_) [n:127.0.0.1:38908_ c:control_collection s:shard1 r:core_node1 x:collection1] o.a.s.c.ZkController watch zkdir /configs/conf1
   [junit4]   2> 1320247 INFO  (coreLoadExecutor-5054-thread-1-processing-n:127.0.0.1:38908_) [n:127.0.0.1:38908_ c:control_collection s:shard1 r:core_node1 x:collection1] o.a.s.c.CoreContainer registering core: collection1
   [junit4]   2> 1320247 INFO  (coreZkRegister-5048-thread-1-processing-n:127.0.0.1:38908_ c:control_collection s:shard1 x:collection1 r:core_node1) [n:127.0.0.1:38908_ c:control_collection s:shard1 r:core_node1 x:collection1] o.a.s.c.ZkController Register replica - core:collection1 address:http://127.0.0.1:38908 collection:control_collection shard:shard1
   [junit4]   2> 1320248 INFO  (coreZkRegister-5048-thread-1-processing-n:127.0.0.1:38908_ c:control_collection s:shard1 x:collection1 r:core_node1) [n:127.0.0.1:38908_ c:control_collection s:shard1 r:core_node1 x:collection1] o.a.s.c.c.SolrZkClient makePath: /collections/control_collection/leader_elect/shard1/election
   [junit4]   2> 1320249 INFO  (coreZkRegister-5048-thread-1-processing-n:127.0.0.1:38908_ c:control_collection s:shard1 x:collection1 r:core_node1) [n:127.0.0.1:38908_ c:control_collection s:shard1 r:core_node1 x:collection1] o.a.s.c.LeaderElector Joined leadership election with path: /collections/control_collection/leader_elect/shard1/election/95420877681655812-core_node1-n_0000000000
   [junit4]   2> 1320249 INFO  (coreZkRegister-5048-thread-1-processing-n:127.0.0.1:38908_ c:control_collection s:shard1 x:collection1 r:core_node1) [n:127.0.0.1:38908_ c:control_collection s:shard1 r:core_node1 x:collection1] o.a.s.c.ShardLeaderElectionContext Running the leader process for shard=shard1 and weAreReplacement=false and leaderVoteWait=10000
   [junit4]   2> 1320250 INFO  (coreZkRegister-5048-thread-1-processing-n:127.0.0.1:38908_ c:control_collection s:shard1 x:collection1 r:core_node1) [n:127.0.0.1:38908_ c:control_collection s:shard1 r:core_node1 x:collection1] o.a.s.c.ShardLeaderElectionContext Enough replicas found to continue.
   [junit4]   2> 1320250 INFO  (coreZkRegister-5048-thread-1-processing-n:127.0.0.1:38908_ c:control_collection s:shard1 x:collection1 r:core_node1) [n:127.0.0.1:38908_ c:control_collection s:shard1 r:core_node1 x:collection1] o.a.s.c.ShardLeaderElectionContext I may be the new leader - try and sync
   [junit4]   2> 1320250 INFO  (coreZkRegister-5048-thread-1-processing-n:127.0.0.1:38908_ c:control_collection s:shard1 x:collection1 r:core_node1) [n:127.0.0.1:38908_ c:control_collection s:shard1 r:core_node1 x:collection1] o.a.s.c.SyncStrategy Sync replicas to http://127.0.0.1:38908/collection1/
   [junit4]   2> 1320250 INFO  (OverseerStateUpdate-95420877681655812-127.0.0.1:38908_-n_0000000000) [n:127.0.0.1:38908_    ] o.a.s.c.Overseer processMessage: queueSize: 1, message = {
   [junit4]   2>   "operation":"leader",
   [junit4]   2>   "shard":"shard1",
   [junit4]   2>   "collection":"control_collection"} current state version: 1
   [junit4]   2> 1320250 INFO  (coreZkRegister-5048-thread-1-processing-n:127.0.0.1:38908_ c:control_collection s:shard1 x:collection1 r:core_node1) [n:127.0.0.1:38908_ c:control_collection s:shard1 r:core_node1 x:collection1] o.a.s.c.SyncStrategy Sync Success - now sync replicas to me
   [junit4]   2> 1320250 INFO  (coreZkRegister-5048-thread-1-processing-n:127.0.0.1:38908_ c:control_collection s:shard1 x:collection1 r:core_node1) [n:127.0.0.1:38908_ c:control_collection s:shard1 r:core_node1 x:collection1] o.a.s.c.SyncStrategy http://127.0.0.1:38908/collection1/ has no replicas
   [junit4]   2> 1320250 INFO  (coreZkRegister-5048-thread-1-processing-n:127.0.0.1:38908_ c:control_collection s:shard1 x:collection1 r:core_node1) [n:127.0.0.1:38908_ c:control_collection s:shard1 r:core_node1 x:collection1] o.a.s.c.c.SolrZkClient makePath: /collections/control_collection/leaders/shard1
   [junit4]   2> 1320251 INFO  (coreZkRegister-5048-thread-1-processing-n:127.0.0.1:38908_ c:control_collection s:shard1 x:collection1 r:core_node1) [n:127.0.0.1:38908_ c:control_collection s:shard1 r:core_node1 x:collection1] o.a.s.c.ShardLeaderElectionContextBase Creating leader registration node
   [junit4]   2> 1320252 INFO  (coreZkRegister-5048-thread-1-processing-n:127.0.0.1:38908_ c:control_collection s:shard1 x:collection1 r:core_node1) [n:127.0.0.1:38908_ c:control_collection s:shard1 r:core_node1 x:collection1] o.a.s.c.ShardLeaderElectionContext I am the new leader: http://127.0.0.1:38908/collection1/ shard1
   [junit4]   2> 1320252 INFO  (OverseerStateUpdate-95420877681655812-127.0.0.1:38908_-n_0000000000) [n:127.0.0.1:38908_    ] o.a.s.c.Overseer processMessage: queueSize: 1, message = {
   [junit4]   2>   "operation":"leader",
   [junit4]   2>   "shard":"shard1",
   [junit4]   2>   "collection":"control_collection",
   [junit4]   2>   "base_url":"http://127.0.0.1:38908",
   [junit4]   2>   "core":"collection1",
   [junit4]   2>   "state":"active"} current state version: 1
   [junit4]   2> 1320353 INFO  (zkCallback-1513-thread-1-processing-n:127.0.0.1:38908_) [n:127.0.0.1:38908_    ] o.a.s.c.c.ZkStateReader A cluster state change: [WatchedEvent state:SyncConnected type:NodeDataChanged path:/clusterstate.json], has occurred - updating... (live nodes size: [1])
   [junit4]   2> 1320403 INFO  (coreZkRegister-5048-thread-1-processing-n:127.0.0.1:38908_ c:control_collection s:shard1 x:collection1 r:core_node1) [n:127.0.0.1:38908_ c:control_collection s:shard1 r:core_node1 x:collection1] o.a.s.c.ZkController We are http://127.0.0.1:38908/collection1/ and leader is http://127.0.0.1:38908/collection1/
   [junit4]   2> 1320403 INFO  (coreZkRegister-5048-thread-1-processing-n:127.0.0.1:38908_ c:control_collection s:shard1 x:collection1 r:core_node1) [n:127.0.0.1:38908_ c:control_collection s:shard1 r:core_node1 x:collection1] o.a.s.c.ZkController No LogReplay needed for core=collection1 baseURL=http://127.0.0.1:38908
   [junit4]   2> 1320403 INFO  (coreZkRegister-5048-thread-1-processing-n:127.0.0.1:38908_ c:control_collection s:shard1 x:collection1 r:core_node1) [n:127.0.0.1:38908_ c:control_collection s:shard1 r:core_node1 x:collection1] o.a.s.c.ZkController I am the leader, no recovery necessary
   [junit4]   2> 1320403 INFO  (coreZkRegister-5048-thread-1-processing-n:127.0.0.1:38908_ c:control_collection s:shard1 x:collection1 r:core_node1) [n:127.0.0.1:38908_ c:control_collection s:shard1 r:core_node1 x:collection1] o.a.s.c.ZkController publishing state=active
   [junit4]   2> 1320403 INFO  (coreZkRegister-5048-thread-1-processing-n:127.0.0.1:38908_ c:control_collection s:shard1 x:collection1 r:core_node1) [n:127.0.0.1:38908_ c:control_collection s:shard1 r:core_node1 x:collection1] o.a.s.c.ZkController numShards not found on descriptor - reading it from system property
   [junit4]   2> 1320404 INFO  (OverseerStateUpdate-95420877681655812-127.0.0.1:38908_-n_0000000000) [n:127.0.0.1:38908_    ] o.a.s.c.Overseer processMessage: queueSize: 1, message = {
   [junit4]   2>   "roles":null,
   [junit4]   2>   "numShards":"1",
   [junit4]   2>   "node_name":"127.0.0.1:38908_",
   [junit4]   2>   "operation":"state",
   [junit4]   2>   "collection":"control_collection",
   [junit4]   2>   "shard":"shard1",
   [junit4]   2>   "core":"collection1",
   [junit4]   2>   "core_node_name":"core_node1",
   [junit4]   2>   "base_url":"http://127.0.0.1:38908",
   [junit4]   2>   "state":"active"} current state version: 2
   [junit4]   2> 1320404 INFO  (OverseerStateUpdate-95420877681655812-127.0.0.1:38908_-n_0000000000) [n:127.0.0.1:38908_    ] o.a.s.c.o.ReplicaMutator Update state numShards=1 message={
   [junit4]   2>   "roles":null,
   [junit4]   2>   "numShards":"1",
   [junit4]   2>   "node_name":"127.0.0.1:38908_",
   [junit4]   2>   "operation":"state",
   [junit4]   2>   "collection":"control_collection",
   [junit4]   2>   "shard":"shard1",
   [junit4]   2>   "core":"collection1",
   [junit4]   2>   "core_node_name":"core_node1",
   [junit4]   2>   "base_url":"http://127.0.0.1:38908",
   [junit4]   2>   "state":"active"}
   [junit4]   2> 1320505 INFO  (zkCallback-1513-thread-1-processing-n:127.0.0.1:38908_) [n:127.0.0.1:38908_    ] o.a.s.c.c.ZkStateReader A cluster state change: [WatchedEvent state:SyncConnected type:NodeDataChanged path:/clusterstate.json], has occurred - updating... (live nodes size: [1])
   [junit4]   2> 1320536 INFO  (TEST-HttpPartitionTest.test-seed#[E8435E692B7981E0]) [    ] o.a.s.c.c.SolrZkClient Using default ZkCredentialsProvider
   [junit4]   2> 1320536 INFO  (TEST-HttpPartitionTest.test-seed#[E8435E692B7981E0]) [    ] o.a.s.c.c.ConnectionManager Waiting for client to connect to ZooKeeper
   [junit4]   2> 1320537 INFO  (zkCallback-1515-thread-1) [    ] o.a.s.c.c.ConnectionManager Watcher org.apache.solr.common.cloud.ConnectionManager@461ddbb4 name:ZooKeeperConnection Watcher:127.0.0.1:46308/solr got event WatchedEvent state:SyncConnected type:None path:null path:null type:None
   [junit4]   2> 1320537 INFO  (TEST-HttpPartitionTest.test-seed#[E8435E692B7981E0]) [    ] o.a.s.c.c.ConnectionManager Client is connected to ZooKeeper
   [junit4]   2> 1320537 INFO  (TEST-HttpPartitionTest.test-seed#[E8435E692B7981E0]) [    ] o.a.s.c.c.SolrZkClient Using default ZkACLProvider
   [junit4]   2> 1320537 INFO  (TEST-HttpPartitionTest.test-seed#[E8435E692B7981E0]) [    ] o.a.s.c.c.ZkStateReader Updating cluster state from ZooKeeper... 
   [junit4]   2> 1320539 INFO  (TEST-HttpPartitionTest.test-seed#[E8435E692B7981E0]) [    ] o.a.s.c.ChaosMonkey monkey: init - expire sessions:false cause connection loss:false
   [junit4]   2> 1320589 INFO  (TEST-HttpPartitionTest.test-seed#[E8435E692B7981E0]) [    ] o.a.s.SolrTestCaseJ4 Writing core.properties file to /home/jenkins/workspace/Lucene-Solr-5.x-Linux/solr/build/solr-core/test/J1/temp/solr.cloud.HttpPartitionTest_E8435E692B7981E0-001/shard-1-001/cores/collection1
   [junit4]   2> 1320589 INFO  (TEST-HttpPartitionTest.test-seed#[E8435E692B7981E0]) [    ] o.a.s.c.AbstractFullDistribZkTestBase create jetty 1 in directory /home/jenkins/workspace/Lucene-Solr-5.x-Linux/solr/build/solr-core/test/J1/temp/solr.cloud.HttpPartitionTest_E8435E692B7981E0-001/shard-1-001
   [junit4]   2> 1320590 INFO  (TEST-HttpPartitionTest.test-seed#[E8435E692B7981E0]) [    ] o.e.j.s.Server jetty-9.2.13.v20150730
   [junit4]   2> 1320591 INFO  (TEST-HttpPartitionTest.test-seed#[E8435E692B7981E0]) [    ] o.e.j.s.h.ContextHandler Started o.e.j.s.ServletContextHandler@7426b411{/,null,AVAILABLE}
   [junit4]   2> 1320591 INFO  (TEST-HttpPartitionTest.test-seed#[E8435E692B7981E0]) [    ] o.e.j.s.ServerConnector Started ServerConnector@42b89ab4{HTTP/1.1}{127.0.0.1:44469}
   [junit4]   2> 1320591 INFO  (TEST-HttpPartitionTest.test-seed#[E8435E692B7981E0]) [    ] o.e.j.s.Server Started @1322146ms
   [junit4]   2> 1320591 INFO  (TEST-HttpPartitionTest.test-seed#[E8435E692B7981E0]) [    ] o.a.s.c.s.e.JettySolrRunner Jetty properties: {coreRootDirectory=/home/jenkins/workspace/Lucene-Solr-5.x-Linux/solr/build/solr-core/test/J1/temp/solr.cloud.HttpPartitionTest_E8435E692B7981E0-001/shard-1-001/cores, hostPort=33640, solrconfig=solrconfig.xml, hostContext=/, solr.data.dir=/home/jenkins/workspace/Lucene-Solr-5.x-Linux/solr/build/solr-core/test/J1/temp/solr.cloud.HttpPartitionTest_E8435E692B7981E0-001/tempDir-001/jetty1}
   [junit4]   2> 1320591 INFO  (TEST-HttpPartitionTest.test-seed#[E8435E692B7981E0]) [    ] o.a.s.s.SolrDispatchFilter SolrDispatchFilter.init(): sun.misc.Launcher$AppClassLoader@3033b503
   [junit4]   2> 1320592 INFO  (TEST-HttpPartitionTest.test-seed#[E8435E692B7981E0]) [    ] o.a.s.c.SolrResourceLoader new SolrResourceLoader for directory: '/home/jenkins/workspace/Lucene-Solr-5.x-Linux/solr/build/solr-core/test/J1/temp/solr.cloud.HttpPartitionTest_E8435E692B7981E0-001/shard-1-001'
   [junit4]   2> 1320592 INFO  (TEST-HttpPartitionTest.test-seed#[E8435E692B7981E0]) [    ] o.a.s.c.SolrResourceLoader JNDI not configured for solr (NoInitialContextEx)
   [junit4]   2> 1320592 INFO  (TEST-HttpPartitionTest.test-seed#[E8435E692B7981E0]) [    ] o.a.s.c.SolrResourceLoader solr home defaulted to 'solr/' (could not find system property or JNDI)
   [junit4]   2> 1320592 INFO  (TEST-HttpPartitionTest.test-seed#[E8435E692B7981E0]) [    ] o.a.s.c.c.SolrZkClient Using default ZkCredentialsProvider
   [junit4]   2> 1320592 INFO  (TEST-HttpPartitionTest.test-seed#[E8435E692B7981E0]) [    ] o.a.s.c.c.ConnectionManager Waiting for client to connect to ZooKeeper
   [junit4]   2> 1320593 INFO  (zkCallback-1516-thread-1) [    ] o.a.s.c.c.ConnectionManager Watcher org.apache.solr.common.cloud.ConnectionManager@698f121d name:ZooKeeperConnection Watcher:127.0.0.1:46308/solr got event WatchedEvent state:SyncConnected type:None path:null path:null type:None
   [junit4]   2> 1320593 INFO  (TEST-HttpPartitionTest.test-seed#[E8435E692B7981E0]) [    ] o.a.s.c.c.ConnectionManager Client is connected to ZooKeeper
   [junit4]   2> 1320593 INFO  (TEST-HttpPartitionTest.test-seed#[E8435E692B7981E0]) [    ] o.a.s.c.c.SolrZkClient Using default ZkACLProvider
   [junit4]   2> 1320594 INFO  (TEST-HttpPartitionTest.test-seed#[E8435E692B7981E0]) [    ] o.a.s.s.SolrDispatchFilter Loading solr.xml from SolrHome (not found in ZooKeeper)
   [junit4]   2> 1320594 INFO  (TEST-HttpPartitionTest.test-seed#[E8435E692B7981E0]) [    ] o.a.s.c.SolrXmlConfig Loading container configuration from /home/jenkins/workspace/Lucene-Solr-5.x-Linux/solr/build/solr-core/test/J1/temp/solr.cloud.HttpPartitionTest_E8435E692B7981E0-001/shard-1-001/solr.xml
   [junit4]   2> 1320601 INFO  (TEST-HttpPartitionTest.test-seed#[E8435E692B7981E0]) [    ] o.a.s.c.CorePropertiesLocator Config-defined core root directory: /home/jenkins/workspace/Lucene-Solr-5.x-Linux/solr/build/solr-core/test/J1/temp/solr.cloud.HttpPartitionTest_E8435E692B7981E0-001/shard-1-001/cores
   [junit4]   2> 1320602 INFO  (TEST-HttpPartitionTest.test-seed#[E8435E692B7981E0]) [    ] o.a.s.c.CoreContainer New CoreContainer 195037523
   [junit4]   2> 1320602 INFO  (TEST-HttpPartitionTest.test-seed#[E8435E692B7981E0]) [    ] o.a.s.c.CoreContainer Loading cores into CoreContainer [instanceDir=/home/jenkins/workspace/Lucene-Solr-5.x-Linux/solr/build/solr-core/test/J1/temp/solr.cloud.HttpPartitionTest_E8435E692B7981E0-001/shard-1-001]
   [junit4]   2> 1320602 WARN  (TEST-HttpPartitionTest.test-seed#[E8435E692B7981E0]) [    ] o.a.s.c.CoreContainer Couldn't add files from /home/jenkins/workspace/Lucene-Solr-5.x-Linux/solr/build/solr-core/test/J1/temp/solr.cloud.HttpPartitionTest_E8435E692B7981E0-001/shard-1-001/lib to classpath: /home/jenkins/workspace/Lucene-Solr-5.x-Linux/solr/build/solr-core/test/J1/temp/solr.cloud.HttpPartitionTest_E8435E692B7981E0-001/shard-1-001/lib
   [junit4]   2> 1320602 INFO  (TEST-HttpPartitionTest.test-seed#[E8435E692B7981E0]) [    ] o.a.s.h.c.HttpShardHandlerFactory created with socketTimeout : 90000,urlScheme : ,connTimeout : 15000,maxConnectionsPerHost : 20,maxConnections : 10000,corePoolSize : 0,maximumPoolSize : 2147483647,maxThreadIdleTime : 5,sizeOfQueue : -1,fairnessPolicy : false,useRetries : false,
   [junit4]   2> 1320603 INFO  (TEST-HttpPartitionTest.test-seed#[E8435E692B7981E0]) [    ] o.a.s.u.UpdateShardHandler Creating UpdateShardHandler HTTP client with params: socketTimeout=340000&connTimeout=45000&retry=true
   [junit4]   2> 1320603 INFO  (TEST-HttpPartitionTest.test-seed#[E8435E692B7981E0]) [    ] o.a.s.l.LogWatcher SLF4J impl is org.slf4j.impl.Log4jLoggerFactory
   [junit4]   2> 1320603 INFO  (TEST-HttpPartitionTest.test-seed#[E8435E692B7981E0]) [    ] o.a.s.l.LogWatcher Registering Log Listener [Log4j (org.slf4j.impl.Log4jLoggerFactory)]
   [junit4]   2> 1320603 INFO  (TEST-HttpPartitionTest.test-seed#[E8435E692B7981E0]) [    ] o.a.s.c.ZkContainer Zookeeper client=127.0.0.1:46308/solr
   [junit4]   2> 1320603 INFO  (TEST-HttpPartitionTest.test-seed#[E8435E692B7981E0]) [    ] o.a.s.c.ZkController zkHost includes chroot
   [junit4]   2> 1320603 INFO  (TEST-HttpPartitionTest.test-seed#[E8435E692B7981E0]) [    ] o.a.s.c.c.SolrZkClient Using default ZkCredentialsProvider
   [junit4]   2> 1320603 INFO  (TEST-HttpPartitionTest.test-seed#[E8435E692B7981E0]) [    ] o.a.s.c.c.ConnectionManager Waiting for client to connect to ZooKeeper
   [junit4]   2> 1320604 INFO  (zkCallback-1519-thread-1) [    ] o.a.s.c.c.ConnectionManager Watcher org.apache.solr.common.cloud.ConnectionManager@5202d33a name:ZooKeeperConnection Watcher:127.0.0.1:46308 got event WatchedEvent state:SyncConnected type:None path:null path:null type:None
   [junit4]   2> 1320604 INFO  (TEST-HttpPartitionTest.test-seed#[E8435E692B7981E0]) [    ] o.a.s.c.c.ConnectionManager Client is connected to ZooKeeper
   [junit4]   2> 1320605 INFO  (TEST-HttpPartitionTest.test-seed#[E8435E692B7981E0]) [    ] o.a.s.c.c.SolrZkClient Using default ZkACLProvider
   [junit4]   2> 1320605 INFO  (TEST-HttpPartitionTest.test-seed#[E8435E692B7981E0]) [n:127.0.0.1:33640_    ] o.a.s.c.c.ConnectionManager Waiting for client to connect to ZooKeeper
   [junit4]   2> 1320606 INFO  (zkCallback-1520-thread-1-processing-n:127.0.0.1:33640_) [n:127.0.0.1:33640_    ] o.a.s.c.c.ConnectionManager Watcher org.apache.solr.common.cloud.ConnectionManager@109d9094 name:ZooKeeperConnection Watcher:127.0.0.1:46308/solr got event WatchedEvent state:SyncConnected type:None path:null path:null type:None
   [junit4]   2> 1320606 INFO  (TEST-HttpPartitionTest.test-seed#[E8435E692B7981E0]) [n:127.0.0.1:33640_    ] o.a.s.c.c.ConnectionManager Client is connected to ZooKeeper
   [junit4]   2> 1320608 INFO  (TEST-HttpPartitionTest.test-seed#[E8435E692B7981E0]) [n:127.0.0.1:33640_    ] o.a.s.c.c.ZkStateReader Updating cluster state from ZooKeeper... 
   [junit4]   2> 1321610 INFO  (TEST-HttpPartitionTest.test-seed#[E8435E692B7981E0]) [n:127.0.0.1:33640_    ] o.a.s.c.ZkController Register node as live in ZooKeeper:/live_nodes/127.0.0.1:33640_
   [junit4]   2> 1321610 INFO  (TEST-HttpPartitionTest.test-seed#[E8435E692B7981E0]) [n:127.0.0.1:33640_    ] o.a.s.c.c.SolrZkClient makePath: /live_nodes/127.0.0.1:33640_
   [junit4]   2> 1321611 INFO  (zkCallback-1513-thread-1-processing-n:127.0.0.1:38908_) [n:127.0.0.1:38908_    ] o.a.s.c.c.ZkStateReader A live node change: [WatchedEvent state:SyncConnected type:NodeChildrenChanged path:/live_nodes], has occurred - updating... (live nodes size: [1])
   [junit4]   2> 1321611 INFO  (zkCallback-1520-thread-1-processing-n:127.0.0.1:33640_) [n:127.0.0.1:33640_    ] o.a.s.c.c.ZkStateReader A live node change: [WatchedEvent state:SyncConnected type:NodeChildrenChanged path:/live_nodes], has occurred - updating... (live nodes size: [1])
   [junit4]   2> 1321611 INFO  (zkCallback-1515-thread-1) [    ] o.a.s.c.c.ZkStateReader A live node change: [WatchedEvent state:SyncConnected type:NodeChildrenChanged path:/live_nodes], has occurred - updating... (live nodes size: [1])
   [junit4]   2> 1321612 INFO  (TEST-HttpPartitionTest.test-seed#[E8435E692B7981E0]) [n:127.0.0.1:33640_    ] o.a.s.c.Overseer Overseer (id=null) closing
   [junit4]   2> 1321612 INFO  (TEST-HttpPartitionTest.test-seed#[E8435E692B7981E0]) [n:127.0.0.1:33640_    ] o.a.s.c.LeaderElector Joined leadership election with path: /overseer_elect/election/95420877681655816-127.0.0.1:33640_-n_0000000001
   [junit4]   2> 1321612 INFO  (TEST-HttpPartitionTest.test-seed#[E8435E692B7981E0]) [n:127.0.0.1:33640_    ] o.a.s.c.LeaderElector Watching path /overseer_elect/election/95420877681655812-127.0.0.1:38908_-n_0000000000 to know if I could be the leader
   [junit4]   2> 1321619 INFO  (TEST-HttpPartitionTest.test-seed#[E8435E692B7981E0]) [n:127.0.0.1:33640_    ] o.a.s.c.CoreContainer Security conf doesn't exist. Skipping setup for authorization module.
   [junit4]   2> 1321619 INFO  (TEST-HttpPartitionTest.test-seed#[E8435E692B7981E0]) [n:127.0.0.1:33640_    ] o.a.s.c.CoreContainer No authentication plugin used.
   [junit4]   2> 1321619 INFO  (TEST-HttpPartitionTest.test-seed#[E8435E692B7981E0]) [n:127.0.0.1:33640_    ] o.a.s.c.CorePropertiesLocator Looking for core definitions underneath /home/jenkins/workspace/Lucene-Solr-5.x-Linux/solr/build/solr-core/test/J1/temp/solr.cloud.HttpPartitionTest_E8435E692B7981E0-001/shard-1-001/cores
   [junit4]   2> 1321620 INFO  (TEST-HttpPartitionTest.test-seed#[E8435E692B7981E0]) [n:127.0.0.1:33640_    ] o.a.s.c.CoreDescriptor Created CoreDescriptor: {loadOnStartup=true, configSetProperties=configsetprops.json, coreNodeName=, name=collection1, shard=, collection=collection1, config=solrconfig.xml, transient=false, schema=schema.xml, dataDir=data/}
   [junit4]   2> 1321620 INFO  (TEST-HttpPartitionTest.test-seed#[E8435E692B7981E0]) [n:127.0.0.1:33640_    ] o.a.s.c.CorePropertiesLocator Found core collection1 in /home/jenkins/workspace/Lucene-Solr-5.x-Linux/solr/build/solr-core/test/J1/temp/solr.cloud.HttpPartitionTest_E8435E692B7981E0-001/shard-1-001/cores/collection1
   [junit4]   2> 1321620 INFO  (TEST-HttpPartitionTest.test-seed#[E8435E692B7981E0]) [n:127.0.0.1:33640_    ] o.a.s.c.CorePropertiesLocator Found 1 core definitions
   [junit4]   2> 1321620 INFO  (TEST-HttpPartitionTest.test-seed#[E8435E692B7981E0]) [n:127.0.0.1:33640_    ] o.a.s.s.SolrDispatchFilter user.dir=/home/jenkins/workspace/Lucene-Solr-5.x-Linux/solr/build/solr-core/test/J1
   [junit4]   2> 1321621 INFO  (TEST-HttpPartitionTest.test-seed#[E8435E692B7981E0]) [n:127.0.0.1:33640_    ] o.a.s.s.SolrDispatchFilter SolrDispatchFilter.init() done
   [junit4]   2> 1321621 INFO  (coreLoadExecutor-5065-thread-1-processing-n:127.0.0.1:33640_) [n:127.0.0.1:33640_ c:collection1   x:collection1] o.a.s.c.ZkController publishing state=down
   [junit4]   2> 1321621 INFO  (coreLoadExecutor-5065-thread-1-processing-n:127.0.0.1:33640_) [n:127.0.0.1:33640_ c:collection1   x:collection1] o.a.s.c.ZkController numShards not found on descriptor - reading it from system property
   [junit4]   2> 1321621 INFO  (coreLoadExecutor-5065-thread-1-processing-n:127.0.0.1:33640_) [n:127.0.0.1:33640_ c:collection1   x:collection1] o.a.s.c.ZkController look for our core node name
   [junit4]   2> 1321621 INFO  (OverseerStateUpdate-95420877681655812-127.0.0.1:38908_-n_0000000000) [n:127.0.0.1:38908_    ] o.a.s.c.Overseer processMessage: queueSize: 1, message = {
   [junit4]   2>   "roles":null,
   [junit4]   2>   "numShards":"2",
   [junit4]   2>   "node_name":"127.0.0.1:33640_",
   [junit4]   2>   "operation":"state",
   [junit4]   2>   "collection":"collection1",
   [junit4]   2>   "shard":null,
   [junit4]   2>   "core":"collection1",
   [junit4]   2>   "base_url":"http://127.0.0.1:33640",
   [junit4]   2>   "state":"down"} current state version: 3
   [junit4]   2> 1321622 INFO  (OverseerStateUpdate-95420877681655812-127.0.0.1:38908_-n_0000000000) [n:127.0.0.1:38908_    ] o.a.s.c.o.ReplicaMutator Update state numShards=2 message={
   [junit4]   2>   "roles":null,
   [junit4]   2>   "numShards":"2",
   [junit4]   2>   "node_name":"127.0.0.1:33640_",
   [junit4]   2>   "operation":"state",
   [junit4]   2>   "collection":"collection1",
   [junit4]   2>   "shard":null,
   [junit4]   2>   "core":"collection1",
   [junit4]   2>   "base_url":"http://127.0.0.1:33640",
   [junit4]   2>   "state":"down"}
   [junit4]   2> 1321622 INFO  (OverseerStateUpdate-95420877681655812-127.0.0.1:38908_-n_0000000000) [n:127.0.0.1:38908_    ] o.a.s.c.o.ClusterStateMutator building a new cName: collection1
   [junit4]   2> 1321622 INFO  (OverseerStateUpdate-95420877681655812-127.0.0.1:38908_-n_0000000000) [n:127.0.0.1:38908_    ] o.a.s.c.o.ReplicaMutator Assigning new node to shard shard=shard1
   [junit4]   2> 1321723 INFO  (zkCallback-1515-thread-1) [    ] o.a.s.c.c.ZkStateReader A cluster state change: [WatchedEvent state:SyncConnected type:NodeDataChanged path:/clusterstate.json], has occurred - updating... (live nodes size: [2])
   [junit4]   2> 1321723 INFO  (zkCallback-1520-thread-1-processing-n:127.0.0.1:33640_) [n:127.0.0.1:33640_    ] o.a.s.c.c.ZkStateReader A cluster state change: [WatchedEvent state:SyncConnected type:NodeDataChanged path:/clusterstate.json], has occurred - updating... (live nodes size: [2])
   [junit4]   2> 1321723 INFO  (zkCallback-1513-thread-1-processing-n:127.0.0.1:38908_) [n:127.0.0.1:38908_    ] o.a.s.c.c.ZkStateReader A cluster state change: [WatchedEvent state:SyncConnected type:NodeDataChanged path:/clusterstate.json], has occurred - updating... (live nodes size: [2])
   [junit4]   2> 1322621 INFO  (coreLoadExecutor-5065-thread-1-processing-n:127.0.0.1:33640_) [n:127.0.0.1:33640_ c:collection1   x:collection1] o.a.s.c.ZkController waiting to find shard id in clusterstate for collection1
   [junit4]   2> 1322622 INFO  (coreLoadExecutor-5065-thread-1-processing-n:127.0.0.1:33640_) [n:127.0.0.1:33640_ c:collection1   x:collection1] o.a.s.c.ZkController Check for collection zkNode:collection1
   [junit4]   2> 1322622 INFO  (coreLoadExecutor-5065-thread-1-processing-n:127.0.0.1:33640_) [n:127.0.0.1:33640_ c:collection1   x:collection1] o.a.s.c.ZkController Collection zkNode exists
   [junit4]   2> 1322622 INFO  (coreLoadExecutor-5065-thread-1-processing-n:127.0.0.1:33640_) [n:127.0.0.1:33640_ c:collection1   x:collection1] o.a.s.c.c.ZkStateReader Load collection config from: [/collections/collection1]
   [junit4]   2> 1322622 INFO  (coreLoadExecutor-5065-thread-1-processing-n:127.0.0.1:33640_) [n:127.0.0.1:33640_ c:collection1   x:collection1] o.a.s.c.c.ZkStateReader path=[/collections/collection1] [configName]=[conf1] specified config exists in ZooKeeper
   [junit4]   2> 1322622 INFO  (coreLoadExecutor-5065-thread-1-processing-n:127.0.0.1:33640_) [n:127.0.0.1:33640_ c:collection1   x:collection1] o.a.s.c.SolrResourceLoader new SolrResourceLoader for directory: '/home/jenkins/workspace/Lucene-Solr-5.x-Linux/solr/build/solr-core/test/J1/temp/solr.cloud.HttpPartitionTest_E8435E692B7981E0-001/shard-1-001/cores/collection1'
   [junit4]   2> 1322622 INFO  (coreLoadExecutor-5065-thread-1-processing-n:127.0.0.1:33640_) [n:127.0.0.1:33640_ c:collection1   x:collection1] o.a.s.c.SolrResourceLoader JNDI not configured for solr (NoInitialContextEx)
   [junit4]   2> 1322622 INFO  (coreLoadExecutor-5065-thread-1-processing-n:127.0.0.1:33640_) [n:127.0.0.1:33640_ c:collection1   x:collection1] o.a.s.c.SolrResourceLoader solr home defaulted to 'solr/' (could not find system property or JNDI)
   [junit4]   2> 1322623 INFO  (coreLoadExecutor-5065-thread-1-processing-n:127.0.0.1:33640_) [n:127.0.0.1:33640_ c:collection1   x:collection1] o.a.s.c.Config loaded config solrconfig.xml with version 0 
   [junit4]   2> 1322626 INFO  (coreLoadExecutor-5065-thread-1-processing-n:127.0.0.1:33640_) [n:127.0.0.1:33640_ c:collection1   x:collection1] o.a.s.c.SolrConfig current version of requestparams : -1
   [junit4]   2> 1322634 INFO  (coreLoadExecutor-5065-thread-1-processing-n:127.0.0.1:33640_) [n:127.0.0.1:33640_ c:collection1   x:collection1] o.a.s.c.SolrConfig Using Lucene MatchVersion: 5.5.0
   [junit4]   2> 1322651 INFO  (coreLoadExecutor-5065-thread-1-processing-n:127.0.0.1:33640_) [n:127.0.0.1:33640_ c:collection1   x:collection1] o.a.s.c.SolrConfig Loaded SolrConfig: solrconfig.xml
   [junit4]   2> 1322655 INFO  (coreLoadExecutor-5065-thread-1-processing-n:127.0.0.1:33640_) [n:127.0.0.1:33640_ c:collection1   x:collection1] o.a.s.s.IndexSchema [collection1] Schema name=test
   [junit4]   2> 1322800 INFO  (coreLoadExecutor-5065-thread-1-processing-n:127.0.0.1:33640_) [n:127.0.0.1:33640_ c:collection1   x:collection1] o.a.s.s.OpenExchangeRatesOrgProvider Initialized with rates=open-exchange-rates.json, refreshInterval=1440.
   [junit4]   2> 1322805 INFO  (coreLoadExecutor-5065-thread-1-processing-n:127.0.0.1:33640_) [n:127.0.0.1:33640_ c:collection1   x:collection1] o.a.s.s.IndexSchema default search field in schema is text
   [junit4]   2> 1322807 INFO  (coreLoadExecutor-5065-thread-1-processing-n:127.0.0.1:33640_) [n:127.0.0.1:33640_ c:collection1   x:collection1] o.a.s.s.IndexSchema unique key field: id
   [junit4]   2> 1322811 INFO  (coreLoadExecutor-5065-thread-1-processing-n:127.0.0.1:33640_) [n:127.0.0.1:33640_ c:collection1   x:collection1] o.a.s.s.FileExchangeRateProvider Reloading exchange rates from file currency.xml
   [junit4]   2> 1322814 INFO  (coreLoadExecutor-5065-thread-1-processing-n:127.0.0.1:33640_) [n:127.0.0.1:33640_ c:collection1   x:collection1] o.a.s.s.FileExchangeRateProvider Reloading exchange rates from file currency.xml
   [junit4]   2> 1322817 INFO  (coreLoadExecutor-5065-thread-1-processing-n:127.0.0.1:33640_) [n:127.0.0.1:33640_ c:collection1   x:collection1] o.a.s.s.OpenExchangeRatesOrgProvider Reloading exchange rates from open-exchange-rates.json
   [junit4]   2> 1322817 INFO  (coreLoadExecutor-5065-thread-1-processing-n:127.0.0.1:33640_) [n:127.0.0.1:33640_ c:collection1   x:collection1] o.a.s.s.OpenExchangeRatesOrgProvider Reloading exchange rates from open-exchange-rates.json
   [junit4]   2> 1322818 INFO  (coreLoadExecutor-5065-thread-1-processing-n:127.0.0.1:33640_) [n:127.0.0.1:33640_ c:collection1   x:collection1] o.a.s.c.ConfigSetProperties Did not find ConfigSet properties, assuming default properties: Can't find resource 'configsetprops.json' in classpath or '/configs/conf1', cwd=/home/jenkins/workspace/Lucene-Solr-5.x-Linux/solr/build/solr-core/test/J1
   [junit4]   2> 1322818 INFO  (coreLoadExecutor-5065-thread-1-processing-n:127.0.0.1:33640_) [n:127.0.0.1:33640_ c:collection1   x:collection1] o.a.s.c.CoreContainer Creating SolrCore 'collection1' using configuration from collection collection1
   [junit4]   2> 1322818 INFO  (coreLoadExecutor-5065-thread-1-processing-n:127.0.0.1:33640_) [n:127.0.0.1:33640_ c:collection1 s:shard1 r:core_node1 x:collection1] o.a.s.c.SolrCore org.apache.solr.core.MockDirectoryFactory
   [junit4]   2> 1322818 INFO  (coreLoadExecutor-5065-thread-1-processing-n:127.0.0.1:33640_) [n:127.0.0.1:33640_ c:collection1 s:shard1 r:core_node1 x:collection1] o.a.s.c.SolrCore [[collection1] ] Opening new SolrCore at [/home/jenkins/workspace/Lucene-Solr-5.x-Linux/solr/build/solr-core/test/J1/temp/solr.cloud.HttpPartitionTest_E8435E692B7981E0-001/shard-1-001/cores/collection1], dataDir=[/home/jenkins/workspace/Lucene-Solr-5.x-Linux/solr/build/solr-core/test/J1/temp/solr.cloud.HttpPartitionTest_E8435E692B7981E0-001/shard-1-001/cores/collection1/data/]
   [junit4]   2> 1322819 INFO  (coreLoadExecutor-5065-thread-1-processing-n:127.0.0.1:33640_) [n:127.0.0.1:33640_ c:collection1 s:shard1 r:core_node1 x:collection1] o.a.s.c.JmxMonitoredMap JMX monitoring is enabled. Adding Solr mbeans to JMX Server: com.sun.jmx.mbeanserver.JmxMBeanServer@62bb3825
   [junit4]   2> 1322819 INFO  (coreLoadExecutor-5065-thread-1-processing-n:127.0.0.1:33640_) [n:127.0.0.

[...truncated too long message...]

88012 INFO  (coreCloseExecutor-6763-thread-1) [    x:collection1] o.a.s.u.SolrCoreState Closing SolrCoreState
   [junit4]   2> 2188012 INFO  (coreCloseExecutor-6763-thread-1) [    x:collection1] o.a.s.u.DefaultSolrCoreState SolrCoreState ref count has reached 0 - closing IndexWriter
   [junit4]   2> 2188012 INFO  (coreCloseExecutor-6763-thread-1) [    x:collection1] o.a.s.u.DefaultSolrCoreState closing IndexWriter with IndexWriterCloser
   [junit4]   2> 2188013 INFO  (coreCloseExecutor-6763-thread-1) [    x:collection1] o.a.s.c.SolrDeletionPolicy SolrDeletionPolicy.onCommit: commits: num=2
   [junit4]   2> 	commit{dir=MockDirectoryWrapper(RAMDirectory@1bf77636 lockFactory=org.apache.lucene.store.SingleInstanceLockFactory@1371e192),segFN=segments_2,generation=2}
   [junit4]   2> 	commit{dir=MockDirectoryWrapper(RAMDirectory@1bf77636 lockFactory=org.apache.lucene.store.SingleInstanceLockFactory@1371e192),segFN=segments_3,generation=3}
   [junit4]   2> 2188013 INFO  (coreCloseExecutor-6763-thread-1) [    x:collection1] o.a.s.c.SolrDeletionPolicy newest commit generation = 3
   [junit4]   2> 2188013 INFO  (coreCloseExecutor-6763-thread-1) [    x:collection1] o.a.s.c.SolrCore [collection1] Closing main searcher on request.
   [junit4]   2> 2188019 INFO  (coreCloseExecutor-6763-thread-1) [    x:collection1] o.a.s.c.CachingDirectoryFactory Closing MockDirectoryFactory - 2 directories currently being tracked
   [junit4]   2> 2188019 INFO  (coreCloseExecutor-6763-thread-1) [    x:collection1] o.a.s.c.CachingDirectoryFactory looking to close /home/jenkins/workspace/Lucene-Solr-5.x-Linux/solr/build/solr-core/test/J1/temp/solr.search.mlt.SimpleMLTQParserTest_E8435E692B7981E0-001/init-core-data-001 [CachedDir<<refCount=0;path=/home/jenkins/workspace/Lucene-Solr-5.x-Linux/solr/build/solr-core/test/J1/temp/solr.search.mlt.SimpleMLTQParserTest_E8435E692B7981E0-001/init-core-data-001;done=false>>]
   [junit4]   2> 2188019 INFO  (coreCloseExecutor-6763-thread-1) [    x:collection1] o.a.s.c.CachingDirectoryFactory Closing directory: /home/jenkins/workspace/Lucene-Solr-5.x-Linux/solr/build/solr-core/test/J1/temp/solr.search.mlt.SimpleMLTQParserTest_E8435E692B7981E0-001/init-core-data-001
   [junit4]   2> 2188020 INFO  (coreCloseExecutor-6763-thread-1) [    x:collection1] o.a.s.c.CachingDirectoryFactory looking to close /home/jenkins/workspace/Lucene-Solr-5.x-Linux/solr/build/solr-core/test/J1/temp/solr.search.mlt.SimpleMLTQParserTest_E8435E692B7981E0-001/init-core-data-001/index [CachedDir<<refCount=0;path=/home/jenkins/workspace/Lucene-Solr-5.x-Linux/solr/build/solr-core/test/J1/temp/solr.search.mlt.SimpleMLTQParserTest_E8435E692B7981E0-001/init-core-data-001/index;done=false>>]
   [junit4]   2> 2188020 INFO  (coreCloseExecutor-6763-thread-1) [    x:collection1] o.a.s.c.CachingDirectoryFactory Closing directory: /home/jenkins/workspace/Lucene-Solr-5.x-Linux/solr/build/solr-core/test/J1/temp/solr.search.mlt.SimpleMLTQParserTest_E8435E692B7981E0-001/init-core-data-001/index
   [junit4]   2> NOTE: leaving temporary files on disk at: /home/jenkins/workspace/Lucene-Solr-5.x-Linux/solr/build/solr-core/test/J1/temp/solr.search.mlt.SimpleMLTQParserTest_E8435E692B7981E0-001
   [junit4]   2> NOTE: test params are: codec=FastDecompressionCompressingStoredFields(storedFieldsFormat=CompressingStoredFieldsFormat(compressionMode=FAST_DECOMPRESSION, chunkSize=10, maxDocsPerChunk=257, blockSize=989), termVectorsFormat=CompressingTermVectorsFormat(compressionMode=FAST_DECOMPRESSION, chunkSize=10, blockSize=989)), sim=RandomSimilarity(queryNorm=false,coord=yes): {}, locale=ca-ES, timezone=Europe/Madrid
   [junit4]   2> NOTE: Linux 3.19.0-47-generic amd64/Oracle Corporation 1.7.0_80 (64-bit)/cpus=12,threads=1,free=135973176,total=534249472
   [junit4]   2> NOTE: All tests run in this JVM: [HdfsDirectoryTest, PreAnalyzedUpdateProcessorTest, AsyncMigrateRouteKeyTest, TestLMJelinekMercerSimilarityFactory, TestBinaryResponseWriter, TermVectorComponentTest, FastVectorHighlighterTest, MoreLikeThisHandlerTest, TestDynamicFieldCollectionResource, TestManagedSchemaDynamicFieldResource, TestEmbeddedSolrServerConstructors, TestSimpleTrackingShardHandler, SchemaVersionSpecificBehaviorTest, ZkStateWriterTest, CachingDirectoryFactoryTest, HdfsCollectionsAPIDistributedZkTest, UniqFieldsUpdateProcessorFactoryTest, TestRestoreCore, TestReloadDeadlock, TestConfigSetsAPIZkFailure, WordBreakSolrSpellCheckerTest, TestRequestStatusCollectionAPI, TestQueryTypes, SuggesterFSTTest, CollectionTooManyReplicasTest, NumericFieldsTest, DistributedMLTComponentTest, SimplePostToolTest, SolrPluginUtilsTest, UpdateRequestProcessorFactoryTest, TestTrie, DistributedSuggestComponentTest, CollectionsAPIDistributedZkTest, SolrIndexSplitterTest, AddSchemaFieldsUpdateProcessorFactoryTest, SpellPossibilityIteratorTest, HdfsThreadLeakTest, TestSolrQueryResponse, HdfsBasicDistributedZkTest, TestLFUCache, ClusterStateUpdateTest, TestDocumentBuilder, DistributedFacetPivotWhiteBoxTest, TestCustomDocTransformer, ZkCLITest, AliasIntegrationTest, TestExceedMaxTermLength, SpatialFilterTest, MBeansHandlerTest, TestConfigSetImmutable, DistributedFacetPivotLongTailTest, SimpleCollectionCreateDeleteTest, DistributedDebugComponentTest, TestCustomSort, ChaosMonkeyNothingIsSafeTest, DistributedIntervalFacetingTest, TestCollectionAPI, TestQuerySenderListener, BigEndianAscendingWordSerializerTest, CheckHdfsIndexTest, TestDynamicLoading, SortByFunctionTest, DocValuesTest, BlockJoinFacetRandomTest, TestCoreContainer, PKIAuthenticationIntegrationTest, ChaosMonkeySafeLeaderTest, SolrCmdDistributorTest, TestManagedResourceStorage, CSVRequestHandlerTest, TestCodecSupport, TestSolrCLIRunExample, TestSolrXml, TestDownShardTolerantSearch, TestSurroundQueryParser, RemoteQueryErrorTest, TestFileDictionaryLookup, EnumFieldTest, TestScoreJoinQPScore, BasicFunctionalityTest, ZkControllerTest, DOMUtilTest, StressHdfsTest, FullHLLTest, SolrIndexConfigTest, TestRuleBasedAuthorizationPlugin, LeaderFailoverAfterPartitionTest, TestRebalanceLeaders, TestQuerySenderNoQuery, TestSchemaSimilarityResource, TimeZoneUtilsTest, TestRandomDVFaceting, TestDistributedGrouping, TestRecovery, TestHashPartitioner, TestStressReorder, DistributedTermsComponentTest, StatsComponentTest, QueryElevationComponentTest, BadIndexSchemaTest, ConvertedLegacyTest, TestFiltering, SpellCheckCollatorTest, TestFoldingMultitermQuery, SuggesterWFSTTest, TestUpdate, TestRemoteStreaming, SolrInfoMBeanTest, TestQueryUtils, DirectSolrSpellCheckerTest, XmlUpdateRequestHandlerTest, TestValueSourceCache, TestSolrQueryParser, TestCollationField, BinaryUpdateRequestHandlerTest, HighlighterConfigTest, UpdateParamsTest, TestMergePolicyConfig, SampleTest, MinimalSchemaTest, TestPostingsSolrHighlighter, DirectSolrConnectionTest, SynonymTokenizerTest, TestSweetSpotSimilarityFactory, TestLMDirichletSimilarityFactory, TestJmxMonitoredMap, ScriptEngineTest, PluginInfoTest, PreAnalyzedFieldTest, DateFieldTest, TestRTGBase, SolrTestCaseJ4Test, TestCrossCoreJoin, TestCursorMarkWithoutUniqueKey, TestDistributedMissingSort, ConfigSetsAPITest, CustomCollectionTest, DeleteReplicaTest, DistribCursorPagingTest, DistribJoinFromCollectionTest, HttpPartitionTest, OverseerCollectionConfigSetProcessorTest, OverseerStatusTest, ReplicationFactorTest, RestartWhileUpdatingTest, RollingRestartTest, SharedFSAutoReplicaFailoverTest, SharedFSAutoReplicaFailoverUtilsTest, SolrXmlInZkTest, TestCloudInspectUtil, TestCloudPivotFacet, TestExclusionRuleCollectionAccess, TestLeaderInitiatedRecoveryThread, TestMiniSolrCloudClusterBase, TestRequestForwarding, TestShortCircuitedRequests, HdfsBasicDistributedZk2Test, HdfsChaosMonkeyNothingIsSafeTest, HdfsNNFailoverTest, HdfsRecoveryZkTest, HdfsRestartWhileUpdatingTest, HdfsSyncSliceTest, HdfsUnloadDistributedZkTest, TestClusterStateMutator, RuleEngineTest, RulesTest, DistributedFacetPivotSmallTest, SuggestComponentContextFilterQueryTest, TestIntervalFaceting, TestClassNameShortening, TestFieldCollectionResource, TestFieldResource, TestManagedSchemaFieldTypeResource, TestSerializedLuceneMatchVersion, TestSolrQueryParserDefaultOperatorResource, TestManagedStopFilterFactory, DocValuesMissingTest, TestCloudManagedSchema, TestCollationFieldDocValues, TestManagedSchema, TestSchemaManager, TestUseDocValuesAsStored, AnalyticsMergeStrategyTest, AnalyticsQueryTest, RankQueryTest, SortSpecParsingTest, TestAddFieldRealTimeGet, TestComplexPhraseQParserPlugin, TestFieldSortValues, TestHashQParserPlugin, TestInitQParser, TestMissingGroups, TestNoOpRegenerator, TestRandomCollapseQParserPlugin, BJQParserTest, TestScoreJoinQPNoScore, SimpleMLTQParserTest]
   [junit4] Completed [540/566 (2!)] on J1 in 1.66s, 1 test, 1 error <<< FAILURES!

[...truncated 90 lines...]
BUILD FAILED
/home/jenkins/workspace/Lucene-Solr-5.x-Linux/build.xml:750: The following error occurred while executing this line:
/home/jenkins/workspace/Lucene-Solr-5.x-Linux/build.xml:694: The following error occurred while executing this line:
/home/jenkins/workspace/Lucene-Solr-5.x-Linux/build.xml:59: The following error occurred while executing this line:
/home/jenkins/workspace/Lucene-Solr-5.x-Linux/solr/build.xml:233: The following error occurred while executing this line:
/home/jenkins/workspace/Lucene-Solr-5.x-Linux/solr/common-build.xml:534: The following error occurred while executing this line:
/home/jenkins/workspace/Lucene-Solr-5.x-Linux/lucene/common-build.xml:1477: The following error occurred while executing this line:
/home/jenkins/workspace/Lucene-Solr-5.x-Linux/lucene/common-build.xml:1033: There were test failures: 566 suites (7 ignored), 2279 tests, 1 suite-level error, 1 error, 84 ignored (39 assumptions) [seed: E8435E692B7981E0]

Total time: 58 minutes 55 seconds
Build step 'Invoke Ant' marked build as failure
Archiving artifacts
[WARNINGS] Skipping publisher since build result is FAILURE
Recording test results
Email was triggered for: Failure - Any
Sending email for trigger: Failure - Any