You are viewing a plain text version of this content. The canonical link for it is here.
Posted to yarn-dev@hadoop.apache.org by Apache Jenkins Server <je...@builds.apache.org> on 2014/08/11 18:38:19 UTC

Failed: YARN-2277 PreCommit Build #4587

Jira: https://issues.apache.org/jira/browse/YARN-2277
Build: https://builds.apache.org/job/PreCommit-YARN-Build/4587/

###################################################################################
########################## LAST 60 LINES OF THE CONSOLE ###########################
[...truncated 3906 lines...]
  against trunk revision .

    {color:green}+1 @author{color}.  The patch does not contain any @author tags.

    {color:green}+1 tests included{color}.  The patch appears to include 2 new or modified test files.

    {color:green}+1 javac{color}.  The applied patch does not increase the total number of javac compiler warnings.

    {color:green}+1 javadoc{color}.  There were no new javadoc warning messages.

    {color:green}+1 eclipse:eclipse{color}.  The patch built with eclipse:eclipse.

    {color:green}+1 findbugs{color}.  The patch does not introduce any new Findbugs (version 2.0.3) warnings.

    {color:green}+1 release audit{color}.  The applied patch does not increase the total number of release audit warnings.

    {color:red}-1 core tests{color}.  The patch failed these unit tests in hadoop-common-project/hadoop-common:

                  org.apache.hadoop.metrics2.impl.TestMetricsSystemImpl
                  org.apache.hadoop.ha.TestZKFailoverControllerStress

    {color:green}+1 contrib tests{color}.  The patch passed contrib unit tests.

Test results: https://builds.apache.org/job/PreCommit-YARN-Build/4587//testReport/
Console output: https://builds.apache.org/job/PreCommit-YARN-Build/4587//console

This message is automatically generated.


======================================================================
======================================================================
    Adding comment to Jira.
======================================================================
======================================================================


Comment added.
12699b59186cef0ec34e329eeaecf32f07fa2d71 logged out


======================================================================
======================================================================
    Finished build.
======================================================================
======================================================================


Build step 'Execute shell' marked build as failure
Archiving artifacts
Sending artifact delta relative to PreCommit-YARN-Build #4586
Archived 17 artifacts
Archive block size is 32768
Received 54 blocks and 7155497 bytes
Compression is 19.8%
Took 2.6 sec
[description-setter] Could not determine description.
Recording test results
Email was triggered for: Failure
Sending email for trigger: Failure



###################################################################################
############################## FAILED TESTS (if any) ##############################
2 tests failed.
FAILED:  org.apache.hadoop.ha.TestZKFailoverControllerStress.testExpireBackAndForth

Error Message:
KeeperErrorCode = NoNode

Stack Trace:
org.apache.zookeeper.KeeperException$NoNodeException: KeeperErrorCode = NoNode
	at org.apache.zookeeper.server.DataTree.getData(DataTree.java:648)
	at org.apache.zookeeper.server.ZKDatabase.getData(ZKDatabase.java:371)
	at org.apache.hadoop.ha.MiniZKFCCluster.expireActiveLockHolder(MiniZKFCCluster.java:199)
	at org.apache.hadoop.ha.MiniZKFCCluster.expireAndVerifyFailover(MiniZKFCCluster.java:234)
	at org.apache.hadoop.ha.TestZKFailoverControllerStress.testExpireBackAndForth(TestZKFailoverControllerStress.java:79)


FAILED:  org.apache.hadoop.metrics2.impl.TestMetricsSystemImpl.testMultiThreadedPublish

Error Message:
Metric not collected!
Metric not collected!
Metric not collected!
Metric not collected!
Metric not collected!
Metric not collected!
Metric not collected!
Metric not collected!
Metric not collected!
Passed

Stack Trace:
java.lang.AssertionError: Metric not collected!
Metric not collected!
Metric not collected!
Metric not collected!
Metric not collected!
Metric not collected!
Metric not collected!
Metric not collected!
Metric not collected!
Passed
	at org.junit.Assert.fail(Assert.java:88)
	at org.junit.Assert.assertTrue(Assert.java:41)
	at org.apache.hadoop.metrics2.impl.TestMetricsSystemImpl.testMultiThreadedPublish(TestMetricsSystemImpl.java:235)



Success: YARN-1813 PreCommit Build #4588

Posted by Apache Jenkins Server <je...@builds.apache.org>.
Jira: https://issues.apache.org/jira/browse/YARN-1813
Build: https://builds.apache.org/job/PreCommit-YARN-Build/4588/

###################################################################################
########################## LAST 60 LINES OF THE CONSOLE ###########################
[...truncated 3083 lines...]


{color:green}+1 overall{color}.  Here are the results of testing the latest attachment 
  http://issues.apache.org/jira/secure/attachment/12661008/YARN-1813.4.patch
  against trunk revision .

    {color:green}+1 @author{color}.  The patch does not contain any @author tags.

    {color:green}+1 tests included{color}.  The patch appears to include 1 new or modified test files.

    {color:green}+1 javac{color}.  The applied patch does not increase the total number of javac compiler warnings.

    {color:green}+1 javadoc{color}.  There were no new javadoc warning messages.

    {color:green}+1 eclipse:eclipse{color}.  The patch built with eclipse:eclipse.

    {color:green}+1 findbugs{color}.  The patch does not introduce any new Findbugs (version 2.0.3) warnings.

    {color:green}+1 release audit{color}.  The applied patch does not increase the total number of release audit warnings.

    {color:green}+1 core tests{color}.  The patch passed unit tests in hadoop-yarn-project/hadoop-yarn/hadoop-yarn-client hadoop-yarn-project/hadoop-yarn/hadoop-yarn-common.

    {color:green}+1 contrib tests{color}.  The patch passed contrib unit tests.

Test results: https://builds.apache.org/job/PreCommit-YARN-Build/4588//testReport/
Console output: https://builds.apache.org/job/PreCommit-YARN-Build/4588//console

This message is automatically generated.


======================================================================
======================================================================
    Adding comment to Jira.
======================================================================
======================================================================


Comment added.
9941e46859440419e0594e77f401ae8a31687629 logged out


======================================================================
======================================================================
    Finished build.
======================================================================
======================================================================


Archiving artifacts
Sending artifact delta relative to PreCommit-YARN-Build #4586
Archived 22 artifacts
Archive block size is 32768
Received 232 blocks and 830571 bytes
Compression is 90.2%
Took 0.56 sec
Description set: YARN-1813
Recording test results
Email was triggered for: Success
Sending email for trigger: Success



###################################################################################
############################## FAILED TESTS (if any) ##############################
All tests passed