You are viewing a plain text version of this content. The canonical link for it is here.
Posted to dev@kafka.apache.org by Apache Jenkins Server <je...@builds.apache.org> on 2017/08/14 17:02:47 UTC

Build failed in Jenkins: kafka-trunk-jdk7 #2639

See <https://builds.apache.org/job/kafka-trunk-jdk7/2639/display/redirect?page=changes>

Changes:

[ismael] KAFKA-5595; Ensure client connection ids are not reused too quickly

------------------------------------------
[...truncated 913.45 KB...]

kafka.server.epoch.LeaderEpochFileCacheTest > shouldNotResetEpochHistoryTailIfUndefinedPassed STARTED

kafka.server.epoch.LeaderEpochFileCacheTest > shouldNotResetEpochHistoryTailIfUndefinedPassed PASSED

kafka.server.epoch.LeaderEpochFileCacheTest > shouldReturnUnsupportedIfNoEpochRecorded STARTED

kafka.server.epoch.LeaderEpochFileCacheTest > shouldReturnUnsupportedIfNoEpochRecorded PASSED

kafka.server.epoch.LeaderEpochFileCacheTest > shouldRetainLatestEpochOnClearAllEarliest STARTED

kafka.server.epoch.LeaderEpochFileCacheTest > shouldRetainLatestEpochOnClearAllEarliest PASSED

kafka.server.epoch.LeaderEpochFileCacheTest > shouldPersistEpochsBetweenInstances STARTED

kafka.server.epoch.LeaderEpochFileCacheTest > shouldPersistEpochsBetweenInstances PASSED

kafka.server.epoch.LeaderEpochFileCacheTest > shouldNotClearAnythingIfOffsetToFirstOffset STARTED

kafka.server.epoch.LeaderEpochFileCacheTest > shouldNotClearAnythingIfOffsetToFirstOffset PASSED

kafka.server.epoch.LeaderEpochFileCacheTest > shouldNotLetOffsetsGoBackwardsEvenIfEpochsProgress STARTED

kafka.server.epoch.LeaderEpochFileCacheTest > shouldNotLetOffsetsGoBackwardsEvenIfEpochsProgress PASSED

kafka.server.epoch.LeaderEpochFileCacheTest > shouldGetFirstOffsetOfSubsequentEpochWhenOffsetRequestedForPreviousEpoch STARTED

kafka.server.epoch.LeaderEpochFileCacheTest > shouldGetFirstOffsetOfSubsequentEpochWhenOffsetRequestedForPreviousEpoch PASSED

kafka.server.epoch.LeaderEpochFileCacheTest > shouldUpdateOffsetBetweenEpochBoundariesOnClearEarliest2 STARTED

kafka.server.epoch.LeaderEpochFileCacheTest > shouldUpdateOffsetBetweenEpochBoundariesOnClearEarliest2 PASSED

kafka.server.epoch.LeaderEpochFileCacheTest > shouldClearEarliestOnEmptyCache STARTED

kafka.server.epoch.LeaderEpochFileCacheTest > shouldClearEarliestOnEmptyCache PASSED

kafka.server.epoch.LeaderEpochFileCacheTest > shouldPreserveResetOffsetOnClearEarliestIfOneExists STARTED

kafka.server.epoch.LeaderEpochFileCacheTest > shouldPreserveResetOffsetOnClearEarliestIfOneExists PASSED

kafka.server.epoch.LeaderEpochFileCacheTest > shouldUpdateOffsetBetweenEpochBoundariesOnClearEarliest STARTED

kafka.server.epoch.LeaderEpochFileCacheTest > shouldUpdateOffsetBetweenEpochBoundariesOnClearEarliest PASSED

kafka.server.epoch.LeaderEpochFileCacheTest > shouldReturnInvalidOffsetIfEpochIsRequestedWhichIsNotCurrentlyTracked STARTED

kafka.server.epoch.LeaderEpochFileCacheTest > shouldReturnInvalidOffsetIfEpochIsRequestedWhichIsNotCurrentlyTracked PASSED

kafka.server.epoch.LeaderEpochFileCacheTest > shouldFetchEndOffsetOfEmptyCache STARTED

kafka.server.epoch.LeaderEpochFileCacheTest > shouldFetchEndOffsetOfEmptyCache PASSED

kafka.server.epoch.LeaderEpochFileCacheTest > shouldRetainLatestEpochOnClearAllEarliestAndUpdateItsOffset STARTED

kafka.server.epoch.LeaderEpochFileCacheTest > shouldRetainLatestEpochOnClearAllEarliestAndUpdateItsOffset PASSED

kafka.server.epoch.LeaderEpochFileCacheTest > shouldClearAllEntries STARTED

kafka.server.epoch.LeaderEpochFileCacheTest > shouldClearAllEntries PASSED

kafka.server.epoch.LeaderEpochFileCacheTest > shouldClearLatestOnEmptyCache STARTED

kafka.server.epoch.LeaderEpochFileCacheTest > shouldClearLatestOnEmptyCache PASSED

kafka.server.epoch.LeaderEpochFileCacheTest > shouldNotResetEpochHistoryHeadIfUndefinedPassed STARTED

kafka.server.epoch.LeaderEpochFileCacheTest > shouldNotResetEpochHistoryHeadIfUndefinedPassed PASSED

kafka.server.epoch.LeaderEpochIntegrationTest > shouldIncreaseLeaderEpochBetweenLeaderRestarts STARTED

kafka.server.epoch.LeaderEpochIntegrationTest > shouldIncreaseLeaderEpochBetweenLeaderRestarts PASSED

kafka.server.epoch.LeaderEpochIntegrationTest > shouldAddCurrentLeaderEpochToMessagesAsTheyAreWrittenToLeader STARTED

kafka.server.epoch.LeaderEpochIntegrationTest > shouldAddCurrentLeaderEpochToMessagesAsTheyAreWrittenToLeader PASSED

kafka.server.epoch.LeaderEpochIntegrationTest > shouldSendLeaderEpochRequestAndGetAResponse STARTED

kafka.server.epoch.LeaderEpochIntegrationTest > shouldSendLeaderEpochRequestAndGetAResponse PASSED

kafka.server.epoch.OffsetsForLeaderEpochTest > shouldGetEpochsFromReplica STARTED

kafka.server.epoch.OffsetsForLeaderEpochTest > shouldGetEpochsFromReplica PASSED

kafka.server.epoch.OffsetsForLeaderEpochTest > shouldReturnUnknownTopicOrPartitionIfThrown STARTED

kafka.server.epoch.OffsetsForLeaderEpochTest > shouldReturnUnknownTopicOrPartitionIfThrown PASSED

kafka.server.epoch.OffsetsForLeaderEpochTest > shouldReturnNoLeaderForPartitionIfThrown STARTED

kafka.server.epoch.OffsetsForLeaderEpochTest > shouldReturnNoLeaderForPartitionIfThrown PASSED

kafka.server.epoch.EpochDrivenReplicationProtocolAcceptanceTest > shouldSurviveFastLeaderChange STARTED

kafka.server.epoch.EpochDrivenReplicationProtocolAcceptanceTest > shouldSurviveFastLeaderChange PASSED

kafka.server.epoch.EpochDrivenReplicationProtocolAcceptanceTest > offsetsShouldNotGoBackwards STARTED

kafka.server.epoch.EpochDrivenReplicationProtocolAcceptanceTest > offsetsShouldNotGoBackwards PASSED

kafka.server.epoch.EpochDrivenReplicationProtocolAcceptanceTest > shouldFollowLeaderEpochBasicWorkflow STARTED

kafka.server.epoch.EpochDrivenReplicationProtocolAcceptanceTest > shouldFollowLeaderEpochBasicWorkflow PASSED

kafka.server.epoch.EpochDrivenReplicationProtocolAcceptanceTest > shouldNotAllowDivergentLogs STARTED

kafka.server.epoch.EpochDrivenReplicationProtocolAcceptanceTest > shouldNotAllowDivergentLogs PASSED

kafka.server.MultipleListenersWithAdditionalJaasContextTest > testProduceConsume STARTED

kafka.server.MultipleListenersWithAdditionalJaasContextTest > testProduceConsume PASSED

kafka.server.OffsetCommitTest > testUpdateOffsets STARTED

kafka.server.OffsetCommitTest > testUpdateOffsets PASSED

kafka.server.OffsetCommitTest > testLargeMetadataPayload STARTED

kafka.server.OffsetCommitTest > testLargeMetadataPayload PASSED

kafka.server.OffsetCommitTest > testOffsetsDeleteAfterTopicDeletion STARTED

kafka.server.OffsetCommitTest > testOffsetsDeleteAfterTopicDeletion PASSED

kafka.server.OffsetCommitTest > testCommitAndFetchOffsets STARTED

kafka.server.OffsetCommitTest > testCommitAndFetchOffsets PASSED

kafka.server.OffsetCommitTest > testOffsetExpiration STARTED

kafka.server.OffsetCommitTest > testOffsetExpiration PASSED

kafka.server.OffsetCommitTest > testNonExistingTopicOffsetCommit STARTED

kafka.server.OffsetCommitTest > testNonExistingTopicOffsetCommit PASSED

kafka.server.ReplicationQuotasTest > shouldBootstrapTwoBrokersWithLeaderThrottle STARTED

kafka.server.ReplicationQuotasTest > shouldBootstrapTwoBrokersWithLeaderThrottle PASSED

kafka.server.ReplicationQuotasTest > shouldThrottleOldSegments STARTED

kafka.server.ReplicationQuotasTest > shouldThrottleOldSegments PASSED

kafka.server.ReplicationQuotasTest > shouldBootstrapTwoBrokersWithFollowerThrottle STARTED

kafka.server.ReplicationQuotasTest > shouldBootstrapTwoBrokersWithFollowerThrottle PASSED

kafka.server.EdgeCaseRequestTest > testInvalidApiVersionRequest STARTED

kafka.server.EdgeCaseRequestTest > testInvalidApiVersionRequest PASSED

kafka.server.EdgeCaseRequestTest > testMalformedHeaderRequest STARTED

kafka.server.EdgeCaseRequestTest > testMalformedHeaderRequest PASSED

kafka.server.EdgeCaseRequestTest > testProduceRequestWithNullClientId STARTED

kafka.server.EdgeCaseRequestTest > testProduceRequestWithNullClientId PASSED

kafka.server.EdgeCaseRequestTest > testInvalidApiKeyRequest STARTED

kafka.server.EdgeCaseRequestTest > testInvalidApiKeyRequest PASSED

kafka.server.EdgeCaseRequestTest > testHeaderOnlyRequest STARTED

kafka.server.EdgeCaseRequestTest > testHeaderOnlyRequest PASSED

kafka.server.SaslApiVersionsRequestTest > testApiVersionsRequestWithUnsupportedVersion STARTED

kafka.server.SaslApiVersionsRequestTest > testApiVersionsRequestWithUnsupportedVersion PASSED

kafka.server.SaslApiVersionsRequestTest > testApiVersionsRequestBeforeSaslHandshakeRequest STARTED

kafka.server.SaslApiVersionsRequestTest > testApiVersionsRequestBeforeSaslHandshakeRequest PASSED

kafka.server.SaslApiVersionsRequestTest > testApiVersionsRequestAfterSaslHandshakeRequest STARTED

kafka.server.SaslApiVersionsRequestTest > testApiVersionsRequestAfterSaslHandshakeRequest PASSED

kafka.metrics.MetricsTest > testMetricsReporterAfterDeletingTopic STARTED

kafka.metrics.MetricsTest > testMetricsReporterAfterDeletingTopic PASSED

kafka.metrics.MetricsTest > testBrokerTopicMetricsUnregisteredAfterDeletingTopic STARTED

kafka.metrics.MetricsTest > testBrokerTopicMetricsUnregisteredAfterDeletingTopic PASSED

kafka.metrics.MetricsTest > testClusterIdMetric STARTED

kafka.metrics.MetricsTest > testClusterIdMetric PASSED

kafka.metrics.MetricsTest > testControllerMetrics STARTED

kafka.metrics.MetricsTest > testControllerMetrics PASSED

kafka.metrics.MetricsTest > testMetricsLeak STARTED

kafka.metrics.MetricsTest > testMetricsLeak FAILED
    java.lang.AssertionError: expected:<1216> but was:<1219>
        at org.junit.Assert.fail(Assert.java:88)
        at org.junit.Assert.failNotEquals(Assert.java:834)
        at org.junit.Assert.assertEquals(Assert.java:645)
        at org.junit.Assert.assertEquals(Assert.java:631)
        at kafka.metrics.MetricsTest$$anonfun$testMetricsLeak$1.apply$mcVI$sp(MetricsTest.scala:68)
        at scala.collection.immutable.Range.foreach$mVc$sp(Range.scala:160)
        at kafka.metrics.MetricsTest.testMetricsLeak(MetricsTest.scala:66)

kafka.metrics.MetricsTest > testBrokerTopicMetricsBytesInOut STARTED

kafka.metrics.MetricsTest > testBrokerTopicMetricsBytesInOut PASSED

kafka.metrics.KafkaTimerTest > testKafkaTimer STARTED

kafka.metrics.KafkaTimerTest > testKafkaTimer PASSED

1542 tests completed, 1 failed, 4 skipped
:kafka-trunk-jdk7:core:test FAILED
:test_core_2_11 FAILED

FAILURE: Build failed with an exception.

* What went wrong:
Execution failed for task ':kafka-trunk-jdk7:core:test'.
> There were failing tests. See the report at: file://<https://builds.apache.org/job/kafka-trunk-jdk7/ws/core/build/reports/tests/test/index.html>

* Try:
Run with --stacktrace option to get the stack trace. Run with --info or --debug option to get more log output.

* Get more help at https://help.gradle.org

BUILD FAILED in 43m 38s
16 actionable tasks: 3 executed, 13 up-to-date
Build step 'Execute shell' marked build as failure
[FINDBUGS] Collecting findbugs analysis files...
Setting GRADLE_3_4_RC_2_HOME=/home/jenkins/jenkins-slave/tools/hudson.plugins.gradle.GradleInstallation/Gradle_3.4-rc-2
[FINDBUGS] Searching for all files in <https://builds.apache.org/job/kafka-trunk-jdk7/ws/> that match the pattern **/build/reports/findbugs/*.xml
[FINDBUGS] Parsing 1 file in <https://builds.apache.org/job/kafka-trunk-jdk7/ws/>
[FINDBUGS] Successfully parsed file <https://builds.apache.org/job/kafka-trunk-jdk7/ws/core/build/reports/findbugs/main.xml> with 0 unique warnings and 0 duplicates.
Setting GRADLE_3_4_RC_2_HOME=/home/jenkins/jenkins-slave/tools/hudson.plugins.gradle.GradleInstallation/Gradle_3.4-rc-2
Setting GRADLE_3_4_RC_2_HOME=/home/jenkins/jenkins-slave/tools/hudson.plugins.gradle.GradleInstallation/Gradle_3.4-rc-2
<Git Blamer> Using GitBlamer to create author and commit information for all warnings.
<Git Blamer> GIT_COMMIT=21ea4b1d2a1b99aa804bd4461015abaf31673923, workspace=<https://builds.apache.org/job/kafka-trunk-jdk7/ws/>
[FINDBUGS] Computing warning deltas based on reference build #2637
Recording test results
Setting GRADLE_3_4_RC_2_HOME=/home/jenkins/jenkins-slave/tools/hudson.plugins.gradle.GradleInstallation/Gradle_3.4-rc-2
Setting GRADLE_3_4_RC_2_HOME=/home/jenkins/jenkins-slave/tools/hudson.plugins.gradle.GradleInstallation/Gradle_3.4-rc-2
Not sending mail to unregistered user ismael@juma.me.uk

Jenkins build is back to normal : kafka-trunk-jdk7 #2642

Posted by Apache Jenkins Server <je...@builds.apache.org>.
See <https://builds.apache.org/job/kafka-trunk-jdk7/2642/display/redirect?page=changes>


Build failed in Jenkins: kafka-trunk-jdk7 #2641

Posted by Apache Jenkins Server <je...@builds.apache.org>.
See <https://builds.apache.org/job/kafka-trunk-jdk7/2641/display/redirect?page=changes>

Changes:

[jason] HOTFIX: ConsoleConsumer using wrong old consumer config value for

------------------------------------------
[...truncated 938.27 KB...]
kafka.log.BrokerCompressionTest > testBrokerSideCompression[11] STARTED

kafka.log.BrokerCompressionTest > testBrokerSideCompression[11] PASSED

kafka.log.BrokerCompressionTest > testBrokerSideCompression[12] STARTED

kafka.log.BrokerCompressionTest > testBrokerSideCompression[12] PASSED

kafka.log.BrokerCompressionTest > testBrokerSideCompression[13] STARTED

kafka.log.BrokerCompressionTest > testBrokerSideCompression[13] PASSED

kafka.log.BrokerCompressionTest > testBrokerSideCompression[14] STARTED

kafka.log.BrokerCompressionTest > testBrokerSideCompression[14] PASSED

kafka.log.BrokerCompressionTest > testBrokerSideCompression[15] STARTED

kafka.log.BrokerCompressionTest > testBrokerSideCompression[15] PASSED

kafka.log.BrokerCompressionTest > testBrokerSideCompression[16] STARTED

kafka.log.BrokerCompressionTest > testBrokerSideCompression[16] PASSED

kafka.log.BrokerCompressionTest > testBrokerSideCompression[17] STARTED

kafka.log.BrokerCompressionTest > testBrokerSideCompression[17] PASSED

kafka.log.BrokerCompressionTest > testBrokerSideCompression[18] STARTED

kafka.log.BrokerCompressionTest > testBrokerSideCompression[18] PASSED

kafka.log.BrokerCompressionTest > testBrokerSideCompression[19] STARTED

kafka.log.BrokerCompressionTest > testBrokerSideCompression[19] PASSED

kafka.log.LogCleanerIntegrationTest > testCleansCombinedCompactAndDeleteTopic[0] STARTED

kafka.log.LogCleanerIntegrationTest > testCleansCombinedCompactAndDeleteTopic[0] PASSED

kafka.log.LogCleanerIntegrationTest > testCleaningNestedMessagesWithMultipleVersions[0] STARTED

kafka.log.LogCleanerIntegrationTest > testCleaningNestedMessagesWithMultipleVersions[0] PASSED

kafka.log.LogCleanerIntegrationTest > cleanerTest[0] STARTED

kafka.log.LogCleanerIntegrationTest > cleanerTest[0] PASSED

kafka.log.LogCleanerIntegrationTest > testCleanerWithMessageFormatV0[0] STARTED

kafka.log.LogCleanerIntegrationTest > testCleanerWithMessageFormatV0[0] PASSED

kafka.log.LogCleanerIntegrationTest > testCleansCombinedCompactAndDeleteTopic[1] STARTED

kafka.log.LogCleanerIntegrationTest > testCleansCombinedCompactAndDeleteTopic[1] PASSED

kafka.log.LogCleanerIntegrationTest > testCleaningNestedMessagesWithMultipleVersions[1] STARTED

kafka.log.LogCleanerIntegrationTest > testCleaningNestedMessagesWithMultipleVersions[1] PASSED

kafka.log.LogCleanerIntegrationTest > cleanerTest[1] STARTED

kafka.log.LogCleanerIntegrationTest > cleanerTest[1] PASSED

kafka.log.LogCleanerIntegrationTest > testCleanerWithMessageFormatV0[1] STARTED

kafka.log.LogCleanerIntegrationTest > testCleanerWithMessageFormatV0[1] PASSED

kafka.log.LogCleanerIntegrationTest > testCleansCombinedCompactAndDeleteTopic[2] STARTED

kafka.log.LogCleanerIntegrationTest > testCleansCombinedCompactAndDeleteTopic[2] PASSED

kafka.log.LogCleanerIntegrationTest > testCleaningNestedMessagesWithMultipleVersions[2] STARTED

kafka.log.LogCleanerIntegrationTest > testCleaningNestedMessagesWithMultipleVersions[2] PASSED

kafka.log.LogCleanerIntegrationTest > cleanerTest[2] STARTED

kafka.log.LogCleanerIntegrationTest > cleanerTest[2] PASSED

kafka.log.LogCleanerIntegrationTest > testCleanerWithMessageFormatV0[2] STARTED

kafka.log.LogCleanerIntegrationTest > testCleanerWithMessageFormatV0[2] PASSED

kafka.log.LogCleanerIntegrationTest > testCleansCombinedCompactAndDeleteTopic[3] STARTED

kafka.log.LogCleanerIntegrationTest > testCleansCombinedCompactAndDeleteTopic[3] PASSED

kafka.log.LogCleanerIntegrationTest > testCleaningNestedMessagesWithMultipleVersions[3] STARTED

kafka.log.LogCleanerIntegrationTest > testCleaningNestedMessagesWithMultipleVersions[3] PASSED

kafka.log.LogCleanerIntegrationTest > cleanerTest[3] STARTED

kafka.log.LogCleanerIntegrationTest > cleanerTest[3] PASSED

kafka.log.LogCleanerIntegrationTest > testCleanerWithMessageFormatV0[3] STARTED

kafka.log.LogCleanerIntegrationTest > testCleanerWithMessageFormatV0[3] PASSED

kafka.log.ProducerStateManagerTest > testCoordinatorFencing STARTED

kafka.log.ProducerStateManagerTest > testCoordinatorFencing PASSED

kafka.log.ProducerStateManagerTest > testTruncate STARTED

kafka.log.ProducerStateManagerTest > testTruncate PASSED

kafka.log.ProducerStateManagerTest > testRemoveExpiredPidsOnReload STARTED

kafka.log.ProducerStateManagerTest > testRemoveExpiredPidsOnReload PASSED

kafka.log.ProducerStateManagerTest > testOutOfSequenceAfterControlRecordEpochBump STARTED

kafka.log.ProducerStateManagerTest > testOutOfSequenceAfterControlRecordEpochBump PASSED

kafka.log.ProducerStateManagerTest > testFirstUnstableOffsetAfterTruncation STARTED

kafka.log.ProducerStateManagerTest > testFirstUnstableOffsetAfterTruncation PASSED

kafka.log.ProducerStateManagerTest > testTakeSnapshot STARTED

kafka.log.ProducerStateManagerTest > testTakeSnapshot PASSED

kafka.log.ProducerStateManagerTest > testDeleteSnapshotsBefore STARTED

kafka.log.ProducerStateManagerTest > testDeleteSnapshotsBefore PASSED

kafka.log.ProducerStateManagerTest > testNonMatchingTxnFirstOffsetMetadataNotCached STARTED

kafka.log.ProducerStateManagerTest > testNonMatchingTxnFirstOffsetMetadataNotCached PASSED

kafka.log.ProducerStateManagerTest > testFirstUnstableOffsetAfterEviction STARTED

kafka.log.ProducerStateManagerTest > testFirstUnstableOffsetAfterEviction PASSED

kafka.log.ProducerStateManagerTest > testNoValidationOnFirstEntryWhenLoadingLog STARTED

kafka.log.ProducerStateManagerTest > testNoValidationOnFirstEntryWhenLoadingLog PASSED

kafka.log.ProducerStateManagerTest > testProducersWithOngoingTransactionsDontExpire STARTED

kafka.log.ProducerStateManagerTest > testProducersWithOngoingTransactionsDontExpire PASSED

kafka.log.ProducerStateManagerTest > testBasicIdMapping STARTED

kafka.log.ProducerStateManagerTest > testBasicIdMapping PASSED

kafka.log.ProducerStateManagerTest > updateProducerTransactionState STARTED

kafka.log.ProducerStateManagerTest > updateProducerTransactionState PASSED

kafka.log.ProducerStateManagerTest > testRecoverFromSnapshot STARTED

kafka.log.ProducerStateManagerTest > testRecoverFromSnapshot PASSED

kafka.log.ProducerStateManagerTest > testSequenceNotValidatedForGroupMetadataTopic STARTED

kafka.log.ProducerStateManagerTest > testSequenceNotValidatedForGroupMetadataTopic PASSED

kafka.log.ProducerStateManagerTest > testLoadFromSnapshotRemovesNonRetainedProducers STARTED

kafka.log.ProducerStateManagerTest > testLoadFromSnapshotRemovesNonRetainedProducers PASSED

kafka.log.ProducerStateManagerTest > testFirstUnstableOffset STARTED

kafka.log.ProducerStateManagerTest > testFirstUnstableOffset PASSED

kafka.log.ProducerStateManagerTest > testTxnFirstOffsetMetadataCached STARTED

kafka.log.ProducerStateManagerTest > testTxnFirstOffsetMetadataCached PASSED

kafka.log.ProducerStateManagerTest > testCoordinatorFencedAfterReload STARTED

kafka.log.ProducerStateManagerTest > testCoordinatorFencedAfterReload PASSED

kafka.log.ProducerStateManagerTest > testControlRecordBumpsEpoch STARTED

kafka.log.ProducerStateManagerTest > testControlRecordBumpsEpoch PASSED

kafka.log.ProducerStateManagerTest > testProducerSequenceWrapAround STARTED

kafka.log.ProducerStateManagerTest > testProducerSequenceWrapAround PASSED

kafka.log.ProducerStateManagerTest > testPidExpirationTimeout STARTED

kafka.log.ProducerStateManagerTest > testPidExpirationTimeout PASSED

kafka.log.ProducerStateManagerTest > testOldEpochForControlRecord STARTED

kafka.log.ProducerStateManagerTest > testOldEpochForControlRecord PASSED

kafka.log.ProducerStateManagerTest > testTruncateAndReloadRemovesOutOfRangeSnapshots STARTED

kafka.log.ProducerStateManagerTest > testTruncateAndReloadRemovesOutOfRangeSnapshots PASSED

kafka.log.ProducerStateManagerTest > testStartOffset STARTED

kafka.log.ProducerStateManagerTest > testStartOffset PASSED

kafka.log.ProducerStateManagerTest > testProducerSequenceInvalidWrapAround STARTED

kafka.log.ProducerStateManagerTest > testProducerSequenceInvalidWrapAround PASSED

kafka.log.ProducerStateManagerTest > testTruncateHead STARTED

kafka.log.ProducerStateManagerTest > testTruncateHead PASSED

kafka.log.ProducerStateManagerTest > testNonTransactionalAppendWithOngoingTransaction STARTED

kafka.log.ProducerStateManagerTest > testNonTransactionalAppendWithOngoingTransaction PASSED

kafka.log.ProducerStateManagerTest > testSkipSnapshotIfOffsetUnchanged STARTED

kafka.log.ProducerStateManagerTest > testSkipSnapshotIfOffsetUnchanged PASSED

1546 tests completed, 1 failed, 4 skipped
:kafka-trunk-jdk7:core:test FAILED
:test_core_2_11 FAILED

FAILURE: Build failed with an exception.

* What went wrong:
Execution failed for task ':kafka-trunk-jdk7:core:test'.
> There were failing tests. See the report at: file://<https://builds.apache.org/job/kafka-trunk-jdk7/ws/core/build/reports/tests/test/index.html>

* Try:
Run with --stacktrace option to get the stack trace. Run with --info or --debug option to get more log output.

* Get more help at https://help.gradle.org

BUILD FAILED in 47m 18s
16 actionable tasks: 13 executed, 3 up-to-date
Build step 'Execute shell' marked build as failure
[FINDBUGS] Collecting findbugs analysis files...
Setting GRADLE_3_4_RC_2_HOME=/home/jenkins/jenkins-slave/tools/hudson.plugins.gradle.GradleInstallation/Gradle_3.4-rc-2
[FINDBUGS] Searching for all files in <https://builds.apache.org/job/kafka-trunk-jdk7/ws/> that match the pattern **/build/reports/findbugs/*.xml
[FINDBUGS] Parsing 1 file in <https://builds.apache.org/job/kafka-trunk-jdk7/ws/>
[FINDBUGS] Successfully parsed file <https://builds.apache.org/job/kafka-trunk-jdk7/ws/core/build/reports/findbugs/main.xml> with 0 unique warnings and 0 duplicates.
Setting GRADLE_3_4_RC_2_HOME=/home/jenkins/jenkins-slave/tools/hudson.plugins.gradle.GradleInstallation/Gradle_3.4-rc-2
Setting GRADLE_3_4_RC_2_HOME=/home/jenkins/jenkins-slave/tools/hudson.plugins.gradle.GradleInstallation/Gradle_3.4-rc-2
<Git Blamer> Using GitBlamer to create author and commit information for all warnings.
<Git Blamer> GIT_COMMIT=869ef5579f00661a5d68e92f09e088e7ed884189, workspace=<https://builds.apache.org/job/kafka-trunk-jdk7/ws/>
[FINDBUGS] Computing warning deltas based on reference build #2637
Recording test results
Setting GRADLE_3_4_RC_2_HOME=/home/jenkins/jenkins-slave/tools/hudson.plugins.gradle.GradleInstallation/Gradle_3.4-rc-2
Setting GRADLE_3_4_RC_2_HOME=/home/jenkins/jenkins-slave/tools/hudson.plugins.gradle.GradleInstallation/Gradle_3.4-rc-2
Not sending mail to unregistered user ismael@juma.me.uk
Not sending mail to unregistered user damian.guy@gmail.com

Build failed in Jenkins: kafka-trunk-jdk7 #2640

Posted by Apache Jenkins Server <je...@builds.apache.org>.
See <https://builds.apache.org/job/kafka-trunk-jdk7/2640/display/redirect?page=changes>

Changes:

[damian.guy] KAFKA-4643; Improve test coverage of StreamsKafkaClient

------------------------------------------
[...truncated 2.57 MB...]
org.apache.kafka.connect.runtime.distributed.DistributedHerderTest > testAccessors STARTED

org.apache.kafka.connect.runtime.distributed.DistributedHerderTest > testAccessors PASSED

org.apache.kafka.connect.runtime.distributed.DistributedHerderTest > testJoinAssignment STARTED

org.apache.kafka.connect.runtime.distributed.DistributedHerderTest > testJoinAssignment PASSED

org.apache.kafka.connect.runtime.distributed.DistributedHerderTest > testRebalance STARTED

org.apache.kafka.connect.runtime.distributed.DistributedHerderTest > testRebalance PASSED

org.apache.kafka.connect.runtime.distributed.DistributedHerderTest > testRebalanceFailedConnector STARTED

org.apache.kafka.connect.runtime.distributed.DistributedHerderTest > testRebalanceFailedConnector PASSED

org.apache.kafka.connect.runtime.distributed.DistributedHerderTest > testHaltCleansUpWorker STARTED

org.apache.kafka.connect.runtime.distributed.DistributedHerderTest > testHaltCleansUpWorker PASSED

org.apache.kafka.connect.runtime.distributed.DistributedHerderTest > testConnectorNameConflictsWithWorkerGroupId STARTED

org.apache.kafka.connect.runtime.distributed.DistributedHerderTest > testConnectorNameConflictsWithWorkerGroupId PASSED

org.apache.kafka.connect.runtime.distributed.DistributedHerderTest > testRestartUnknownConnector STARTED

org.apache.kafka.connect.runtime.distributed.DistributedHerderTest > testRestartUnknownConnector PASSED

org.apache.kafka.connect.runtime.distributed.DistributedHerderTest > testRestartConnectorRedirectToLeader STARTED

org.apache.kafka.connect.runtime.distributed.DistributedHerderTest > testRestartConnectorRedirectToLeader PASSED

org.apache.kafka.connect.runtime.distributed.DistributedHerderTest > testRestartConnectorRedirectToOwner STARTED

org.apache.kafka.connect.runtime.distributed.DistributedHerderTest > testRestartConnectorRedirectToOwner PASSED

org.apache.kafka.connect.runtime.distributed.DistributedHerderTest > testRestartUnknownTask STARTED

org.apache.kafka.connect.runtime.distributed.DistributedHerderTest > testRestartUnknownTask PASSED

org.apache.kafka.connect.runtime.distributed.DistributedHerderTest > testRequestProcessingOrder STARTED

org.apache.kafka.connect.runtime.distributed.DistributedHerderTest > testRequestProcessingOrder PASSED

org.apache.kafka.connect.runtime.distributed.DistributedHerderTest > testRestartTaskRedirectToLeader STARTED

org.apache.kafka.connect.runtime.distributed.DistributedHerderTest > testRestartTaskRedirectToLeader PASSED

org.apache.kafka.connect.runtime.distributed.DistributedHerderTest > testRestartTaskRedirectToOwner STARTED

org.apache.kafka.connect.runtime.distributed.DistributedHerderTest > testRestartTaskRedirectToOwner PASSED

org.apache.kafka.connect.runtime.distributed.DistributedHerderTest > testConnectorConfigAdded STARTED

org.apache.kafka.connect.runtime.distributed.DistributedHerderTest > testConnectorConfigAdded PASSED

org.apache.kafka.connect.runtime.distributed.DistributedHerderTest > testConnectorConfigUpdate STARTED

org.apache.kafka.connect.runtime.distributed.DistributedHerderTest > testConnectorConfigUpdate PASSED

org.apache.kafka.connect.runtime.distributed.DistributedHerderTest > testConnectorPaused STARTED

org.apache.kafka.connect.runtime.distributed.DistributedHerderTest > testConnectorPaused PASSED

org.apache.kafka.connect.runtime.distributed.DistributedHerderTest > testConnectorResumed STARTED

org.apache.kafka.connect.runtime.distributed.DistributedHerderTest > testConnectorResumed PASSED

org.apache.kafka.connect.runtime.distributed.DistributedHerderTest > testUnknownConnectorPaused STARTED

org.apache.kafka.connect.runtime.distributed.DistributedHerderTest > testUnknownConnectorPaused PASSED

org.apache.kafka.connect.runtime.distributed.DistributedHerderTest > testConnectorPausedRunningTaskOnly STARTED

org.apache.kafka.connect.runtime.distributed.DistributedHerderTest > testConnectorPausedRunningTaskOnly PASSED

org.apache.kafka.connect.runtime.distributed.DistributedHerderTest > testConnectorResumedRunningTaskOnly STARTED

org.apache.kafka.connect.runtime.distributed.DistributedHerderTest > testConnectorResumedRunningTaskOnly PASSED

org.apache.kafka.connect.runtime.distributed.DistributedHerderTest > testTaskConfigAdded STARTED

org.apache.kafka.connect.runtime.distributed.DistributedHerderTest > testTaskConfigAdded PASSED

org.apache.kafka.connect.runtime.distributed.DistributedHerderTest > testJoinLeaderCatchUpFails STARTED

org.apache.kafka.connect.runtime.distributed.DistributedHerderTest > testJoinLeaderCatchUpFails PASSED

org.apache.kafka.connect.runtime.distributed.DistributedHerderTest > testInconsistentConfigs STARTED

org.apache.kafka.connect.runtime.distributed.DistributedHerderTest > testInconsistentConfigs PASSED

org.apache.kafka.connect.runtime.ConnectorConfigTest > unconfiguredTransform STARTED

org.apache.kafka.connect.runtime.ConnectorConfigTest > unconfiguredTransform PASSED

org.apache.kafka.connect.runtime.ConnectorConfigTest > multipleTransformsOneDangling STARTED

org.apache.kafka.connect.runtime.ConnectorConfigTest > multipleTransformsOneDangling PASSED

org.apache.kafka.connect.runtime.ConnectorConfigTest > misconfiguredTransform STARTED

org.apache.kafka.connect.runtime.ConnectorConfigTest > misconfiguredTransform PASSED

org.apache.kafka.connect.runtime.ConnectorConfigTest > noTransforms STARTED

org.apache.kafka.connect.runtime.ConnectorConfigTest > noTransforms PASSED

org.apache.kafka.connect.runtime.ConnectorConfigTest > danglingTransformAlias STARTED

org.apache.kafka.connect.runtime.ConnectorConfigTest > danglingTransformAlias PASSED

org.apache.kafka.connect.runtime.ConnectorConfigTest > multipleTransforms STARTED

org.apache.kafka.connect.runtime.ConnectorConfigTest > multipleTransforms PASSED

org.apache.kafka.connect.runtime.ConnectorConfigTest > singleTransform STARTED

org.apache.kafka.connect.runtime.ConnectorConfigTest > singleTransform PASSED

org.apache.kafka.connect.runtime.ConnectorConfigTest > wrongTransformationType STARTED

org.apache.kafka.connect.runtime.ConnectorConfigTest > wrongTransformationType PASSED

org.apache.kafka.connect.util.ShutdownableThreadTest > testGracefulShutdown STARTED

org.apache.kafka.connect.util.ShutdownableThreadTest > testGracefulShutdown PASSED

org.apache.kafka.connect.util.ShutdownableThreadTest > testForcibleShutdown STARTED

org.apache.kafka.connect.util.ShutdownableThreadTest > testForcibleShutdown PASSED

org.apache.kafka.connect.util.KafkaBasedLogTest > testStartStop STARTED

org.apache.kafka.connect.util.KafkaBasedLogTest > testStartStop PASSED

org.apache.kafka.connect.util.KafkaBasedLogTest > testReloadOnStart STARTED

org.apache.kafka.connect.util.KafkaBasedLogTest > testReloadOnStart PASSED

org.apache.kafka.connect.util.KafkaBasedLogTest > testConsumerError STARTED

org.apache.kafka.connect.util.KafkaBasedLogTest > testConsumerError PASSED

org.apache.kafka.connect.util.KafkaBasedLogTest > testProducerError STARTED

org.apache.kafka.connect.util.KafkaBasedLogTest > testProducerError PASSED

org.apache.kafka.connect.util.KafkaBasedLogTest > testSendAndReadToEnd STARTED

org.apache.kafka.connect.util.KafkaBasedLogTest > testSendAndReadToEnd PASSED

org.apache.kafka.connect.util.KafkaBasedLogTest > testReloadOnStartWithNoNewRecordsPresent STARTED

org.apache.kafka.connect.util.KafkaBasedLogTest > testReloadOnStartWithNoNewRecordsPresent PASSED

org.apache.kafka.connect.util.TopicAdminTest > shouldNotCreateTopicWhenItAlreadyExists STARTED

org.apache.kafka.connect.util.TopicAdminTest > shouldNotCreateTopicWhenItAlreadyExists PASSED

org.apache.kafka.connect.util.TopicAdminTest > shouldCreateTopicWhenItDoesNotExist STARTED

org.apache.kafka.connect.util.TopicAdminTest > shouldCreateTopicWhenItDoesNotExist PASSED

org.apache.kafka.connect.util.TopicAdminTest > shouldReturnFalseWhenSuppliedNullTopicDescription STARTED

org.apache.kafka.connect.util.TopicAdminTest > shouldReturnFalseWhenSuppliedNullTopicDescription PASSED

org.apache.kafka.connect.util.TopicAdminTest > returnNullWithApiVersionMismatch STARTED

org.apache.kafka.connect.util.TopicAdminTest > returnNullWithApiVersionMismatch PASSED

org.apache.kafka.connect.util.TopicAdminTest > shouldCreateOneTopicWhenProvidedMultipleDefinitionsWithSameTopicName STARTED

org.apache.kafka.connect.util.TopicAdminTest > shouldCreateOneTopicWhenProvidedMultipleDefinitionsWithSameTopicName PASSED

org.apache.kafka.connect.util.TableTest > basicOperations STARTED

org.apache.kafka.connect.util.TableTest > basicOperations PASSED

org.apache.kafka.connect.converters.ByteArrayConverterTest > testFromConnectSchemaless STARTED

org.apache.kafka.connect.converters.ByteArrayConverterTest > testFromConnectSchemaless PASSED

org.apache.kafka.connect.converters.ByteArrayConverterTest > testToConnectNull STARTED

org.apache.kafka.connect.converters.ByteArrayConverterTest > testToConnectNull PASSED

org.apache.kafka.connect.converters.ByteArrayConverterTest > testFromConnectBadSchema STARTED

org.apache.kafka.connect.converters.ByteArrayConverterTest > testFromConnectBadSchema PASSED

org.apache.kafka.connect.converters.ByteArrayConverterTest > testFromConnectNull STARTED

org.apache.kafka.connect.converters.ByteArrayConverterTest > testFromConnectNull PASSED

org.apache.kafka.connect.converters.ByteArrayConverterTest > testToConnect STARTED

org.apache.kafka.connect.converters.ByteArrayConverterTest > testToConnect PASSED

org.apache.kafka.connect.converters.ByteArrayConverterTest > testFromConnect STARTED

org.apache.kafka.connect.converters.ByteArrayConverterTest > testFromConnect PASSED

org.apache.kafka.connect.converters.ByteArrayConverterTest > testFromConnectInvalidValue STARTED

org.apache.kafka.connect.converters.ByteArrayConverterTest > testFromConnectInvalidValue PASSED

246 tests completed, 1 failed
:connect:runtime:test FAILED

FAILURE: Build failed with an exception.

* What went wrong:
Execution failed for task ':connect:runtime:test'.
> There were failing tests. See the report at: file://<https://builds.apache.org/job/kafka-trunk-jdk7/ws/connect/runtime/build/reports/tests/test/index.html>

* Try:
Run with --stacktrace option to get the stack trace. Run with --info or --debug option to get more log output.

* Get more help at https://help.gradle.org

BUILD FAILED in 1h 11m 6s
85 actionable tasks: 75 executed, 10 up-to-date
Build step 'Execute shell' marked build as failure
[FINDBUGS] Collecting findbugs analysis files...
Setting GRADLE_3_4_RC_2_HOME=/home/jenkins/jenkins-slave/tools/hudson.plugins.gradle.GradleInstallation/Gradle_3.4-rc-2
[FINDBUGS] Searching for all files in <https://builds.apache.org/job/kafka-trunk-jdk7/ws/> that match the pattern **/build/reports/findbugs/*.xml
[FINDBUGS] Parsing 10 files in <https://builds.apache.org/job/kafka-trunk-jdk7/ws/>
[FINDBUGS] Successfully parsed file <https://builds.apache.org/job/kafka-trunk-jdk7/ws/clients/build/reports/findbugs/main.xml> with 0 unique warnings and 0 duplicates.
[FINDBUGS] Successfully parsed file <https://builds.apache.org/job/kafka-trunk-jdk7/ws/connect/api/build/reports/findbugs/main.xml> with 0 unique warnings and 0 duplicates.
[FINDBUGS] Successfully parsed file <https://builds.apache.org/job/kafka-trunk-jdk7/ws/connect/file/build/reports/findbugs/main.xml> with 0 unique warnings and 0 duplicates.
[FINDBUGS] Successfully parsed file <https://builds.apache.org/job/kafka-trunk-jdk7/ws/connect/json/build/reports/findbugs/main.xml> with 0 unique warnings and 0 duplicates.
[FINDBUGS] Successfully parsed file <https://builds.apache.org/job/kafka-trunk-jdk7/ws/connect/runtime/build/reports/findbugs/main.xml> with 0 unique warnings and 0 duplicates.
[FINDBUGS] Successfully parsed file <https://builds.apache.org/job/kafka-trunk-jdk7/ws/core/build/reports/findbugs/main.xml> with 0 unique warnings and 0 duplicates.
[FINDBUGS] Successfully parsed file <https://builds.apache.org/job/kafka-trunk-jdk7/ws/examples/build/reports/findbugs/main.xml> with 0 unique warnings and 0 duplicates.
[FINDBUGS] Successfully parsed file <https://builds.apache.org/job/kafka-trunk-jdk7/ws/log4j-appender/build/reports/findbugs/main.xml> with 0 unique warnings and 0 duplicates.
[FINDBUGS] Successfully parsed file <https://builds.apache.org/job/kafka-trunk-jdk7/ws/streams/build/reports/findbugs/main.xml> with 0 unique warnings and 0 duplicates.
[FINDBUGS] Successfully parsed file <https://builds.apache.org/job/kafka-trunk-jdk7/ws/tools/build/reports/findbugs/main.xml> with 0 unique warnings and 0 duplicates.
Setting GRADLE_3_4_RC_2_HOME=/home/jenkins/jenkins-slave/tools/hudson.plugins.gradle.GradleInstallation/Gradle_3.4-rc-2
Setting GRADLE_3_4_RC_2_HOME=/home/jenkins/jenkins-slave/tools/hudson.plugins.gradle.GradleInstallation/Gradle_3.4-rc-2
<Git Blamer> Using GitBlamer to create author and commit information for all warnings.
<Git Blamer> GIT_COMMIT=c0f7a7705851eec4a77d3e42cf6bf2546c07ffa8, workspace=<https://builds.apache.org/job/kafka-trunk-jdk7/ws/>
[FINDBUGS] Computing warning deltas based on reference build #2637
Recording test results
Setting GRADLE_3_4_RC_2_HOME=/home/jenkins/jenkins-slave/tools/hudson.plugins.gradle.GradleInstallation/Gradle_3.4-rc-2
Setting GRADLE_3_4_RC_2_HOME=/home/jenkins/jenkins-slave/tools/hudson.plugins.gradle.GradleInstallation/Gradle_3.4-rc-2
Not sending mail to unregistered user ismael@juma.me.uk
Not sending mail to unregistered user damian.guy@gmail.com