You are viewing a plain text version of this content. The canonical link for it is here.
Posted to yarn-dev@hadoop.apache.org by Apache Jenkins Server <je...@builds.apache.org> on 2014/06/25 09:02:40 UTC

Failed: YARN-2163 PreCommit Build #4073

Jira: https://issues.apache.org/jira/browse/YARN-2163
Build: https://builds.apache.org/job/PreCommit-YARN-Build/4073/

###################################################################################
########################## LAST 60 LINES OF THE CONSOLE ###########################
[...truncated 41 lines...]
    Testing patch for YARN-2163.
======================================================================
======================================================================


At revision 1605278.
YARN-2163 patch is being downloaded at Wed Jun 25 07:02:31 UTC 2014 from
http://issues.apache.org/jira/secure/attachment/12650545/apps%20page.png
cp: cannot stat `/home/jenkins/buildSupport/lib/*': No such file or directory
patch: **** Only garbage was found in the patch input.
patch: **** Only garbage was found in the patch input.
patch: **** Only garbage was found in the patch input.
The patch does not appear to apply with p0 to p2
PATCH APPLICATION FAILED




{color:red}-1 overall{color}.  Here are the results of testing the latest attachment 
  http://issues.apache.org/jira/secure/attachment/12650545/apps%20page.png
  against trunk revision .

    {color:red}-1 patch{color}.  The patch command could not apply the patch.

Console output: https://builds.apache.org/job/PreCommit-YARN-Build/4073//console

This message is automatically generated.


======================================================================
======================================================================
    Adding comment to Jira.
======================================================================
======================================================================


Comment added.
501857fa839926f14481aba1f1442e1008d43d4b logged out


======================================================================
======================================================================
    Finished build.
======================================================================
======================================================================


Build step 'Execute shell' marked build as failure
Archiving artifacts
Sending artifact delta relative to PreCommit-YARN-Build #4071
Archived 2 artifacts
Archive block size is 32768
Received 0 blocks and 247005 bytes
Compression is 0.0%
Took 2.4 sec
[description-setter] Could not determine description.
Recording test results
Email was triggered for: Failure
Sending email for trigger: Failure



###################################################################################
############################## FAILED TESTS (if any) ##############################
No tests ran.

Failed: YARN-2181 PreCommit Build #4074

Posted by Apache Jenkins Server <je...@builds.apache.org>.
Jira: https://issues.apache.org/jira/browse/YARN-2181
Build: https://builds.apache.org/job/PreCommit-YARN-Build/4074/

###################################################################################
########################## LAST 60 LINES OF THE CONSOLE ###########################
[...truncated 3204 lines...]

    {color:green}+1 @author{color}.  The patch does not contain any @author tags.

    {color:green}+1 tests included{color}.  The patch appears to include 6 new or modified test files.

    {color:green}+1 javac{color}.  The applied patch does not increase the total number of javac compiler warnings.

    {color:green}+1 javadoc{color}.  There were no new javadoc warning messages.

    {color:green}+1 eclipse:eclipse{color}.  The patch built with eclipse:eclipse.

    {color:red}-1 findbugs{color}.  The patch appears to introduce 1 new Findbugs (version 1.3.9) warnings.

    {color:green}+1 release audit{color}.  The applied patch does not increase the total number of release audit warnings.

    {color:red}-1 core tests{color}.  The patch failed these unit tests in hadoop-yarn-project/hadoop-yarn/hadoop-yarn-server/hadoop-yarn-server-resourcemanager:

                  org.apache.hadoop.yarn.server.resourcemanager.webapp.TestRMWebServicesApps
                  org.apache.hadoop.yarn.server.resourcemanager.webapp.TestRMWebServicesCapacitySched

    {color:green}+1 contrib tests{color}.  The patch passed contrib unit tests.

Test results: https://builds.apache.org/job/PreCommit-YARN-Build/4074//testReport/
Findbugs warnings: https://builds.apache.org/job/PreCommit-YARN-Build/4074//artifact/trunk/patchprocess/newPatchFindbugsWarningshadoop-yarn-server-resourcemanager.html
Console output: https://builds.apache.org/job/PreCommit-YARN-Build/4074//console

This message is automatically generated.


======================================================================
======================================================================
    Adding comment to Jira.
======================================================================
======================================================================


Comment added.
31de6e0461adac5ab9a3c7e8386491135ddec974 logged out


======================================================================
======================================================================
    Finished build.
======================================================================
======================================================================


Build step 'Execute shell' marked build as failure
Archiving artifacts
Sending artifact delta relative to PreCommit-YARN-Build #4071
Archived 17 artifacts
Archive block size is 32768
Received 37 blocks and 6985508 bytes
Compression is 14.8%
Took 5.4 sec
[description-setter] Could not determine description.
Recording test results
Email was triggered for: Failure
Sending email for trigger: Failure



###################################################################################
############################## FAILED TESTS (if any) ##############################
13 tests failed.
REGRESSION:  org.apache.hadoop.yarn.server.resourcemanager.webapp.TestRMWebServicesApps.testAppsSlash

Error Message:
incorrect number of elements expected:<22> but was:<20>

Stack Trace:
java.lang.AssertionError: incorrect number of elements expected:<22> but was:<20>
	at org.junit.Assert.fail(Assert.java:88)
	at org.junit.Assert.failNotEquals(Assert.java:743)
	at org.junit.Assert.assertEquals(Assert.java:118)
	at org.junit.Assert.assertEquals(Assert.java:555)
	at org.apache.hadoop.yarn.server.resourcemanager.webapp.TestRMWebServicesApps.verifyAppInfo(TestRMWebServicesApps.java:1323)
	at org.apache.hadoop.yarn.server.resourcemanager.webapp.TestRMWebServicesApps.testAppsHelper(TestRMWebServicesApps.java:220)
	at org.apache.hadoop.yarn.server.resourcemanager.webapp.TestRMWebServicesApps.testAppsSlash(TestRMWebServicesApps.java:141)


REGRESSION:  org.apache.hadoop.yarn.server.resourcemanager.webapp.TestRMWebServicesApps.testAppsXML

Error Message:
null

Stack Trace:
java.lang.NumberFormatException: null
	at java.lang.Integer.parseInt(Integer.java:417)
	at java.lang.Integer.parseInt(Integer.java:499)
	at org.apache.hadoop.yarn.webapp.WebServicesTestUtils.getXmlInt(WebServicesTestUtils.java:37)
	at org.apache.hadoop.yarn.server.resourcemanager.webapp.TestRMWebServicesApps.verifyAppsXML(TestRMWebServicesApps.java:1294)
	at org.apache.hadoop.yarn.server.resourcemanager.webapp.TestRMWebServicesApps.testAppsXML(TestRMWebServicesApps.java:176)


REGRESSION:  org.apache.hadoop.yarn.server.resourcemanager.webapp.TestRMWebServicesApps.testApps

Error Message:
incorrect number of elements expected:<22> but was:<20>

Stack Trace:
java.lang.AssertionError: incorrect number of elements expected:<22> but was:<20>
	at org.junit.Assert.fail(Assert.java:88)
	at org.junit.Assert.failNotEquals(Assert.java:743)
	at org.junit.Assert.assertEquals(Assert.java:118)
	at org.junit.Assert.assertEquals(Assert.java:555)
	at org.apache.hadoop.yarn.server.resourcemanager.webapp.TestRMWebServicesApps.verifyAppInfo(TestRMWebServicesApps.java:1323)
	at org.apache.hadoop.yarn.server.resourcemanager.webapp.TestRMWebServicesApps.testAppsHelper(TestRMWebServicesApps.java:220)
	at org.apache.hadoop.yarn.server.resourcemanager.webapp.TestRMWebServicesApps.testApps(TestRMWebServicesApps.java:131)


REGRESSION:  org.apache.hadoop.yarn.server.resourcemanager.webapp.TestRMWebServicesApps.testSingleAppsXML

Error Message:
null

Stack Trace:
java.lang.NumberFormatException: null
	at java.lang.Integer.parseInt(Integer.java:417)
	at java.lang.Integer.parseInt(Integer.java:499)
	at org.apache.hadoop.yarn.webapp.WebServicesTestUtils.getXmlInt(WebServicesTestUtils.java:37)
	at org.apache.hadoop.yarn.server.resourcemanager.webapp.TestRMWebServicesApps.verifyAppsXML(TestRMWebServicesApps.java:1294)
	at org.apache.hadoop.yarn.server.resourcemanager.webapp.TestRMWebServicesApps.testSingleAppsXML(TestRMWebServicesApps.java:1284)


REGRESSION:  org.apache.hadoop.yarn.server.resourcemanager.webapp.TestRMWebServicesApps.testSingleAppsSlash

Error Message:
incorrect number of elements expected:<22> but was:<20>

Stack Trace:
java.lang.AssertionError: incorrect number of elements expected:<22> but was:<20>
	at org.junit.Assert.fail(Assert.java:88)
	at org.junit.Assert.failNotEquals(Assert.java:743)
	at org.junit.Assert.assertEquals(Assert.java:118)
	at org.junit.Assert.assertEquals(Assert.java:555)
	at org.apache.hadoop.yarn.server.resourcemanager.webapp.TestRMWebServicesApps.verifyAppInfo(TestRMWebServicesApps.java:1323)
	at org.apache.hadoop.yarn.server.resourcemanager.webapp.TestRMWebServicesApps.testSingleAppsHelper(TestRMWebServicesApps.java:1261)
	at org.apache.hadoop.yarn.server.resourcemanager.webapp.TestRMWebServicesApps.testSingleAppsSlash(TestRMWebServicesApps.java:1164)


REGRESSION:  org.apache.hadoop.yarn.server.resourcemanager.webapp.TestRMWebServicesApps.testSingleApp

Error Message:
incorrect number of elements expected:<22> but was:<20>

Stack Trace:
java.lang.AssertionError: incorrect number of elements expected:<22> but was:<20>
	at org.junit.Assert.fail(Assert.java:88)
	at org.junit.Assert.failNotEquals(Assert.java:743)
	at org.junit.Assert.assertEquals(Assert.java:118)
	at org.junit.Assert.assertEquals(Assert.java:555)
	at org.apache.hadoop.yarn.server.resourcemanager.webapp.TestRMWebServicesApps.verifyAppInfo(TestRMWebServicesApps.java:1323)
	at org.apache.hadoop.yarn.server.resourcemanager.webapp.TestRMWebServicesApps.testSingleAppsHelper(TestRMWebServicesApps.java:1261)
	at org.apache.hadoop.yarn.server.resourcemanager.webapp.TestRMWebServicesApps.testSingleApp(TestRMWebServicesApps.java:1153)


REGRESSION:  org.apache.hadoop.yarn.server.resourcemanager.webapp.TestRMWebServicesApps.testAppsQueryFinalStatus

Error Message:
incorrect number of elements expected:<22> but was:<20>

Stack Trace:
java.lang.AssertionError: incorrect number of elements expected:<22> but was:<20>
	at org.junit.Assert.fail(Assert.java:88)
	at org.junit.Assert.failNotEquals(Assert.java:743)
	at org.junit.Assert.assertEquals(Assert.java:118)
	at org.junit.Assert.assertEquals(Assert.java:555)
	at org.apache.hadoop.yarn.server.resourcemanager.webapp.TestRMWebServicesApps.verifyAppInfo(TestRMWebServicesApps.java:1323)
	at org.apache.hadoop.yarn.server.resourcemanager.webapp.TestRMWebServicesApps.testAppsQueryFinalStatus(TestRMWebServicesApps.java:476)


REGRESSION:  org.apache.hadoop.yarn.server.resourcemanager.webapp.TestRMWebServicesApps.testAppsQueryState

Error Message:
incorrect number of elements expected:<22> but was:<20>

Stack Trace:
java.lang.AssertionError: incorrect number of elements expected:<22> but was:<20>
	at org.junit.Assert.fail(Assert.java:88)
	at org.junit.Assert.failNotEquals(Assert.java:743)
	at org.junit.Assert.assertEquals(Assert.java:118)
	at org.junit.Assert.assertEquals(Assert.java:555)
	at org.apache.hadoop.yarn.server.resourcemanager.webapp.TestRMWebServicesApps.verifyAppInfo(TestRMWebServicesApps.java:1323)
	at org.apache.hadoop.yarn.server.resourcemanager.webapp.TestRMWebServicesApps.testAppsQueryState(TestRMWebServicesApps.java:243)


REGRESSION:  org.apache.hadoop.yarn.server.resourcemanager.webapp.TestRMWebServicesApps.testSingleAppsDefault

Error Message:
incorrect number of elements expected:<22> but was:<20>

Stack Trace:
java.lang.AssertionError: incorrect number of elements expected:<22> but was:<20>
	at org.junit.Assert.fail(Assert.java:88)
	at org.junit.Assert.failNotEquals(Assert.java:743)
	at org.junit.Assert.assertEquals(Assert.java:118)
	at org.junit.Assert.assertEquals(Assert.java:555)
	at org.apache.hadoop.yarn.server.resourcemanager.webapp.TestRMWebServicesApps.verifyAppInfo(TestRMWebServicesApps.java:1323)
	at org.apache.hadoop.yarn.server.resourcemanager.webapp.TestRMWebServicesApps.testSingleAppsHelper(TestRMWebServicesApps.java:1261)
	at org.apache.hadoop.yarn.server.resourcemanager.webapp.TestRMWebServicesApps.testSingleAppsDefault(TestRMWebServicesApps.java:1175)


REGRESSION:  org.apache.hadoop.yarn.server.resourcemanager.webapp.TestRMWebServicesApps.testAppsDefault

Error Message:
incorrect number of elements expected:<22> but was:<20>

Stack Trace:
java.lang.AssertionError: incorrect number of elements expected:<22> but was:<20>
	at org.junit.Assert.fail(Assert.java:88)
	at org.junit.Assert.failNotEquals(Assert.java:743)
	at org.junit.Assert.assertEquals(Assert.java:118)
	at org.junit.Assert.assertEquals(Assert.java:555)
	at org.apache.hadoop.yarn.server.resourcemanager.webapp.TestRMWebServicesApps.verifyAppInfo(TestRMWebServicesApps.java:1323)
	at org.apache.hadoop.yarn.server.resourcemanager.webapp.TestRMWebServicesApps.testAppsHelper(TestRMWebServicesApps.java:220)
	at org.apache.hadoop.yarn.server.resourcemanager.webapp.TestRMWebServicesApps.testAppsDefault(TestRMWebServicesApps.java:151)


REGRESSION:  org.apache.hadoop.yarn.server.resourcemanager.webapp.TestRMWebServicesCapacitySched.testClusterScheduler

Error Message:
incorrect number of elements expected:<21> but was:<24>

Stack Trace:
java.lang.AssertionError: incorrect number of elements expected:<21> but was:<24>
	at org.junit.Assert.fail(Assert.java:88)
	at org.junit.Assert.failNotEquals(Assert.java:743)
	at org.junit.Assert.assertEquals(Assert.java:118)
	at org.junit.Assert.assertEquals(Assert.java:555)
	at org.apache.hadoop.yarn.server.resourcemanager.webapp.TestRMWebServicesCapacitySched.verifySubQueue(TestRMWebServicesCapacitySched.java:366)
	at org.apache.hadoop.yarn.server.resourcemanager.webapp.TestRMWebServicesCapacitySched.verifySubQueue(TestRMWebServicesCapacitySched.java:387)
	at org.apache.hadoop.yarn.server.resourcemanager.webapp.TestRMWebServicesCapacitySched.verifySubQueue(TestRMWebServicesCapacitySched.java:387)
	at org.apache.hadoop.yarn.server.resourcemanager.webapp.TestRMWebServicesCapacitySched.verifyClusterScheduler(TestRMWebServicesCapacitySched.java:343)
	at org.apache.hadoop.yarn.server.resourcemanager.webapp.TestRMWebServicesCapacitySched.testClusterScheduler(TestRMWebServicesCapacitySched.java:187)


REGRESSION:  org.apache.hadoop.yarn.server.resourcemanager.webapp.TestRMWebServicesCapacitySched.testClusterSchedulerDefault

Error Message:
incorrect number of elements expected:<21> but was:<24>

Stack Trace:
java.lang.AssertionError: incorrect number of elements expected:<21> but was:<24>
	at org.junit.Assert.fail(Assert.java:88)
	at org.junit.Assert.failNotEquals(Assert.java:743)
	at org.junit.Assert.assertEquals(Assert.java:118)
	at org.junit.Assert.assertEquals(Assert.java:555)
	at org.apache.hadoop.yarn.server.resourcemanager.webapp.TestRMWebServicesCapacitySched.verifySubQueue(TestRMWebServicesCapacitySched.java:366)
	at org.apache.hadoop.yarn.server.resourcemanager.webapp.TestRMWebServicesCapacitySched.verifySubQueue(TestRMWebServicesCapacitySched.java:387)
	at org.apache.hadoop.yarn.server.resourcemanager.webapp.TestRMWebServicesCapacitySched.verifySubQueue(TestRMWebServicesCapacitySched.java:387)
	at org.apache.hadoop.yarn.server.resourcemanager.webapp.TestRMWebServicesCapacitySched.verifyClusterScheduler(TestRMWebServicesCapacitySched.java:343)
	at org.apache.hadoop.yarn.server.resourcemanager.webapp.TestRMWebServicesCapacitySched.testClusterSchedulerDefault(TestRMWebServicesCapacitySched.java:208)


REGRESSION:  org.apache.hadoop.yarn.server.resourcemanager.webapp.TestRMWebServicesCapacitySched.testClusterSchedulerSlash

Error Message:
incorrect number of elements expected:<21> but was:<24>

Stack Trace:
java.lang.AssertionError: incorrect number of elements expected:<21> but was:<24>
	at org.junit.Assert.fail(Assert.java:88)
	at org.junit.Assert.failNotEquals(Assert.java:743)
	at org.junit.Assert.assertEquals(Assert.java:118)
	at org.junit.Assert.assertEquals(Assert.java:555)
	at org.apache.hadoop.yarn.server.resourcemanager.webapp.TestRMWebServicesCapacitySched.verifySubQueue(TestRMWebServicesCapacitySched.java:366)
	at org.apache.hadoop.yarn.server.resourcemanager.webapp.TestRMWebServicesCapacitySched.verifySubQueue(TestRMWebServicesCapacitySched.java:387)
	at org.apache.hadoop.yarn.server.resourcemanager.webapp.TestRMWebServicesCapacitySched.verifySubQueue(TestRMWebServicesCapacitySched.java:387)
	at org.apache.hadoop.yarn.server.resourcemanager.webapp.TestRMWebServicesCapacitySched.verifyClusterScheduler(TestRMWebServicesCapacitySched.java:343)
	at org.apache.hadoop.yarn.server.resourcemanager.webapp.TestRMWebServicesCapacitySched.testClusterSchedulerSlash(TestRMWebServicesCapacitySched.java:198)