You are viewing a plain text version of this content. The canonical link for it is here.
Posted to dev@lucene.apache.org by Policeman Jenkins Server <je...@thetaphi.de> on 2015/06/11 15:29:54 UTC
[JENKINS] Lucene-Solr-5.x-Linux (32bit/jdk1.7.0_80) - Build # 12849
- Failure!
Build: http://jenkins.thetaphi.de/job/Lucene-Solr-5.x-Linux/12849/
Java: 32bit/jdk1.7.0_80 -client -XX:+UseConcMarkSweepGC
1 tests failed.
FAILED: org.apache.solr.cloud.FullSolrCloudDistribCmdsTest.test
Error Message:
KeeperErrorCode = Session expired for /live_nodes
Stack Trace:
org.apache.zookeeper.KeeperException$SessionExpiredException: KeeperErrorCode = Session expired for /live_nodes
at __randomizedtesting.SeedInfo.seed([35A7EAB14F623A99:BDF3D56BE19E5761]:0)
at org.apache.zookeeper.KeeperException.create(KeeperException.java:127)
at org.apache.zookeeper.KeeperException.create(KeeperException.java:51)
at org.apache.zookeeper.ZooKeeper.getChildren(ZooKeeper.java:1472)
at org.apache.solr.common.cloud.SolrZkClient$6.execute(SolrZkClient.java:328)
at org.apache.solr.common.cloud.SolrZkClient$6.execute(SolrZkClient.java:325)
at org.apache.solr.common.cloud.ZkCmdExecutor.retryOperation(ZkCmdExecutor.java:61)
at org.apache.solr.common.cloud.SolrZkClient.getChildren(SolrZkClient.java:325)
at org.apache.solr.common.cloud.ZkStateReader.updateClusterState(ZkStateReader.java:536)
at org.apache.solr.common.cloud.ZkStateReader.updateClusterState(ZkStateReader.java:269)
at org.apache.solr.cloud.AbstractFullDistribZkTestBase.updateMappingsFromZk(AbstractFullDistribZkTestBase.java:605)
at org.apache.solr.cloud.AbstractFullDistribZkTestBase.checkShardConsistency(AbstractFullDistribZkTestBase.java:1230)
at org.apache.solr.cloud.AbstractFullDistribZkTestBase.checkShardConsistency(AbstractFullDistribZkTestBase.java:1221)
at org.apache.solr.cloud.AbstractFullDistribZkTestBase.checkShardConsistency(AbstractFullDistribZkTestBase.java:1213)
at org.apache.solr.cloud.FullSolrCloudDistribCmdsTest.testConcurrentIndexing(FullSolrCloudDistribCmdsTest.java:711)
at org.apache.solr.cloud.FullSolrCloudDistribCmdsTest.test(FullSolrCloudDistribCmdsTest.java:138)
at sun.reflect.NativeMethodAccessorImpl.invoke0(Native Method)
at sun.reflect.NativeMethodAccessorImpl.invoke(NativeMethodAccessorImpl.java:57)
at sun.reflect.DelegatingMethodAccessorImpl.invoke(DelegatingMethodAccessorImpl.java:43)
at java.lang.reflect.Method.invoke(Method.java:606)
at com.carrotsearch.randomizedtesting.RandomizedRunner.invoke(RandomizedRunner.java:1627)
at com.carrotsearch.randomizedtesting.RandomizedRunner$6.evaluate(RandomizedRunner.java:836)
at com.carrotsearch.randomizedtesting.RandomizedRunner$7.evaluate(RandomizedRunner.java:872)
at com.carrotsearch.randomizedtesting.RandomizedRunner$8.evaluate(RandomizedRunner.java:886)
at org.apache.solr.BaseDistributedSearchTestCase$ShardsRepeatRule$ShardsFixedStatement.callStatement(BaseDistributedSearchTestCase.java:960)
at org.apache.solr.BaseDistributedSearchTestCase$ShardsRepeatRule$ShardsStatement.evaluate(BaseDistributedSearchTestCase.java:935)
at com.carrotsearch.randomizedtesting.rules.SystemPropertiesRestoreRule$1.evaluate(SystemPropertiesRestoreRule.java:57)
at org.apache.lucene.util.TestRuleSetupTeardownChained$1.evaluate(TestRuleSetupTeardownChained.java:50)
at org.apache.lucene.util.AbstractBeforeAfterRule$1.evaluate(AbstractBeforeAfterRule.java:46)
at org.apache.lucene.util.TestRuleThreadAndTestName$1.evaluate(TestRuleThreadAndTestName.java:49)
at org.apache.lucene.util.TestRuleIgnoreAfterMaxFailures$1.evaluate(TestRuleIgnoreAfterMaxFailures.java:65)
at org.apache.lucene.util.TestRuleMarkFailure$1.evaluate(TestRuleMarkFailure.java:48)
at com.carrotsearch.randomizedtesting.rules.StatementAdapter.evaluate(StatementAdapter.java:36)
at com.carrotsearch.randomizedtesting.ThreadLeakControl$StatementRunner.run(ThreadLeakControl.java:365)
at com.carrotsearch.randomizedtesting.ThreadLeakControl.forkTimeoutingTask(ThreadLeakControl.java:798)
at com.carrotsearch.randomizedtesting.ThreadLeakControl$3.evaluate(ThreadLeakControl.java:458)
at com.carrotsearch.randomizedtesting.RandomizedRunner.runSingleTest(RandomizedRunner.java:845)
at com.carrotsearch.randomizedtesting.RandomizedRunner$3.evaluate(RandomizedRunner.java:747)
at com.carrotsearch.randomizedtesting.RandomizedRunner$4.evaluate(RandomizedRunner.java:781)
at com.carrotsearch.randomizedtesting.RandomizedRunner$5.evaluate(RandomizedRunner.java:792)
at com.carrotsearch.randomizedtesting.rules.StatementAdapter.evaluate(StatementAdapter.java:36)
at com.carrotsearch.randomizedtesting.rules.SystemPropertiesRestoreRule$1.evaluate(SystemPropertiesRestoreRule.java:57)
at org.apache.lucene.util.AbstractBeforeAfterRule$1.evaluate(AbstractBeforeAfterRule.java:46)
at com.carrotsearch.randomizedtesting.rules.StatementAdapter.evaluate(StatementAdapter.java:36)
at org.apache.lucene.util.TestRuleStoreClassName$1.evaluate(TestRuleStoreClassName.java:42)
at com.carrotsearch.randomizedtesting.rules.NoShadowingOrOverridesOnMethodsRule$1.evaluate(NoShadowingOrOverridesOnMethodsRule.java:39)
at com.carrotsearch.randomizedtesting.rules.NoShadowingOrOverridesOnMethodsRule$1.evaluate(NoShadowingOrOverridesOnMethodsRule.java:39)
at com.carrotsearch.randomizedtesting.rules.StatementAdapter.evaluate(StatementAdapter.java:36)
at com.carrotsearch.randomizedtesting.rules.StatementAdapter.evaluate(StatementAdapter.java:36)
at com.carrotsearch.randomizedtesting.rules.StatementAdapter.evaluate(StatementAdapter.java:36)
at org.apache.lucene.util.TestRuleAssertionsRequired$1.evaluate(TestRuleAssertionsRequired.java:54)
at org.apache.lucene.util.TestRuleMarkFailure$1.evaluate(TestRuleMarkFailure.java:48)
at org.apache.lucene.util.TestRuleIgnoreAfterMaxFailures$1.evaluate(TestRuleIgnoreAfterMaxFailures.java:65)
at org.apache.lucene.util.TestRuleIgnoreTestSuites$1.evaluate(TestRuleIgnoreTestSuites.java:55)
at com.carrotsearch.randomizedtesting.rules.StatementAdapter.evaluate(StatementAdapter.java:36)
at com.carrotsearch.randomizedtesting.ThreadLeakControl$StatementRunner.run(ThreadLeakControl.java:365)
at java.lang.Thread.run(Thread.java:745)
Build Log:
[...truncated 10540 lines...]
[junit4] Suite: org.apache.solr.cloud.FullSolrCloudDistribCmdsTest
[junit4] 2> Creating dataDir: /home/jenkins/workspace/Lucene-Solr-5.x-Linux/solr/build/solr-core/test/J1/temp/solr.cloud.FullSolrCloudDistribCmdsTest_35A7EAB14F623A99-001/init-core-data-001
[junit4] 2> 1196373 INFO (SUITE-FullSolrCloudDistribCmdsTest-seed#[35A7EAB14F623A99]-worker) [ ] o.a.s.BaseDistributedSearchTestCase Setting hostContext system property: /
[junit4] 2> 1196376 INFO (TEST-FullSolrCloudDistribCmdsTest.test-seed#[35A7EAB14F623A99]) [ ] o.a.s.c.ZkTestServer STARTING ZK TEST SERVER
[junit4] 2> 1196376 INFO (Thread-2209) [ ] o.a.s.c.ZkTestServer client port:0.0.0.0/0.0.0.0:0
[junit4] 2> 1196376 INFO (Thread-2209) [ ] o.a.s.c.ZkTestServer Starting server
[junit4] 2> 1196476 INFO (TEST-FullSolrCloudDistribCmdsTest.test-seed#[35A7EAB14F623A99]) [ ] o.a.s.c.ZkTestServer start zk server on port:59819
[junit4] 2> 1196476 INFO (TEST-FullSolrCloudDistribCmdsTest.test-seed#[35A7EAB14F623A99]) [ ] o.a.s.c.c.SolrZkClient Using default ZkCredentialsProvider
[junit4] 2> 1196477 INFO (TEST-FullSolrCloudDistribCmdsTest.test-seed#[35A7EAB14F623A99]) [ ] o.a.s.c.c.ConnectionManager Waiting for client to connect to ZooKeeper
[junit4] 2> 1196479 INFO (zkCallback-1656-thread-1) [ ] o.a.s.c.c.ConnectionManager Watcher org.apache.solr.common.cloud.ConnectionManager@b48c20 name:ZooKeeperConnection Watcher:127.0.0.1:59819 got event WatchedEvent state:SyncConnected type:None path:null path:null type:None
[junit4] 2> 1196479 INFO (TEST-FullSolrCloudDistribCmdsTest.test-seed#[35A7EAB14F623A99]) [ ] o.a.s.c.c.ConnectionManager Client is connected to ZooKeeper
[junit4] 2> 1196479 INFO (TEST-FullSolrCloudDistribCmdsTest.test-seed#[35A7EAB14F623A99]) [ ] o.a.s.c.c.SolrZkClient Using default ZkACLProvider
[junit4] 2> 1196479 INFO (TEST-FullSolrCloudDistribCmdsTest.test-seed#[35A7EAB14F623A99]) [ ] o.a.s.c.c.SolrZkClient makePath: /solr
[junit4] 2> 1196480 INFO (TEST-FullSolrCloudDistribCmdsTest.test-seed#[35A7EAB14F623A99]) [ ] o.a.s.c.c.SolrZkClient Using default ZkCredentialsProvider
[junit4] 2> 1196481 INFO (TEST-FullSolrCloudDistribCmdsTest.test-seed#[35A7EAB14F623A99]) [ ] o.a.s.c.c.ConnectionManager Waiting for client to connect to ZooKeeper
[junit4] 2> 1196481 INFO (zkCallback-1657-thread-1) [ ] o.a.s.c.c.ConnectionManager Watcher org.apache.solr.common.cloud.ConnectionManager@197d1ba name:ZooKeeperConnection Watcher:127.0.0.1:59819/solr got event WatchedEvent state:SyncConnected type:None path:null path:null type:None
[junit4] 2> 1196481 INFO (TEST-FullSolrCloudDistribCmdsTest.test-seed#[35A7EAB14F623A99]) [ ] o.a.s.c.c.ConnectionManager Client is connected to ZooKeeper
[junit4] 2> 1196482 INFO (TEST-FullSolrCloudDistribCmdsTest.test-seed#[35A7EAB14F623A99]) [ ] o.a.s.c.c.SolrZkClient Using default ZkACLProvider
[junit4] 2> 1196482 INFO (TEST-FullSolrCloudDistribCmdsTest.test-seed#[35A7EAB14F623A99]) [ ] o.a.s.c.c.SolrZkClient makePath: /collections/collection1
[junit4] 2> 1196482 INFO (TEST-FullSolrCloudDistribCmdsTest.test-seed#[35A7EAB14F623A99]) [ ] o.a.s.c.c.SolrZkClient makePath: /collections/collection1/shards
[junit4] 2> 1196483 INFO (TEST-FullSolrCloudDistribCmdsTest.test-seed#[35A7EAB14F623A99]) [ ] o.a.s.c.c.SolrZkClient makePath: /collections/control_collection
[junit4] 2> 1196484 INFO (TEST-FullSolrCloudDistribCmdsTest.test-seed#[35A7EAB14F623A99]) [ ] o.a.s.c.c.SolrZkClient makePath: /collections/control_collection/shards
[junit4] 2> 1196484 INFO (TEST-FullSolrCloudDistribCmdsTest.test-seed#[35A7EAB14F623A99]) [ ] o.a.s.c.AbstractZkTestCase put /home/jenkins/workspace/Lucene-Solr-5.x-Linux/solr/core/src/test-files/solr/collection1/conf/solrconfig-tlog.xml to /configs/conf1/solrconfig.xml
[junit4] 2> 1196484 INFO (TEST-FullSolrCloudDistribCmdsTest.test-seed#[35A7EAB14F623A99]) [ ] o.a.s.c.c.SolrZkClient makePath: /configs/conf1/solrconfig.xml
[junit4] 2> 1196485 INFO (TEST-FullSolrCloudDistribCmdsTest.test-seed#[35A7EAB14F623A99]) [ ] o.a.s.c.AbstractZkTestCase put /home/jenkins/workspace/Lucene-Solr-5.x-Linux/solr/core/src/test-files/solr/collection1/conf/schema15.xml to /configs/conf1/schema.xml
[junit4] 2> 1196485 INFO (TEST-FullSolrCloudDistribCmdsTest.test-seed#[35A7EAB14F623A99]) [ ] o.a.s.c.c.SolrZkClient makePath: /configs/conf1/schema.xml
[junit4] 2> 1196486 INFO (TEST-FullSolrCloudDistribCmdsTest.test-seed#[35A7EAB14F623A99]) [ ] o.a.s.c.AbstractZkTestCase put /home/jenkins/workspace/Lucene-Solr-5.x-Linux/solr/core/src/test-files/solr/collection1/conf/solrconfig.snippet.randomindexconfig.xml to /configs/conf1/solrconfig.snippet.randomindexconfig.xml
[junit4] 2> 1196486 INFO (TEST-FullSolrCloudDistribCmdsTest.test-seed#[35A7EAB14F623A99]) [ ] o.a.s.c.c.SolrZkClient makePath: /configs/conf1/solrconfig.snippet.randomindexconfig.xml
[junit4] 2> 1196487 INFO (TEST-FullSolrCloudDistribCmdsTest.test-seed#[35A7EAB14F623A99]) [ ] o.a.s.c.AbstractZkTestCase put /home/jenkins/workspace/Lucene-Solr-5.x-Linux/solr/core/src/test-files/solr/collection1/conf/stopwords.txt to /configs/conf1/stopwords.txt
[junit4] 2> 1196487 INFO (TEST-FullSolrCloudDistribCmdsTest.test-seed#[35A7EAB14F623A99]) [ ] o.a.s.c.c.SolrZkClient makePath: /configs/conf1/stopwords.txt
[junit4] 2> 1196488 INFO (TEST-FullSolrCloudDistribCmdsTest.test-seed#[35A7EAB14F623A99]) [ ] o.a.s.c.AbstractZkTestCase put /home/jenkins/workspace/Lucene-Solr-5.x-Linux/solr/core/src/test-files/solr/collection1/conf/protwords.txt to /configs/conf1/protwords.txt
[junit4] 2> 1196488 INFO (TEST-FullSolrCloudDistribCmdsTest.test-seed#[35A7EAB14F623A99]) [ ] o.a.s.c.c.SolrZkClient makePath: /configs/conf1/protwords.txt
[junit4] 2> 1196488 INFO (TEST-FullSolrCloudDistribCmdsTest.test-seed#[35A7EAB14F623A99]) [ ] o.a.s.c.AbstractZkTestCase put /home/jenkins/workspace/Lucene-Solr-5.x-Linux/solr/core/src/test-files/solr/collection1/conf/currency.xml to /configs/conf1/currency.xml
[junit4] 2> 1196488 INFO (TEST-FullSolrCloudDistribCmdsTest.test-seed#[35A7EAB14F623A99]) [ ] o.a.s.c.c.SolrZkClient makePath: /configs/conf1/currency.xml
[junit4] 2> 1196489 INFO (TEST-FullSolrCloudDistribCmdsTest.test-seed#[35A7EAB14F623A99]) [ ] o.a.s.c.AbstractZkTestCase put /home/jenkins/workspace/Lucene-Solr-5.x-Linux/solr/core/src/test-files/solr/collection1/conf/enumsConfig.xml to /configs/conf1/enumsConfig.xml
[junit4] 2> 1196489 INFO (TEST-FullSolrCloudDistribCmdsTest.test-seed#[35A7EAB14F623A99]) [ ] o.a.s.c.c.SolrZkClient makePath: /configs/conf1/enumsConfig.xml
[junit4] 2> 1196490 INFO (TEST-FullSolrCloudDistribCmdsTest.test-seed#[35A7EAB14F623A99]) [ ] o.a.s.c.AbstractZkTestCase put /home/jenkins/workspace/Lucene-Solr-5.x-Linux/solr/core/src/test-files/solr/collection1/conf/open-exchange-rates.json to /configs/conf1/open-exchange-rates.json
[junit4] 2> 1196490 INFO (TEST-FullSolrCloudDistribCmdsTest.test-seed#[35A7EAB14F623A99]) [ ] o.a.s.c.c.SolrZkClient makePath: /configs/conf1/open-exchange-rates.json
[junit4] 2> 1196491 INFO (TEST-FullSolrCloudDistribCmdsTest.test-seed#[35A7EAB14F623A99]) [ ] o.a.s.c.AbstractZkTestCase put /home/jenkins/workspace/Lucene-Solr-5.x-Linux/solr/core/src/test-files/solr/collection1/conf/mapping-ISOLatin1Accent.txt to /configs/conf1/mapping-ISOLatin1Accent.txt
[junit4] 2> 1196491 INFO (TEST-FullSolrCloudDistribCmdsTest.test-seed#[35A7EAB14F623A99]) [ ] o.a.s.c.c.SolrZkClient makePath: /configs/conf1/mapping-ISOLatin1Accent.txt
[junit4] 2> 1196492 INFO (TEST-FullSolrCloudDistribCmdsTest.test-seed#[35A7EAB14F623A99]) [ ] o.a.s.c.AbstractZkTestCase put /home/jenkins/workspace/Lucene-Solr-5.x-Linux/solr/core/src/test-files/solr/collection1/conf/old_synonyms.txt to /configs/conf1/old_synonyms.txt
[junit4] 2> 1196492 INFO (TEST-FullSolrCloudDistribCmdsTest.test-seed#[35A7EAB14F623A99]) [ ] o.a.s.c.c.SolrZkClient makePath: /configs/conf1/old_synonyms.txt
[junit4] 2> 1196493 INFO (TEST-FullSolrCloudDistribCmdsTest.test-seed#[35A7EAB14F623A99]) [ ] o.a.s.c.AbstractZkTestCase put /home/jenkins/workspace/Lucene-Solr-5.x-Linux/solr/core/src/test-files/solr/collection1/conf/synonyms.txt to /configs/conf1/synonyms.txt
[junit4] 2> 1196493 INFO (TEST-FullSolrCloudDistribCmdsTest.test-seed#[35A7EAB14F623A99]) [ ] o.a.s.c.c.SolrZkClient makePath: /configs/conf1/synonyms.txt
[junit4] 2> 1196544 INFO (TEST-FullSolrCloudDistribCmdsTest.test-seed#[35A7EAB14F623A99]) [ ] o.a.s.SolrTestCaseJ4 Writing core.properties file to /home/jenkins/workspace/Lucene-Solr-5.x-Linux/solr/build/solr-core/test/J1/temp/solr.cloud.FullSolrCloudDistribCmdsTest_35A7EAB14F623A99-001/control-001/cores/collection1
[junit4] 2> 1196545 INFO (TEST-FullSolrCloudDistribCmdsTest.test-seed#[35A7EAB14F623A99]) [ ] o.e.j.s.Server jetty-9.2.11.v20150529
[junit4] 2> 1196546 INFO (TEST-FullSolrCloudDistribCmdsTest.test-seed#[35A7EAB14F623A99]) [ ] o.e.j.s.h.ContextHandler Started o.e.j.s.ServletContextHandler@1cfc16a{/,null,AVAILABLE}
[junit4] 2> 1196547 INFO (TEST-FullSolrCloudDistribCmdsTest.test-seed#[35A7EAB14F623A99]) [ ] o.e.j.s.ServerConnector Started ServerConnector@684431{HTTP/1.1}{127.0.0.1:44663}
[junit4] 2> 1196548 INFO (TEST-FullSolrCloudDistribCmdsTest.test-seed#[35A7EAB14F623A99]) [ ] o.e.j.s.Server Started @1197929ms
[junit4] 2> 1196548 INFO (TEST-FullSolrCloudDistribCmdsTest.test-seed#[35A7EAB14F623A99]) [ ] o.a.s.c.s.e.JettySolrRunner Jetty properties: {hostContext=/, hostPort=44663, coreRootDirectory=/home/jenkins/workspace/Lucene-Solr-5.x-Linux/solr/build/solr-core/test/J1/../../../../../../../../../home/jenkins/workspace/Lucene-Solr-5.x-Linux/solr/build/solr-core/test/J1/temp/solr.cloud.FullSolrCloudDistribCmdsTest_35A7EAB14F623A99-001/control-001/cores, solr.data.dir=/home/jenkins/workspace/Lucene-Solr-5.x-Linux/solr/build/solr-core/test/J1/temp/solr.cloud.FullSolrCloudDistribCmdsTest_35A7EAB14F623A99-001/tempDir-001/control/data}
[junit4] 2> 1196548 INFO (TEST-FullSolrCloudDistribCmdsTest.test-seed#[35A7EAB14F623A99]) [ ] o.a.s.s.SolrDispatchFilter SolrDispatchFilter.init()sun.misc.Launcher$AppClassLoader@893918
[junit4] 2> 1196548 INFO (TEST-FullSolrCloudDistribCmdsTest.test-seed#[35A7EAB14F623A99]) [ ] o.a.s.c.SolrResourceLoader new SolrResourceLoader for directory: '/home/jenkins/workspace/Lucene-Solr-5.x-Linux/solr/build/solr-core/test/J1/../../../../../../../../../home/jenkins/workspace/Lucene-Solr-5.x-Linux/solr/build/solr-core/test/J1/temp/solr.cloud.FullSolrCloudDistribCmdsTest_35A7EAB14F623A99-001/control-001/'
[junit4] 2> 1196560 INFO (TEST-FullSolrCloudDistribCmdsTest.test-seed#[35A7EAB14F623A99]) [ ] o.a.s.c.SolrXmlConfig Loading container configuration from /home/jenkins/workspace/Lucene-Solr-5.x-Linux/solr/build/solr-core/test/J1/../../../../../../../../../home/jenkins/workspace/Lucene-Solr-5.x-Linux/solr/build/solr-core/test/J1/temp/solr.cloud.FullSolrCloudDistribCmdsTest_35A7EAB14F623A99-001/control-001/solr.xml
[junit4] 2> 1196570 INFO (TEST-FullSolrCloudDistribCmdsTest.test-seed#[35A7EAB14F623A99]) [ ] o.a.s.c.CoresLocator Config-defined core root directory: /home/jenkins/workspace/Lucene-Solr-5.x-Linux/solr/build/solr-core/test/J1/../../../../../../../../../home/jenkins/workspace/Lucene-Solr-5.x-Linux/solr/build/solr-core/test/J1/temp/solr.cloud.FullSolrCloudDistribCmdsTest_35A7EAB14F623A99-001/control-001/cores
[junit4] 2> 1196570 INFO (TEST-FullSolrCloudDistribCmdsTest.test-seed#[35A7EAB14F623A99]) [ ] o.a.s.c.CoreContainer New CoreContainer 7384413
[junit4] 2> 1196570 INFO (TEST-FullSolrCloudDistribCmdsTest.test-seed#[35A7EAB14F623A99]) [ ] o.a.s.c.CoreContainer Loading cores into CoreContainer [instanceDir=/home/jenkins/workspace/Lucene-Solr-5.x-Linux/solr/build/solr-core/test/J1/../../../../../../../../../home/jenkins/workspace/Lucene-Solr-5.x-Linux/solr/build/solr-core/test/J1/temp/solr.cloud.FullSolrCloudDistribCmdsTest_35A7EAB14F623A99-001/control-001/]
[junit4] 2> 1196570 INFO (TEST-FullSolrCloudDistribCmdsTest.test-seed#[35A7EAB14F623A99]) [ ] o.a.s.c.CoreContainer loading shared library: /home/jenkins/workspace/Lucene-Solr-5.x-Linux/solr/build/solr-core/test/J1/../../../../../../../../../home/jenkins/workspace/Lucene-Solr-5.x-Linux/solr/build/solr-core/test/J1/temp/solr.cloud.FullSolrCloudDistribCmdsTest_35A7EAB14F623A99-001/control-001/lib
[junit4] 2> 1196571 WARN (TEST-FullSolrCloudDistribCmdsTest.test-seed#[35A7EAB14F623A99]) [ ] o.a.s.c.SolrResourceLoader Can't find (or read) directory to add to classloader: lib (resolved as: /home/jenkins/workspace/Lucene-Solr-5.x-Linux/solr/build/solr-core/test/J1/../../../../../../../../../home/jenkins/workspace/Lucene-Solr-5.x-Linux/solr/build/solr-core/test/J1/temp/solr.cloud.FullSolrCloudDistribCmdsTest_35A7EAB14F623A99-001/control-001/lib).
[junit4] 2> 1196575 INFO (TEST-FullSolrCloudDistribCmdsTest.test-seed#[35A7EAB14F623A99]) [ ] o.a.s.h.c.HttpShardHandlerFactory created with socketTimeout : 90000,urlScheme : ,connTimeout : 15000,maxConnectionsPerHost : 20,maxConnections : 10000,corePoolSize : 0,maximumPoolSize : 2147483647,maxThreadIdleTime : 5,sizeOfQueue : -1,fairnessPolicy : false,useRetries : false,
[junit4] 2> 1196576 INFO (TEST-FullSolrCloudDistribCmdsTest.test-seed#[35A7EAB14F623A99]) [ ] o.a.s.u.UpdateShardHandler Creating UpdateShardHandler HTTP client with params: socketTimeout=340000&connTimeout=45000&retry=true
[junit4] 2> 1196577 INFO (TEST-FullSolrCloudDistribCmdsTest.test-seed#[35A7EAB14F623A99]) [ ] o.a.s.l.LogWatcher SLF4J impl is org.slf4j.impl.Log4jLoggerFactory
[junit4] 2> 1196577 INFO (TEST-FullSolrCloudDistribCmdsTest.test-seed#[35A7EAB14F623A99]) [ ] o.a.s.l.LogWatcher Registering Log Listener [Log4j (org.slf4j.impl.Log4jLoggerFactory)]
[junit4] 2> 1196577 INFO (TEST-FullSolrCloudDistribCmdsTest.test-seed#[35A7EAB14F623A99]) [ ] o.a.s.c.ZkContainer Zookeeper client=127.0.0.1:59819/solr
[junit4] 2> 1196577 INFO (TEST-FullSolrCloudDistribCmdsTest.test-seed#[35A7EAB14F623A99]) [ ] o.a.s.c.ZkController zkHost includes chroot
[junit4] 2> 1196577 INFO (TEST-FullSolrCloudDistribCmdsTest.test-seed#[35A7EAB14F623A99]) [ ] o.a.s.c.c.SolrZkClient Using default ZkCredentialsProvider
[junit4] 2> 1196578 INFO (TEST-FullSolrCloudDistribCmdsTest.test-seed#[35A7EAB14F623A99]) [ ] o.a.s.c.c.ConnectionManager Waiting for client to connect to ZooKeeper
[junit4] 2> 1196578 INFO (zkCallback-1659-thread-1) [ ] o.a.s.c.c.ConnectionManager Watcher org.apache.solr.common.cloud.ConnectionManager@762db5 name:ZooKeeperConnection Watcher:127.0.0.1:59819 got event WatchedEvent state:SyncConnected type:None path:null path:null type:None
[junit4] 2> 1196579 INFO (TEST-FullSolrCloudDistribCmdsTest.test-seed#[35A7EAB14F623A99]) [ ] o.a.s.c.c.ConnectionManager Client is connected to ZooKeeper
[junit4] 2> 1196579 INFO (TEST-FullSolrCloudDistribCmdsTest.test-seed#[35A7EAB14F623A99]) [ ] o.a.s.c.c.SolrZkClient Using default ZkACLProvider
[junit4] 2> 1196580 INFO (TEST-FullSolrCloudDistribCmdsTest.test-seed#[35A7EAB14F623A99]) [n:127.0.0.1:44663_ ] o.a.s.c.c.ConnectionManager Waiting for client to connect to ZooKeeper
[junit4] 2> 1196580 INFO (zkCallback-1660-thread-1-processing-n:127.0.0.1:44663_) [n:127.0.0.1:44663_ ] o.a.s.c.c.ConnectionManager Watcher org.apache.solr.common.cloud.ConnectionManager@4dd558 name:ZooKeeperConnection Watcher:127.0.0.1:59819/solr got event WatchedEvent state:SyncConnected type:None path:null path:null type:None
[junit4] 2> 1196581 INFO (TEST-FullSolrCloudDistribCmdsTest.test-seed#[35A7EAB14F623A99]) [n:127.0.0.1:44663_ ] o.a.s.c.c.ConnectionManager Client is connected to ZooKeeper
[junit4] 2> 1196581 INFO (TEST-FullSolrCloudDistribCmdsTest.test-seed#[35A7EAB14F623A99]) [n:127.0.0.1:44663_ ] o.a.s.c.c.SolrZkClient makePath: /overseer/queue
[junit4] 2> 1196582 INFO (TEST-FullSolrCloudDistribCmdsTest.test-seed#[35A7EAB14F623A99]) [n:127.0.0.1:44663_ ] o.a.s.c.c.SolrZkClient makePath: /overseer/collection-queue-work
[junit4] 2> 1196583 INFO (TEST-FullSolrCloudDistribCmdsTest.test-seed#[35A7EAB14F623A99]) [n:127.0.0.1:44663_ ] o.a.s.c.c.SolrZkClient makePath: /overseer/collection-map-running
[junit4] 2> 1196583 INFO (TEST-FullSolrCloudDistribCmdsTest.test-seed#[35A7EAB14F623A99]) [n:127.0.0.1:44663_ ] o.a.s.c.c.SolrZkClient makePath: /overseer/collection-map-completed
[junit4] 2> 1196584 INFO (TEST-FullSolrCloudDistribCmdsTest.test-seed#[35A7EAB14F623A99]) [n:127.0.0.1:44663_ ] o.a.s.c.c.SolrZkClient makePath: /overseer/collection-map-failure
[junit4] 2> 1196585 INFO (TEST-FullSolrCloudDistribCmdsTest.test-seed#[35A7EAB14F623A99]) [n:127.0.0.1:44663_ ] o.a.s.c.c.SolrZkClient makePath: /live_nodes
[junit4] 2> 1196585 INFO (TEST-FullSolrCloudDistribCmdsTest.test-seed#[35A7EAB14F623A99]) [n:127.0.0.1:44663_ ] o.a.s.c.c.SolrZkClient makePath: /aliases.json
[junit4] 2> 1196586 INFO (TEST-FullSolrCloudDistribCmdsTest.test-seed#[35A7EAB14F623A99]) [n:127.0.0.1:44663_ ] o.a.s.c.c.SolrZkClient makePath: /clusterstate.json
[junit4] 2> 1196586 INFO (TEST-FullSolrCloudDistribCmdsTest.test-seed#[35A7EAB14F623A99]) [n:127.0.0.1:44663_ ] o.a.s.c.ZkController Register node as live in ZooKeeper:/live_nodes/127.0.0.1:44663_
[junit4] 2> 1196587 INFO (TEST-FullSolrCloudDistribCmdsTest.test-seed#[35A7EAB14F623A99]) [n:127.0.0.1:44663_ ] o.a.s.c.c.SolrZkClient makePath: /live_nodes/127.0.0.1:44663_
[junit4] 2> 1196587 INFO (TEST-FullSolrCloudDistribCmdsTest.test-seed#[35A7EAB14F623A99]) [n:127.0.0.1:44663_ ] o.a.s.c.c.SolrZkClient makePath: /overseer_elect
[junit4] 2> 1196588 INFO (TEST-FullSolrCloudDistribCmdsTest.test-seed#[35A7EAB14F623A99]) [n:127.0.0.1:44663_ ] o.a.s.c.c.SolrZkClient makePath: /overseer_elect/election
[junit4] 2> 1196588 INFO (TEST-FullSolrCloudDistribCmdsTest.test-seed#[35A7EAB14F623A99]) [n:127.0.0.1:44663_ ] o.a.s.c.Overseer Overseer (id=null) closing
[junit4] 2> 1196589 INFO (TEST-FullSolrCloudDistribCmdsTest.test-seed#[35A7EAB14F623A99]) [n:127.0.0.1:44663_ ] o.a.s.c.OverseerElectionContext I am going to be the leader 127.0.0.1:44663_
[junit4] 2> 1196589 INFO (TEST-FullSolrCloudDistribCmdsTest.test-seed#[35A7EAB14F623A99]) [n:127.0.0.1:44663_ ] o.a.s.c.c.SolrZkClient makePath: /overseer_elect/leader
[junit4] 2> 1196589 INFO (TEST-FullSolrCloudDistribCmdsTest.test-seed#[35A7EAB14F623A99]) [n:127.0.0.1:44663_ ] o.a.s.c.Overseer Overseer (id=93980491864997891-127.0.0.1:44663_-n_0000000000) starting
[junit4] 2> 1196590 INFO (TEST-FullSolrCloudDistribCmdsTest.test-seed#[35A7EAB14F623A99]) [n:127.0.0.1:44663_ ] o.a.s.c.c.SolrZkClient makePath: /overseer/queue-work
[junit4] 2> 1196592 INFO (TEST-FullSolrCloudDistribCmdsTest.test-seed#[35A7EAB14F623A99]) [n:127.0.0.1:44663_ ] o.a.s.c.OverseerAutoReplicaFailoverThread Starting OverseerAutoReplicaFailoverThread autoReplicaFailoverWorkLoopDelay=10000 autoReplicaFailoverWaitAfterExpiration=30000 autoReplicaFailoverBadNodeExpiration=60000
[junit4] 2> 1196592 INFO (OverseerCollectionProcessor-93980491864997891-127.0.0.1:44663_-n_0000000000) [n:127.0.0.1:44663_ ] o.a.s.c.OverseerCollectionProcessor Process current queue of collection creations
[junit4] 2> 1196592 INFO (TEST-FullSolrCloudDistribCmdsTest.test-seed#[35A7EAB14F623A99]) [n:127.0.0.1:44663_ ] o.a.s.c.c.ZkStateReader Updating cluster state from ZooKeeper...
[junit4] 2> 1196592 INFO (OverseerStateUpdate-93980491864997891-127.0.0.1:44663_-n_0000000000) [n:127.0.0.1:44663_ ] o.a.s.c.Overseer Starting to work on the main queue
[junit4] 2> 1196594 INFO (TEST-FullSolrCloudDistribCmdsTest.test-seed#[35A7EAB14F623A99]) [n:127.0.0.1:44663_ ] o.a.s.c.CoreContainer No authentication plugin used.
[junit4] 2> 1196594 INFO (TEST-FullSolrCloudDistribCmdsTest.test-seed#[35A7EAB14F623A99]) [n:127.0.0.1:44663_ ] o.a.s.c.CoreContainer Security conf doesn't exist. Skipping setup for authorization module.
[junit4] 2> 1196595 INFO (TEST-FullSolrCloudDistribCmdsTest.test-seed#[35A7EAB14F623A99]) [n:127.0.0.1:44663_ ] o.a.s.c.CoresLocator Looking for core definitions underneath /home/jenkins/workspace/Lucene-Solr-5.x-Linux/solr/build/solr-core/test/J1/../../../../../../../../../home/jenkins/workspace/Lucene-Solr-5.x-Linux/solr/build/solr-core/test/J1/temp/solr.cloud.FullSolrCloudDistribCmdsTest_35A7EAB14F623A99-001/control-001/cores
[junit4] 2> 1196596 INFO (TEST-FullSolrCloudDistribCmdsTest.test-seed#[35A7EAB14F623A99]) [n:127.0.0.1:44663_ ] o.a.s.c.SolrCore Created CoreDescriptor: {loadOnStartup=true, coreNodeName=, dataDir=data/, transient=false, schema=schema.xml, name=collection1, absoluteInstDir=/home/jenkins/workspace/Lucene-Solr-5.x-Linux/solr/build/solr-core/test/J1/../../../../../../../../../home/jenkins/workspace/Lucene-Solr-5.x-Linux/solr/build/solr-core/test/J1/temp/solr.cloud.FullSolrCloudDistribCmdsTest_35A7EAB14F623A99-001/control-001/cores/collection1/, instanceDir=/home/jenkins/workspace/Lucene-Solr-5.x-Linux/solr/build/solr-core/test/J1/../../../../../../../../../home/jenkins/workspace/Lucene-Solr-5.x-Linux/solr/build/solr-core/test/J1/temp/solr.cloud.FullSolrCloudDistribCmdsTest_35A7EAB14F623A99-001/control-001/cores/collection1, config=solrconfig.xml, shard=, collection=control_collection}
[junit4] 2> 1196596 INFO (TEST-FullSolrCloudDistribCmdsTest.test-seed#[35A7EAB14F623A99]) [n:127.0.0.1:44663_ ] o.a.s.c.CoresLocator Found core collection1 in /home/jenkins/workspace/Lucene-Solr-5.x-Linux/solr/build/solr-core/test/J1/../../../../../../../../../home/jenkins/workspace/Lucene-Solr-5.x-Linux/solr/build/solr-core/test/J1/temp/solr.cloud.FullSolrCloudDistribCmdsTest_35A7EAB14F623A99-001/control-001/cores/collection1/
[junit4] 2> 1196596 INFO (TEST-FullSolrCloudDistribCmdsTest.test-seed#[35A7EAB14F623A99]) [n:127.0.0.1:44663_ ] o.a.s.c.CoresLocator Found 1 core definitions
[junit4] 2> 1196596 INFO (coreLoadExecutor-2692-thread-1-processing-n:127.0.0.1:44663_) [n:127.0.0.1:44663_ c:control_collection x:collection1] o.a.s.c.ZkController publishing state=down
[junit4] 2> 1196596 INFO (TEST-FullSolrCloudDistribCmdsTest.test-seed#[35A7EAB14F623A99]) [n:127.0.0.1:44663_ ] o.a.s.s.SolrDispatchFilter user.dir=/home/jenkins/workspace/Lucene-Solr-5.x-Linux/solr/build/solr-core/test/J1
[junit4] 2> 1196597 INFO (TEST-FullSolrCloudDistribCmdsTest.test-seed#[35A7EAB14F623A99]) [n:127.0.0.1:44663_ ] o.a.s.s.SolrDispatchFilter SolrDispatchFilter.init() done
[junit4] 2> 1196596 INFO (coreLoadExecutor-2692-thread-1-processing-n:127.0.0.1:44663_) [n:127.0.0.1:44663_ c:control_collection x:collection1] o.a.s.c.ZkController numShards not found on descriptor - reading it from system property
[junit4] 2> 1196597 INFO (zkCallback-1660-thread-1-processing-n:127.0.0.1:44663_) [n:127.0.0.1:44663_ ] o.a.s.c.DistributedQueue NodeChildrenChanged fired on path /overseer/queue state SyncConnected
[junit4] 2> 1196597 INFO (coreLoadExecutor-2692-thread-1-processing-n:127.0.0.1:44663_) [n:127.0.0.1:44663_ c:control_collection x:collection1] o.a.s.c.ZkController look for our core node name
[junit4] 2> 1196598 INFO (OverseerStateUpdate-93980491864997891-127.0.0.1:44663_-n_0000000000) [n:127.0.0.1:44663_ ] o.a.s.c.Overseer processMessage: queueSize: 1, message = {
[junit4] 2> "collection":"control_collection",
[junit4] 2> "state":"down",
[junit4] 2> "roles":null,
[junit4] 2> "node_name":"127.0.0.1:44663_",
[junit4] 2> "numShards":"1",
[junit4] 2> "operation":"state",
[junit4] 2> "base_url":"http://127.0.0.1:44663",
[junit4] 2> "shard":null,
[junit4] 2> "core":"collection1"} current state version: 0
[junit4] 2> 1196598 INFO (OverseerStateUpdate-93980491864997891-127.0.0.1:44663_-n_0000000000) [n:127.0.0.1:44663_ ] o.a.s.c.o.ReplicaMutator Update state numShards=1 message={
[junit4] 2> "collection":"control_collection",
[junit4] 2> "state":"down",
[junit4] 2> "roles":null,
[junit4] 2> "node_name":"127.0.0.1:44663_",
[junit4] 2> "numShards":"1",
[junit4] 2> "operation":"state",
[junit4] 2> "base_url":"http://127.0.0.1:44663",
[junit4] 2> "shard":null,
[junit4] 2> "core":"collection1"}
[junit4] 2> 1196598 INFO (OverseerStateUpdate-93980491864997891-127.0.0.1:44663_-n_0000000000) [n:127.0.0.1:44663_ ] o.a.s.c.o.ClusterStateMutator building a new cName: control_collection
[junit4] 2> 1196598 INFO (OverseerStateUpdate-93980491864997891-127.0.0.1:44663_-n_0000000000) [n:127.0.0.1:44663_ ] o.a.s.c.o.ReplicaMutator Assigning new node to shard shard=shard1
[junit4] 2> 1196599 INFO (zkCallback-1660-thread-1-processing-n:127.0.0.1:44663_) [n:127.0.0.1:44663_ ] o.a.s.c.c.ZkStateReader A cluster state change: WatchedEvent state:SyncConnected type:NodeDataChanged path:/clusterstate.json, has occurred - updating... (live nodes size: 1)
[junit4] 2> 1196599 INFO (zkCallback-1660-thread-1-processing-n:127.0.0.1:44663_) [n:127.0.0.1:44663_ ] o.a.s.c.c.ZkStateReader Updated cluster state version to 1
[junit4] 2> 1197597 INFO (coreLoadExecutor-2692-thread-1-processing-n:127.0.0.1:44663_) [n:127.0.0.1:44663_ c:control_collection x:collection1] o.a.s.c.ZkController waiting to find shard id in clusterstate for collection1
[junit4] 2> 1197598 INFO (coreLoadExecutor-2692-thread-1-processing-n:127.0.0.1:44663_) [n:127.0.0.1:44663_ c:control_collection x:collection1] o.a.s.c.ZkController Check for collection zkNode:control_collection
[junit4] 2> 1197598 INFO (coreLoadExecutor-2692-thread-1-processing-n:127.0.0.1:44663_) [n:127.0.0.1:44663_ c:control_collection x:collection1] o.a.s.c.ZkController Collection zkNode exists
[junit4] 2> 1197598 INFO (coreLoadExecutor-2692-thread-1-processing-n:127.0.0.1:44663_) [n:127.0.0.1:44663_ c:control_collection x:collection1] o.a.s.c.c.ZkStateReader Load collection config from:/collections/control_collection
[junit4] 2> 1197599 INFO (coreLoadExecutor-2692-thread-1-processing-n:127.0.0.1:44663_) [n:127.0.0.1:44663_ c:control_collection x:collection1] o.a.s.c.c.ZkStateReader path=/collections/control_collection configName=conf1 specified config exists in ZooKeeper
[junit4] 2> 1197599 INFO (coreLoadExecutor-2692-thread-1-processing-n:127.0.0.1:44663_) [n:127.0.0.1:44663_ c:control_collection x:collection1] o.a.s.c.SolrResourceLoader new SolrResourceLoader for directory: '/home/jenkins/workspace/Lucene-Solr-5.x-Linux/solr/build/solr-core/test/J1/../../../../../../../../../home/jenkins/workspace/Lucene-Solr-5.x-Linux/solr/build/solr-core/test/J1/temp/solr.cloud.FullSolrCloudDistribCmdsTest_35A7EAB14F623A99-001/control-001/cores/collection1/'
[junit4] 2> 1197610 INFO (coreLoadExecutor-2692-thread-1-processing-n:127.0.0.1:44663_) [n:127.0.0.1:44663_ c:control_collection x:collection1] o.a.s.c.Config loaded config solrconfig.xml with version 0
[junit4] 2> 1197614 INFO (coreLoadExecutor-2692-thread-1-processing-n:127.0.0.1:44663_) [n:127.0.0.1:44663_ c:control_collection x:collection1] o.a.s.c.SolrConfig current version of requestparams : -1
[junit4] 2> 1197624 INFO (coreLoadExecutor-2692-thread-1-processing-n:127.0.0.1:44663_) [n:127.0.0.1:44663_ c:control_collection x:collection1] o.a.s.c.SolrConfig Using Lucene MatchVersion: 5.3.0
[junit4] 2> 1197645 INFO (coreLoadExecutor-2692-thread-1-processing-n:127.0.0.1:44663_) [n:127.0.0.1:44663_ c:control_collection x:collection1] o.a.s.c.Config Loaded SolrConfig: solrconfig.xml
[junit4] 2> 1197645 INFO (coreLoadExecutor-2692-thread-1-processing-n:127.0.0.1:44663_) [n:127.0.0.1:44663_ c:control_collection x:collection1] o.a.s.s.IndexSchema Reading Solr Schema from /configs/conf1/schema.xml
[junit4] 2> 1197650 INFO (coreLoadExecutor-2692-thread-1-processing-n:127.0.0.1:44663_) [n:127.0.0.1:44663_ c:control_collection x:collection1] o.a.s.s.IndexSchema [collection1] Schema name=test
[junit4] 2> 1197809 INFO (coreLoadExecutor-2692-thread-1-processing-n:127.0.0.1:44663_) [n:127.0.0.1:44663_ c:control_collection x:collection1] o.a.s.s.IndexSchema default search field in schema is text
[junit4] 2> 1197810 INFO (coreLoadExecutor-2692-thread-1-processing-n:127.0.0.1:44663_) [n:127.0.0.1:44663_ c:control_collection x:collection1] o.a.s.s.IndexSchema unique key field: id
[junit4] 2> 1197811 INFO (coreLoadExecutor-2692-thread-1-processing-n:127.0.0.1:44663_) [n:127.0.0.1:44663_ c:control_collection x:collection1] o.a.s.s.FileExchangeRateProvider Reloading exchange rates from file currency.xml
[junit4] 2> 1197813 INFO (coreLoadExecutor-2692-thread-1-processing-n:127.0.0.1:44663_) [n:127.0.0.1:44663_ c:control_collection x:collection1] o.a.s.s.FileExchangeRateProvider Reloading exchange rates from file currency.xml
[junit4] 2> 1197821 INFO (coreLoadExecutor-2692-thread-1-processing-n:127.0.0.1:44663_) [n:127.0.0.1:44663_ c:control_collection x:collection1] o.a.s.c.CoreContainer Creating SolrCore 'collection1' using configuration from collection control_collection
[junit4] 2> 1197821 INFO (coreLoadExecutor-2692-thread-1-processing-n:127.0.0.1:44663_) [n:127.0.0.1:44663_ c:control_collection s:shard1 r:core_node1 x:collection1] o.a.s.c.SolrCore org.apache.solr.core.MockDirectoryFactory
[junit4] 2> 1197821 INFO (coreLoadExecutor-2692-thread-1-processing-n:127.0.0.1:44663_) [n:127.0.0.1:44663_ c:control_collection s:shard1 r:core_node1 x:collection1] o.a.s.c.SolrCore [[collection1] ] Opening new SolrCore at [/home/jenkins/workspace/Lucene-Solr-5.x-Linux/solr/build/solr-core/test/J1/../../../../../../../../../home/jenkins/workspace/Lucene-Solr-5.x-Linux/solr/build/solr-core/test/J1/temp/solr.cloud.FullSolrCloudDistribCmdsTest_35A7EAB14F623A99-001/control-001/cores/collection1/], dataDir=[null]
[junit4] 2> 1197821 INFO (coreLoadExecutor-2692-thread-1-processing-n:127.0.0.1:44663_) [n:127.0.0.1:44663_ c:control_collection s:shard1 r:core_node1 x:collection1] o.a.s.c.JmxMonitoredMap JMX monitoring is enabled. Adding Solr mbeans to JMX Server: com.sun.jmx.mbeanserver.JmxMBeanServer@60461
[junit4] 2> 1197822 INFO (coreLoadExecutor-2692-thread-1-processing-n:127.0.0.1:44663_) [n:127.0.0.1:44663_ c:control_collection s:shard1 r:core_node1 x:collection1] o.a.s.c.CachingDirectoryFactory return new directory for /home/jenkins/workspace/Lucene-Solr-5.x-Linux/solr/build/solr-core/test/J1/../../../../../../../../../home/jenkins/workspace/Lucene-Solr-5.x-Linux/solr/build/solr-core/test/J1/temp/solr.cloud.FullSolrCloudDistribCmdsTest_35A7EAB14F623A99-001/control-001/cores/collection1/data
[junit4] 2> 1197822 INFO (coreLoadExecutor-2692-thread-1-processing-n:127.0.0.1:44663_) [n:127.0.0.1:44663_ c:control_collection s:shard1 r:core_node1 x:collection1] o.a.s.c.SolrCore New index directory detected: old=null new=/home/jenkins/workspace/Lucene-Solr-5.x-Linux/solr/build/solr-core/test/J1/../../../../../../../../../home/jenkins/workspace/Lucene-Solr-5.x-Linux/solr/build/solr-core/test/J1/temp/solr.cloud.FullSolrCloudDistribCmdsTest_35A7EAB14F623A99-001/control-001/cores/collection1/data/index/
[junit4] 2> 1197822 WARN (coreLoadExecutor-2692-thread-1-processing-n:127.0.0.1:44663_) [n:127.0.0.1:44663_ c:control_collection s:shard1 r:core_node1 x:collection1] o.a.s.c.SolrCore [collection1] Solr index directory '/home/jenkins/workspace/Lucene-Solr-5.x-Linux/solr/build/solr-core/test/J1/../../../../../../../../../home/jenkins/workspace/Lucene-Solr-5.x-Linux/solr/build/solr-core/test/J1/temp/solr.cloud.FullSolrCloudDistribCmdsTest_35A7EAB14F623A99-001/control-001/cores/collection1/data/index' doesn't exist. Creating new index...
[junit4] 2> 1197822 INFO (coreLoadExecutor-2692-thread-1-processing-n:127.0.0.1:44663_) [n:127.0.0.1:44663_ c:control_collection s:shard1 r:core_node1 x:collection1] o.a.s.c.CachingDirectoryFactory return new directory for /home/jenkins/workspace/Lucene-Solr-5.x-Linux/solr/build/solr-core/test/J1/../../../../../../../../../home/jenkins/workspace/Lucene-Solr-5.x-Linux/solr/build/solr-core/test/J1/temp/solr.cloud.FullSolrCloudDistribCmdsTest_35A7EAB14F623A99-001/control-001/cores/collection1/data/index
[junit4] 2> 1197823 INFO (coreLoadExecutor-2692-thread-1-processing-n:127.0.0.1:44663_) [n:127.0.0.1:44663_ c:control_collection s:shard1 r:core_node1 x:collection1] o.a.s.u.RandomMergePolicy RandomMergePolicy wrapping class org.apache.lucene.index.MockRandomMergePolicy: org.apache.lucene.index.MockRandomMergePolicy@4c4eb8
[junit4] 2> 1197823 INFO (coreLoadExecutor-2692-thread-1-processing-n:127.0.0.1:44663_) [n:127.0.0.1:44663_ c:control_collection s:shard1 r:core_node1 x:collection1] o.a.s.c.SolrCore SolrDeletionPolicy.onCommit: commits: num=1
[junit4] 2> commit{dir=MockDirectoryWrapper(RAMDirectory@1c43616 lockFactory=org.apache.lucene.store.SingleInstanceLockFactory@bafd01),segFN=segments_1,generation=1}
[junit4] 2> 1197823 INFO (coreLoadExecutor-2692-thread-1-processing-n:127.0.0.1:44663_) [n:127.0.0.1:44663_ c:control_collection s:shard1 r:core_node1 x:collection1] o.a.s.c.SolrCore newest commit generation = 1
[junit4] 2> 1197823 INFO (OldIndexDirectoryCleanupThreadForCore-collection1) [n:127.0.0.1:44663_ c:control_collection s:shard1 r:core_node1 x:collection1] o.a.s.c.SolrCore Looking for old index directories to cleanup for core collection1 in /home/jenkins/workspace/Lucene-Solr-5.x-Linux/solr/build/solr-core/test/J1/../../../../../../../../../home/jenkins/workspace/Lucene-Solr-5.x-Linux/solr/build/solr-core/test/J1/temp/solr.cloud.FullSolrCloudDistribCmdsTest_35A7EAB14F623A99-001/control-001/cores/collection1/data/
[junit4] 2> 1197824 WARN (OldIndexDirectoryCleanupThreadForCore-collection1) [n:127.0.0.1:44663_ c:control_collection s:shard1 r:core_node1 x:collection1] o.a.s.c.DirectoryFactory /home/jenkins/workspace/Lucene-Solr-5.x-Linux/solr/build/solr-core/test/J1/../../../../../../../../../home/jenkins/workspace/Lucene-Solr-5.x-Linux/solr/build/solr-core/test/J1/temp/solr.cloud.FullSolrCloudDistribCmdsTest_35A7EAB14F623A99-001/control-001/cores/collection1/data/ does not point to a valid data directory; skipping clean-up of old index directories.
[junit4] 2> 1197826 INFO (coreLoadExecutor-2692-thread-1-processing-n:127.0.0.1:44663_) [n:127.0.0.1:44663_ c:control_collection s:shard1 r:core_node1 x:collection1] o.a.s.u.p.UpdateRequestProcessorChain creating updateRequestProcessorChain "nodistrib"
[junit4] 2> 1197826 INFO (coreLoadExecutor-2692-thread-1-processing-n:127.0.0.1:44663_) [n:127.0.0.1:44663_ c:control_collection s:shard1 r:core_node1 x:collection1] o.a.s.u.p.UpdateRequestProcessorChain creating updateRequestProcessorChain "dedupe"
[junit4] 2> 1197827 INFO (coreLoadExecutor-2692-thread-1-processing-n:127.0.0.1:44663_) [n:127.0.0.1:44663_ c:control_collection s:shard1 r:core_node1 x:collection1] o.a.s.u.p.UpdateRequestProcessorChain inserting DistributedUpdateProcessorFactory into updateRequestProcessorChain "dedupe"
[junit4] 2> 1197827 INFO (coreLoadExecutor-2692-thread-1-processing-n:127.0.0.1:44663_) [n:127.0.0.1:44663_ c:control_collection s:shard1 r:core_node1 x:collection1] o.a.s.u.p.UpdateRequestProcessorChain creating updateRequestProcessorChain "stored_sig"
[junit4] 2> 1197827 INFO (coreLoadExecutor-2692-thread-1-processing-n:127.0.0.1:44663_) [n:127.0.0.1:44663_ c:control_collection s:shard1 r:core_node1 x:collection1] o.a.s.u.p.UpdateRequestProcessorChain inserting DistributedUpdateProcessorFactory into updateRequestProcessorChain "stored_sig"
[junit4] 2> 1197827 INFO (coreLoadExecutor-2692-thread-1-processing-n:127.0.0.1:44663_) [n:127.0.0.1:44663_ c:control_collection s:shard1 r:core_node1 x:collection1] o.a.s.u.p.UpdateRequestProcessorChain creating updateRequestProcessorChain "distrib-dup-test-chain-explicit"
[junit4] 2> 1197827 INFO (coreLoadExecutor-2692-thread-1-processing-n:127.0.0.1:44663_) [n:127.0.0.1:44663_ c:control_collection s:shard1 r:core_node1 x:collection1] o.a.s.u.p.UpdateRequestProcessorChain creating updateRequestProcessorChain "distrib-dup-test-chain-implicit"
[junit4] 2> 1197827 INFO (coreLoadExecutor-2692-thread-1-processing-n:127.0.0.1:44663_) [n:127.0.0.1:44663_ c:control_collection s:shard1 r:core_node1 x:collection1] o.a.s.u.p.UpdateRequestProcessorChain inserting DistributedUpdateProcessorFactory into updateRequestProcessorChain "distrib-dup-test-chain-implicit"
[junit4] 2> 1197827 INFO (coreLoadExecutor-2692-thread-1-processing-n:127.0.0.1:44663_) [n:127.0.0.1:44663_ c:control_collection s:shard1 r:core_node1 x:collection1] o.a.s.c.SolrCore no updateRequestProcessorChain defined as default, creating implicit default
[junit4] 2> 1197829 INFO (coreLoadExecutor-2692-thread-1-processing-n:127.0.0.1:44663_) [n:127.0.0.1:44663_ c:control_collection s:shard1 r:core_node1 x:collection1] o.a.s.h.l.XMLLoader xsltCacheLifetimeSeconds=60
[junit4] 2> 1197830 INFO (coreLoadExecutor-2692-thread-1-processing-n:127.0.0.1:44663_) [n:127.0.0.1:44663_ c:control_collection s:shard1 r:core_node1 x:collection1] o.a.s.h.l.XMLLoader xsltCacheLifetimeSeconds=60
[junit4] 2> 1197831 INFO (coreLoadExecutor-2692-thread-1-processing-n:127.0.0.1:44663_) [n:127.0.0.1:44663_ c:control_collection s:shard1 r:core_node1 x:collection1] o.a.s.h.l.XMLLoader xsltCacheLifetimeSeconds=60
[junit4] 2> 1197832 INFO (coreLoadExecutor-2692-thread-1-processing-n:127.0.0.1:44663_) [n:127.0.0.1:44663_ c:control_collection s:shard1 r:core_node1 x:collection1] o.a.s.h.l.XMLLoader xsltCacheLifetimeSeconds=60
[junit4] 2> 1197835 INFO (coreLoadExecutor-2692-thread-1-processing-n:127.0.0.1:44663_) [n:127.0.0.1:44663_ c:control_collection s:shard1 r:core_node1 x:collection1] o.a.s.c.RequestHandlers Registered paths: /admin/threads,/get,/update,/admin/file,/update/csv,/admin/ping,standard,/config,/update/json/docs,/admin/logging,/update/json,/admin/plugins,/admin/luke,/schema,/admin/segments,/admin/system,/admin/mbeans,/replication,/admin/properties
[junit4] 2> 1197836 INFO (coreLoadExecutor-2692-thread-1-processing-n:127.0.0.1:44663_) [n:127.0.0.1:44663_ c:control_collection s:shard1 r:core_node1 x:collection1] o.a.s.c.SolrCore Using default statsCache cache: org.apache.solr.search.stats.LocalStatsCache
[junit4] 2> 1197837 INFO (coreLoadExecutor-2692-thread-1-processing-n:127.0.0.1:44663_) [n:127.0.0.1:44663_ c:control_collection s:shard1 r:core_node1 x:collection1] o.a.s.u.UpdateHandler Using UpdateLog implementation: org.apache.solr.update.UpdateLog
[junit4] 2> 1197837 INFO (coreLoadExecutor-2692-thread-1-processing-n:127.0.0.1:44663_) [n:127.0.0.1:44663_ c:control_collection s:shard1 r:core_node1 x:collection1] o.a.s.u.UpdateLog Initializing UpdateLog: dataDir= defaultSyncLevel=FLUSH numRecordsToKeep=100 maxNumLogsToKeep=10 numVersionBuckets=65536
[junit4] 2> 1197838 INFO (coreLoadExecutor-2692-thread-1-processing-n:127.0.0.1:44663_) [n:127.0.0.1:44663_ c:control_collection s:shard1 r:core_node1 x:collection1] o.a.s.c.SolrCore Hard AutoCommit: disabled
[junit4] 2> 1197838 INFO (coreLoadExecutor-2692-thread-1-processing-n:127.0.0.1:44663_) [n:127.0.0.1:44663_ c:control_collection s:shard1 r:core_node1 x:collection1] o.a.s.c.SolrCore Soft AutoCommit: disabled
[junit4] 2> 1197838 INFO (coreLoadExecutor-2692-thread-1-processing-n:127.0.0.1:44663_) [n:127.0.0.1:44663_ c:control_collection s:shard1 r:core_node1 x:collection1] o.a.s.u.RandomMergePolicy RandomMergePolicy wrapping class org.apache.lucene.index.LogByteSizeMergePolicy: [LogByteSizeMergePolicy: minMergeSize=1677721, mergeFactor=17, maxMergeSize=2147483648, maxMergeSizeForForcedMerge=9223372036854775807, calibrateSizeByDeletes=true, maxMergeDocs=2147483647, maxCFSSegmentSizeMB=8.796093022207999E12, noCFSRatio=0.529550860781044]
[junit4] 2> 1197838 INFO (coreLoadExecutor-2692-thread-1-processing-n:127.0.0.1:44663_) [n:127.0.0.1:44663_ c:control_collection s:shard1 r:core_node1 x:collection1] o.a.s.c.SolrCore SolrDeletionPolicy.onInit: commits: num=1
[junit4] 2> commit{dir=MockDirectoryWrapper(RAMDirectory@1c43616 lockFactory=org.apache.lucene.store.SingleInstanceLockFactory@bafd01),segFN=segments_1,generation=1}
[junit4] 2> 1197838 INFO (coreLoadExecutor-2692-thread-1-processing-n:127.0.0.1:44663_) [n:127.0.0.1:44663_ c:control_collection s:shard1 r:core_node1 x:collection1] o.a.s.c.SolrCore newest commit generation = 1
[junit4] 2> 1197839 INFO (coreLoadExecutor-2692-thread-1-processing-n:127.0.0.1:44663_) [n:127.0.0.1:44663_ c:control_collection s:shard1 r:core_node1 x:collection1] o.a.s.s.SolrIndexSearcher Opening Searcher@15181af[collection1] main
[junit4] 2> 1197839 INFO (coreLoadExecutor-2692-thread-1-processing-n:127.0.0.1:44663_) [n:127.0.0.1:44663_ c:control_collection s:shard1 r:core_node1 x:collection1] o.a.s.c.c.ZkStateReader Load collection config from:/collections/control_collection
[junit4] 2> 1197839 INFO (coreLoadExecutor-2692-thread-1-processing-n:127.0.0.1:44663_) [n:127.0.0.1:44663_ c:control_collection s:shard1 r:core_node1 x:collection1] o.a.s.c.c.ZkStateReader path=/collections/control_collection configName=conf1 specified config exists in ZooKeeper
[junit4] 2> 1197839 INFO (coreLoadExecutor-2692-thread-1-processing-n:127.0.0.1:44663_) [n:127.0.0.1:44663_ c:control_collection s:shard1 r:core_node1 x:collection1] o.a.s.r.ManagedResourceStorage Setting up ZooKeeper-based storage for the RestManager with znodeBase: /configs/conf1
[junit4] 2> 1197840 INFO (coreLoadExecutor-2692-thread-1-processing-n:127.0.0.1:44663_) [n:127.0.0.1:44663_ c:control_collection s:shard1 r:core_node1 x:collection1] o.a.s.r.ManagedResourceStorage Configured ZooKeeperStorageIO with znodeBase: /configs/conf1
[junit4] 2> 1197840 INFO (coreLoadExecutor-2692-thread-1-processing-n:127.0.0.1:44663_) [n:127.0.0.1:44663_ c:control_collection s:shard1 r:core_node1 x:collection1] o.a.s.r.RestManager Initializing RestManager with initArgs: {}
[junit4] 2> 1197840 INFO (coreLoadExecutor-2692-thread-1-processing-n:127.0.0.1:44663_) [n:127.0.0.1:44663_ c:control_collection s:shard1 r:core_node1 x:collection1] o.a.s.r.ManagedResourceStorage Reading _rest_managed.json using ZooKeeperStorageIO:path=/configs/conf1
[junit4] 2> 1197840 INFO (coreLoadExecutor-2692-thread-1-processing-n:127.0.0.1:44663_) [n:127.0.0.1:44663_ c:control_collection s:shard1 r:core_node1 x:collection1] o.a.s.r.ManagedResourceStorage No data found for znode /configs/conf1/_rest_managed.json
[junit4] 2> 1197840 INFO (coreLoadExecutor-2692-thread-1-processing-n:127.0.0.1:44663_) [n:127.0.0.1:44663_ c:control_collection s:shard1 r:core_node1 x:collection1] o.a.s.r.ManagedResourceStorage Loaded null at path _rest_managed.json using ZooKeeperStorageIO:path=/configs/conf1
[junit4] 2> 1197840 INFO (coreLoadExecutor-2692-thread-1-processing-n:127.0.0.1:44663_) [n:127.0.0.1:44663_ c:control_collection s:shard1 r:core_node1 x:collection1] o.a.s.r.RestManager Initializing 0 registered ManagedResources
[junit4] 2> 1197840 INFO (coreLoadExecutor-2692-thread-1-processing-n:127.0.0.1:44663_) [n:127.0.0.1:44663_ c:control_collection s:shard1 r:core_node1 x:collection1] o.a.s.h.ReplicationHandler Commits will be reserved for 10000
[junit4] 2> 1197841 INFO (searcherExecutor-2693-thread-1-processing-c:control_collection r:core_node1 n:127.0.0.1:44663_ s:shard1 x:collection1) [n:127.0.0.1:44663_ c:control_collection s:shard1 r:core_node1 x:collection1] o.a.s.c.SolrCore [collection1] Registered new searcher Searcher@15181af[collection1] main{ExitableDirectoryReader(UninvertingDirectoryReader())}
[junit4] 2> 1197841 INFO (coreLoadExecutor-2692-thread-1-processing-n:127.0.0.1:44663_) [n:127.0.0.1:44663_ c:control_collection s:shard1 r:core_node1 x:collection1] o.a.s.u.UpdateLog Looking up max value of version field to seed version buckets
[junit4] 2> 1197841 INFO (coreLoadExecutor-2692-thread-1-processing-n:127.0.0.1:44663_) [n:127.0.0.1:44663_ c:control_collection s:shard1 r:core_node1 x:collection1] o.a.s.u.VersionInfo Refreshing highest value of _version_ for 65536 version buckets from index
[junit4] 2> 1197841 INFO (coreLoadExecutor-2692-thread-1-processing-n:127.0.0.1:44663_) [n:127.0.0.1:44663_ c:control_collection s:shard1 r:core_node1 x:collection1] o.a.s.u.VersionInfo No terms found for _version_, cannot seed version bucket highest value from index
[junit4] 2> 1197841 INFO (coreLoadExecutor-2692-thread-1-processing-n:127.0.0.1:44663_) [n:127.0.0.1:44663_ c:control_collection s:shard1 r:core_node1 x:collection1] o.a.s.u.UpdateLog Could not find max version in index or recent updates, using new clock 1503687871375081472
[junit4] 2> 1197843 INFO (coreLoadExecutor-2692-thread-1-processing-n:127.0.0.1:44663_) [n:127.0.0.1:44663_ c:control_collection s:shard1 r:core_node1 x:collection1] o.a.s.u.UpdateLog Took 2 ms to seed version buckets with highest version 1503687871375081472
[junit4] 2> 1197843 INFO (coreLoadExecutor-2692-thread-1-processing-n:127.0.0.1:44663_) [n:127.0.0.1:44663_ c:control_collection s:shard1 r:core_node1 x:collection1] o.a.s.c.ZkController watch zkdir /configs/conf1
[junit4] 2> 1197843 INFO (coreLoadExecutor-2692-thread-1-processing-n:127.0.0.1:44663_) [n:127.0.0.1:44663_ c:control_collection s:shard1 r:core_node1 x:collection1] o.a.s.c.CoreContainer registering core: collection1
[junit4] 2> 1197844 INFO (coreZkRegister-2686-thread-1-processing-c:control_collection r:core_node1 n:127.0.0.1:44663_ s:shard1 x:collection1) [n:127.0.0.1:44663_ c:control_collection s:shard1 r:core_node1 x:collection1] o.a.s.c.ZkController Register replica - core:collection1 address:http://127.0.0.1:44663 collection:control_collection shard:shard1
[junit4] 2> 1197844 INFO (coreZkRegister-2686-thread-1-processing-c:control_collection r:core_node1 n:127.0.0.1:44663_ s:shard1 x:collection1) [n:127.0.0.1:44663_ c:control_collection s:shard1 r:core_node1 x:collection1] o.a.s.c.c.SolrZkClient makePath: /collections/control_collection/leader_elect/shard1/election
[junit4] 2> 1197846 INFO (coreZkRegister-2686-thread-1-processing-c:control_collection r:core_node1 n:127.0.0.1:44663_ s:shard1 x:collection1) [n:127.0.0.1:44663_ c:control_collection s:shard1 r:core_node1 x:collection1] o.a.s.c.ShardLeaderElectionContext Running the leader process for shard shard1
[junit4] 2> 1197847 INFO (zkCallback-1660-thread-1-processing-n:127.0.0.1:44663_) [n:127.0.0.1:44663_ ] o.a.s.c.DistributedQueue NodeChildrenChanged fired on path /overseer/queue state SyncConnected
[junit4] 2> 1197847 INFO (coreZkRegister-2686-thread-1-processing-c:control_collection r:core_node1 n:127.0.0.1:44663_ s:shard1 x:collection1) [n:127.0.0.1:44663_ c:control_collection s:shard1 r:core_node1 x:collection1] o.a.s.c.ShardLeaderElectionContext Enough replicas found to continue.
[junit4] 2> 1197847 INFO (coreZkRegister-2686-thread-1-processing-c:control_collection r:core_node1 n:127.0.0.1:44663_ s:shard1 x:collection1) [n:127.0.0.1:44663_ c:control_collection s:shard1 r:core_node1 x:collection1] o.a.s.c.ShardLeaderElectionContext I may be the new leader - try and sync
[junit4] 2> 1197847 INFO (OverseerStateUpdate-93980491864997891-127.0.0.1:44663_-n_0000000000) [n:127.0.0.1:44663_ ] o.a.s.c.Overseer processMessage: queueSize: 1, message = {
[junit4] 2> "operation":"leader",
[junit4] 2> "shard":"shard1",
[junit4] 2> "collection":"control_collection"} current state version: 1
[junit4] 2> 1197847 INFO (coreZkRegister-2686-thread-1-processing-c:control_collection r:core_node1 n:127.0.0.1:44663_ s:shard1 x:collection1) [n:127.0.0.1:44663_ c:control_collection s:shard1 r:core_node1 x:collection1] o.a.s.c.SyncStrategy Sync replicas to http://127.0.0.1:44663/collection1/
[junit4] 2> 1197847 INFO (coreZkRegister-2686-thread-1-processing-c:control_collection r:core_node1 n:127.0.0.1:44663_ s:shard1 x:collection1) [n:127.0.0.1:44663_ c:control_collection s:shard1 r:core_node1 x:collection1] o.a.s.c.SyncStrategy Sync Success - now sync replicas to me
[junit4] 2> 1197848 INFO (coreZkRegister-2686-thread-1-processing-c:control_collection r:core_node1 n:127.0.0.1:44663_ s:shard1 x:collection1) [n:127.0.0.1:44663_ c:control_collection s:shard1 r:core_node1 x:collection1] o.a.s.c.SyncStrategy http://127.0.0.1:44663/collection1/ has no replicas
[junit4] 2> 1197848 INFO (coreZkRegister-2686-thread-1-processing-c:control_collection r:core_node1 n:127.0.0.1:44663_ s:shard1 x:collection1) [n:127.0.0.1:44663_ c:control_collection s:shard1 r:core_node1 x:collection1] o.a.s.c.ShardLeaderElectionContext I am the new leader: http://127.0.0.1:44663/collection1/ shard1
[junit4] 2> 1197848 INFO (coreZkRegister-2686-thread-1-processing-c:control_collection r:core_node1 n:127.0.0.1:44663_ s:shard1 x:collection1) [n:127.0.0.1:44663_ c:control_collection s:shard1 r:core_node1 x:collection1] o.a.s.c.c.SolrZkClient makePath: /collections/control_collection/leaders/shard1
[junit4] 2> 1197849 INFO (zkCallback-1660-thread-1-processing-n:127.0.0.1:44663_) [n:127.0.0.1:44663_ ] o.a.s.c.DistributedQueue NodeChildrenChanged fired on path /overseer/queue state SyncConnected
[junit4] 2> 1197850 INFO (OverseerStateUpdate-93980491864997891-127.0.0.1:44663_-n_0000000000) [n:127.0.0.1:44663_ ] o.a.s.c.Overseer processMessage: queueSize: 1, message = {
[junit4] 2> "operation":"leader",
[junit4] 2> "shard":"shard1",
[junit4] 2> "collection":"control_collection",
[junit4] 2> "base_url":"http://127.0.0.1:44663",
[junit4] 2> "core":"collection1",
[junit4] 2> "state":"active"} current state version: 1
[junit4] 2> 1197951 INFO (zkCallback-1660-thread-1-processing-n:127.0.0.1:44663_) [n:127.0.0.1:44663_ ] o.a.s.c.c.ZkStateReader A cluster state change: WatchedEvent state:SyncConnected type:NodeDataChanged path:/clusterstate.json, has occurred - updating... (live nodes size: 1)
[junit4] 2> 1197952 INFO (zkCallback-1660-thread-1-processing-n:127.0.0.1:44663_) [n:127.0.0.1:44663_ ] o.a.s.c.c.ZkStateReader Updated cluster state version to 2
[junit4] 2> 1198000 INFO (coreZkRegister-2686-thread-1-processing-c:control_collection r:core_node1 n:127.0.0.1:44663_ s:shard1 x:collection1) [n:127.0.0.1:44663_ c:control_collection s:shard1 r:core_node1 x:collection1] o.a.s.c.ZkController We are http://127.0.0.1:44663/collection1/ and leader is http://127.0.0.1:44663/collection1/
[junit4] 2> 1198000 INFO (coreZkRegister-2686-thread-1-processing-c:control_collection r:core_node1 n:127.0.0.1:44663_ s:shard1 x:collection1) [n:127.0.0.1:44663_ c:control_collection s:shard1 r:core_node1 x:collection1] o.a.s.c.ZkController No LogReplay needed for core=collection1 baseURL=http://127.0.0.1:44663
[junit4] 2> 1198000 INFO (coreZkRegister-2686-thread-1-processing-c:control_collection r:core_node1 n:127.0.0.1:44663_ s:shard1 x:collection1) [n:127.0.0.1:44663_ c:control_collection s:shard1 r:core_node1 x:collection1] o.a.s.c.ZkController I am the leader, no recovery necessary
[junit4] 2> 1198000 INFO (coreZkRegister-2686-thread-1-processing-c:control_collection r:core_node1 n:127.0.0.1:44663_ s:shard1 x:collection1) [n:127.0.0.1:44663_ c:control_collection s:shard1 r:core_node1 x:collection1] o.a.s.c.ZkController publishing state=active
[junit4] 2> 1198000 INFO (coreZkRegister-2686-thread-1-processing-c:control_collection r:core_node1 n:127.0.0.1:44663_ s:shard1 x:collection1) [n:127.0.0.1:44663_ c:control_collection s:shard1 r:core_node1 x:collection1] o.a.s.c.ZkController numShards not found on descriptor - reading it from system property
[junit4] 2> 1198001 INFO (zkCallback-1660-thread-1-processing-n:127.0.0.1:44663_) [n:127.0.0.1:44663_ ] o.a.s.c.DistributedQueue NodeChildrenChanged fired on path /overseer/queue state SyncConnected
[junit4] 2> 1198002 INFO (OverseerStateUpdate-93980491864997891-127.0.0.1:44663_-n_0000000000) [n:127.0.0.1:44663_ ] o.a.s.c.Overseer processMessage: queueSize: 1, message = {
[junit4] 2> "collection":"control_collection",
[junit4] 2> "state":"active",
[junit4] 2> "roles":null,
[junit4] 2> "node_name":"127.0.0.1:44663_",
[junit4] 2> "numShards":"1",
[junit4] 2> "operation":"state",
[junit4] 2> "base_url":"http://127.0.0.1:44663",
[junit4] 2> "shard":"shard1",
[junit4] 2> "core":"collection1",
[junit4] 2> "core_node_name":"core_node1"} current state version: 2
[junit4] 2> 1198002 INFO (OverseerStateUpdate-93980491864997891-127.0.0.1:44663_-n_0000000000) [n:127.0.0.1:44663_ ] o.a.s.c.o.ReplicaMutator Update state numShards=1 message={
[junit4] 2> "collection":"control_collection",
[junit4] 2> "state":"active",
[junit4] 2> "roles":null,
[junit4] 2> "node_name":"127.0.0.1:44663_",
[junit4] 2> "numShards":"1",
[junit4] 2> "operation":"state",
[junit4] 2> "base_url":"http://127.0.0.1:44663",
[junit4] 2> "shard":"shard1",
[junit4] 2> "core":"collection1",
[junit4] 2> "core_node_name":"core_node1"}
[junit4] 2> 1198098 INFO (TEST-FullSolrCloudDistribCmdsTest.test-seed#[35A7EAB14F623A99]) [ ] o.a.s.c.c.SolrZkClient Using default ZkCredentialsProvider
[junit4] 2> 1198099 INFO (TEST-FullSolrCloudDistribCmdsTest.test-seed#[35A7EAB14F623A99]) [ ] o.a.s.c.c.ConnectionManager Waiting for client to connect to ZooKeeper
[junit4] 2> 1198100 INFO (zkCallback-1662-thread-1) [ ] o.a.s.c.c.ConnectionManager Watcher org.apache.solr.common.cloud.ConnectionManager@1a7e611 name:ZooKeeperConnection Watcher:127.0.0.1:59819/solr got event WatchedEvent state:SyncConnected type:None path:null path:null type:None
[junit4] 2> 1198100 INFO (TEST-FullSolrCloudDistribCmdsTest.test-seed#[35A7EAB14F623A99]) [ ] o.a.s.c.c.ConnectionManager Client is connected to ZooKeeper
[junit4] 2> 1198100 INFO (TEST-FullSolrCloudDistribCmdsTest.test-seed#[35A7EAB14F623A99]) [ ] o.a.s.c.c.SolrZkClient Using default ZkACLProvider
[junit4] 2> 1198100 INFO (TEST-FullSolrCloudDistribCmdsTest.test-seed#[35A7EAB14F623A99]) [ ] o.a.s.c.c.ZkStateReader Updating cluster state from ZooKeeper...
[junit4] 2> 1198102 INFO (TEST-FullSolrCloudDistribCmdsTest.test-seed#[35A7EAB14F623A99]) [ ] o.a.s.c.ChaosMonkey monkey: init - expire sessions:false cause connection loss:false
[junit4] 2> 1198103 INFO (zkCallback-1662-thread-1) [ ] o.a.s.c.c.ZkStateReader A cluster state change: WatchedEvent state:SyncConnected type:NodeDataChanged path:/clusterstate.json, has occurred - updating... (live nodes size: 1)
[junit4] 2> 1198104 INFO (zkCallback-1660-thread-1-processing-n:127.0.0.1:44663_) [n:127.0.0.1:44663_ ] o.a.s.c.c.ZkStateReader A cluster state change: WatchedEvent state:SyncConnected type:NodeDataChanged path:/clusterstate.json, has occurred - updating... (live nodes size: 1)
[junit4] 2> 1198105 INFO (zkCallback-1662-thread-1) [ ] o.a.s.c.c.ZkStateReader Updated cluster state version to 3
[junit4] 2> 1198105 INFO (zkCallback-1660-thread-1-processing-n:127.0.0.1:44663_) [n:127.0.0.1:44663_ ] o.a.s.c.c.ZkStateReader Updated cluster state version to 3
[junit4] 2> 1198166 INFO (TEST-FullSolrCloudDistribCmdsTest.test-seed#[35A7EAB14F623A99]) [ ] o.a.s.SolrTestCaseJ4 Writing core.properties file to /home/jenkins/workspace/Lucene-Solr-5.x-Linux/solr/build/solr-core/test/J1/temp/solr.cloud.FullSolrCloudDistribCmdsTest_35A7EAB14F623A99-001/shard-1-001/cores/collection1
[junit4] 2> 1198167 INFO (TEST-FullSolrCloudDistribCmdsTest.test-seed#[35A7EAB14F623A99]) [ ] o.a.s.c.AbstractFullDistribZkTestBase create jetty 1 in directory /home/jenkins/workspace/Lucene-Solr-5.x-Linux/solr/build/solr-core/test/J1/temp/solr.cloud.FullSolrCloudDistribCmdsTest_35A7EAB14F623A99-001/shard-1-001
[junit4] 2> 1198167 INFO (TEST-FullSolrCloudDistribCmdsTest.test-seed#[35A7EAB14F623A99]) [ ] o.e.j.s.Server jetty-9.2.11.v20150529
[junit4] 2> 1198168 INFO (TEST-FullSolrCloudDistribCmdsTest.test-seed#[35A7EAB14F623A99]) [ ] o.e.j.s.h.ContextHandler Started o.e.j.s.ServletContextHandler@1dc9397{/,null,AVAILABLE}
[junit4] 2> 1198169 INFO (TEST-FullSolrCloudDistribCmdsTest.test-seed#[35A7EAB14F623A99]) [ ] o.e.j.s.ServerConnector Started ServerConnector@122b941{HTTP/1.1}{127.0.0.1:40502}
[junit4] 2> 1198169 INFO (TEST-FullSolrCloudDistribCmdsTest.test-seed#[35A7EAB14F623A99]) [ ] o.e.j.s.Server Started @1199550ms
[junit4] 2> 1198169 INFO (TEST-FullSolrCloudDistribCmdsTest.test-seed#[35A7EAB14F623A99]) [ ] o.a.s.c.s.e.JettySolrRunner Jetty properties: {coreRootDirectory=/home/jenkins/workspace/Lucene-Solr-5.x-Linux/solr/build/solr-core/test/J1/temp/solr.cloud.FullSolrCloudDistribCmdsTest_35A7EAB14F623A99-001/shard-1-001/cores, solr.data.dir=/home/jenkins/workspace/Lucene-Solr-5.x-Linux/solr/build/solr-core/test/J1/temp/solr.cloud.FullSolrCloudDistribCmdsTest_35A7EAB14F623A99-001/tempDir-001/jetty1, hostContext=/, solrconfig=solrconfig.xml, hostPort=40502}
[junit4] 2> 1198169 INFO (TEST-FullSolrCloudDistribCmdsTest.test-seed#[35A7EAB14F623A99]) [ ] o.a.s.s.SolrDispatchFilter SolrDispatchFilter.init()sun.misc.Launcher$AppClassLoader@893918
[junit4] 2> 1198169 INFO (TEST-FullSolrCloudDistribCmdsTest.test-seed#[35A7EAB14F623A99]) [ ] o.a.s.c.SolrResourceLoader new SolrResourceLoader for directory: '/home/jenkins/workspace/Lucene-Solr-5.x-Linux/solr/build/solr-core/test/J1/temp/solr.cloud.FullSolrCloudDistribCmdsTest_35A7EAB14F623A99-001/shard-1-001/'
[junit4] 2> 1198182 INFO (TEST-FullSolrCloudDistribCmdsTest.test-seed#[35A7EAB14F623A99]) [ ] o.a.s.c.SolrXmlConfig Loading container configuration from /home/jenkins/workspace/Lucene-Solr-5.x-Linux/solr/build/solr-core/test/J1/temp/solr.cloud.FullSolrCloudDistribCmdsTest_35A7EAB14F623A99-001/shard-1-001/solr.xml
[junit4] 2> 1198204 INFO (TEST-FullSolrCloudDistribCmdsTest.test-seed#[35A7EAB14F623A99]) [ ] o.a.s.c.CoresLocator Config-defined core root directory: /home/jenkins/workspace/Lucene-Solr-5.x-Linux/solr/build/solr-core/test/J1/temp/solr.cloud.FullSolrCloudDistribCmdsTest_35A7EAB14F623A99-001/shard-1-001/cores
[junit4] 2> 1198204 INFO (TEST-FullSolrCloudDistribCmdsTest.test-seed#[35A7EAB14F623A99]) [ ] o.a.s.c.CoreContainer New CoreContainer 4394531
[junit4] 2> 1198204 INFO (TEST-FullSolrCloudDistribCmdsTest.test-seed#[35A7EAB14F623A99]) [ ] o.a.s.c.CoreContainer Loading cores into CoreContainer [instanceDir=/home/jenkins/workspace/Lucene-Solr-5.x-Linux/solr/build/solr-core/test/J1/temp/solr.cloud.FullSolrCloudDistribCmdsTest_35A7EAB14F623A99-001/shard-1-001/]
[junit4] 2> 1198204 INFO (TEST-FullSolrCloudDistribCmdsTest.test-seed#[35A7EAB14F623A99]) [ ] o.a.s.c.CoreContainer loading shared library: /home/jenkins/workspace/Lucene-Solr-5.x-Linux/solr/build/solr-core/test/J1/temp/solr.cloud.FullSolrCloudDistribCmdsTest_35A7EAB14F623A99-001/shard-1-001/lib
[junit4] 2> 1198204 WARN (TEST-FullSolrCloudDistribCmdsTest.test-seed#[35A7EAB14F623A99]) [ ] o.a.s.c.SolrResourceLoader Can't find (or read) directory to add to classloader: lib (resolved as: /home/jenkins/workspace/Lucene-Solr-5.x-Linux/solr/build/solr-core/test/J1/temp/solr.cloud.FullSolrCloudDistribCmdsTest_35A7EAB14F623A99-001/shard-1-001/lib).
[junit4] 2> 1198210 INFO (TEST-FullSolrCloudDistribCmdsTest.test-seed#[35A7EAB14F623A99]) [ ] o.a.s.h.c.HttpShardHandlerFactory created with socketTimeout : 90000,urlScheme : ,connTimeout : 15000,maxConnectionsPerHost : 20,maxConnections : 10000,corePoolSize : 0,maximumPoolSize : 2147483647,maxThreadIdleTime : 5,sizeOfQueue : -1,fairnessPolicy : false,useRetries : false,
[junit4] 2> 1198211 INFO (TEST-FullSolrCloudDistribCmdsTest.test-seed#[35A7EAB14F623A99]) [ ] o.a.s.u.UpdateShardHandler Creating UpdateShardHandler HTTP client with params: socketTimeout=340000&connTimeout=45000&retry=true
[junit4] 2> 1198211 INFO (TEST-FullSolrCloudDistribCmdsTest.test-seed#[35A7EAB14F623A99]) [ ] o.a.s.l.LogWatcher SLF4J impl is org.slf4j.impl.Log4jLoggerFactory
[junit4] 2> 1198212 INFO (TEST-FullSolrCloudDistribCmdsTest.test-seed#[35A7EAB14F623A99]) [ ] o.a.s.l.LogWatcher Registering Log Listener [Log4j (org.slf4j.impl.Log4jLoggerFactory)]
[junit4] 2> 1198212 INFO (TEST-FullSolrCloudDistribCmdsTest.test-seed#[35A7EAB14F623A99]) [ ] o.a.s.c.ZkContainer Zookeeper client=127.0.0.1:59819/solr
[junit4] 2> 1198212 INFO (TEST-FullSolrCloudDistribCmdsTest.test-seed#[35A7EAB14F623A99]) [ ] o.a.s.c.ZkController zkHost includes chroot
[junit4] 2> 1198212 INFO (TEST-FullSolrCloudDistribCmdsTest.test-seed#[35A7EAB14F623A99]) [ ] o.a.s.c.c.SolrZkClient Using default ZkCredentialsProvider
[junit4] 2> 1198212 INFO (TEST-FullSolrCloudDistribCmdsTest.test-seed#[35A7EAB14F623A99]) [ ] o.a.s.c.c.ConnectionManager Waiting for client to connect to ZooKeeper
[junit4] 2> 1198213 INFO (zkCallback-1664-thread-1) [ ] o.a.s.c.c.ConnectionManager Watcher org.apache.solr.common.cloud.ConnectionManager@35c1ba name:ZooKeeperConnection Watcher:127.0.0.1:59819 got event WatchedEvent state:SyncConnected type:None path:null path:null type:None
[junit4] 2> 1198213 INFO (TEST-FullSolrCloudDistribCmdsTest.test-seed#[35A7EAB14F623A99]) [ ] o.a.s.c.c.ConnectionManager Client is connected to ZooKeeper
[junit4] 2> 1198214 INFO (TEST-FullSolrCloudDistribCmdsTest.test-seed#[35A7EAB14F623A99]) [ ] o.a.s.c.c.SolrZkClient Using default ZkACLProvider
[junit4] 2> 1198214 INFO (TEST-FullSolrCloudDistribCmdsTest.test-seed#[35A7EAB14F623A99]) [n:127.0.0.1:40502_ ] o.a.s.c.c.ConnectionManager Waiting for client to connect to ZooKeeper
[junit4] 2> 1198215 INFO (zkCallback-1665-thread-1-processing-n:127.0.0.1:40502_) [n:127.0.0.1:40502_ ] o.a.s.c.c.ConnectionManager Watcher org.apache.solr.common.cloud.ConnectionManager@1bc6af9 name:ZooKeeperConnection Watcher:127.0.0.1:59819/solr got event WatchedEvent state:SyncConnected type:None path:null path:null type:None
[junit4] 2> 1198215 INFO (TEST-FullSolrCloudDistribCmdsTest.test-seed#[35A7EAB14F623A99]) [n:127.0.0.1:40502_ ] o.a.s.c.c.ConnectionManager Client is connected to ZooKeeper
[junit4] 2> 1198217 INFO (TEST-FullSolrCloudDistribCmdsTest.test-seed#[35A7EAB14F623A99]) [n:127.0.0.1:40502_ ] o.a.s.c.c.ZkStateReader Updating cluster state from ZooKeeper...
[junit4] 2> 1199219 INFO (TEST-FullSolrCloudDistribCmdsTest.test-seed#[35A7EAB14F623A99]) [n:127.0.0.1:40502_ ] o.a.s.c.ZkController Register node as live in ZooKeeper:/live_nodes/127.0.0.1:40502_
[junit4] 2> 1199220 INFO (TEST-FullSolrCloudDistribCmdsTest.test-seed#[35A7EAB14F623A99]) [n:127.0.0.1:40502_ ] o.a.s.c.c.SolrZkClient makePath: /live_nodes/127.0.0.1:40502_
[junit4] 2> 1199222 INFO (TEST-FullSolrCloudDistribCmdsTest.test-seed#[35A7EAB14F623A99]) [n:127.0.0.1:40502_ ] o.a.s.c.Overseer Overseer (id=null) closing
[junit4] 2> 1199222 INFO (TEST-FullSolrCloudDistribCmdsTest.test-seed#[35A7EAB14F623A99]) [n:127.0.0.1:40502_ ] o.a.s.c.CoreContainer No authentication plugin used.
[junit4] 2> 1199223 INFO (TEST-FullSolrCloudDistribCmdsTest.test-seed#[35A7EAB14F623A99]) [n:127.0.0.1:40502_ ] o.a.s.c.CoreContainer Security conf doesn't exist. Skipping setup for authorization module.
[junit4] 2> 1199223 INFO (TEST-FullSolrCloudDistribCmdsTest.test-seed#[35A7EAB14F623A99]) [n:127.0.0.1:40502_ ] o.a.s.c.CoresLocator Looking for core definitions underneath /home/jenkins/workspace/Lucene-Solr-5.x-Linux/solr/build/solr-core/test/J1/temp/solr.cloud.FullSolrCloudDistribCmdsTest_35A7EAB14F623A99-001/shard-1-001/cores
[junit4] 2> 1199224 INFO (TEST-FullSolrCloudDistribCmdsTest.test-seed#[35A7EAB14F623A99]) [n:127.0.0.1:40502_ ] o.a.s.c.SolrCore Created CoreDescriptor: {coreNodeName=, schema=schema.xml, transient=false, shard=, config=solrconfig.xml, dataDir=data/, instanceDir=/home/jenkins/workspace/Lucene-Solr-5.x-Linux/solr/build/solr-core/test/J1/temp/solr.cloud.FullSolrCloudDistribCmdsTest_35A7EAB14F623A99-001/shard-1-001/cores/collection1, name=collection1, collection=collection1, loadOnStartup=true, absoluteInstDir=/home/jenkins/workspace/Lucene-Solr-5.x-Linux/solr/build/solr-core/test/J1/temp/solr.cloud.FullSolrCloudDistribCmdsTest_35A7EAB14F623A99-001/shard-1-001/cores/collection1/}
[junit4] 2> 1199224 INFO (TEST-FullSolrCloudDistribCmdsTest.test-seed#[35A7EAB14F623A99]) [n:127.0.0.1:40502_ ] o.a.s.c.CoresLocator Found core collection1 in /home/jenkins/workspace/Lucene-Solr-5.x-Linux/solr/build/solr-core/test/J1/temp/solr.cloud.FullSolrCloudDistribCmdsTest_35A7EAB14F623A99-001/shard-1-001/cores/collection1/
[junit4] 2> 1199224 INFO (TEST-FullSolrCloudDistribCmdsTest.test-seed#[35A7EAB14F623A99]) [n:127.0.0.1:40502_ ] o.a.s.c.CoresLocator Found 1 core definitions
[junit4] 2> 1199225 INFO (coreLoadExecutor-2703-thread-1-processing-n:127.0.0.1:40502_) [n:127.0.0.1:40502_ c:collection1 x:collection1] o.a.s.c.ZkController publishing state=down
[junit4] 2> 1199225 INFO (TEST-FullSolrCloudDistribCmdsTest.test-seed#[35A7EAB14F623A99]) [n:127.0.0.1:40502_ ] o.a.s.s.SolrDispatchFilter user.dir=/home/jenkins/workspace/Lucene-Solr-5.x-Linux/solr/build/solr-core/test/J1
[junit4] 2> 1199225 INFO (TEST-FullSolrCloudDistribCmdsTest.test-seed#[35A7EAB14F623A99]) [n:127.0.0.1:40502_ ] o.a.s.s.SolrDispatchFilter SolrDispatchFilter.init() done
[junit4] 2> 1199225 INFO (coreLoadExecutor-2703-thread-1-processing-n:127.0.0.1:40502_) [n:127.0.0.1:40502_ c:collection1 x:collection1] o.a.s.c.ZkController numShards not found on descriptor - reading it from system property
[junit4] 2> 1199226 INFO (coreLoadExecutor-2703-thread-1-processing-n:127.0.0.1:40502_) [n:127.0.0.1:40502_ c:collection1 x:collection1] o.a.s.c.ZkController look for our core node name
[junit4] 2> 1199226 INFO (zkCallback-1660-thread-1-processing-n:127.0.0.1:44663_) [n:127.0.0.1:44663_ ] o.a.s.c.DistributedQueue NodeChildrenChanged fired on path /overseer/queue state SyncConnected
[junit4] 2> 1199226 INFO (OverseerStateUpdate-93980491864997891-127.0.0.1:44663_-n_0000000000) [n:127.0.0.1:44663_ ] o.a.s.c.Overseer processMessage: queueSize: 1, message = {
[junit4] 2> "collection":"collection1",
[junit4] 2> "state":"down",
[junit4] 2> "roles":null,
[junit4] 2> "node_name":"127.0.0.1:40502_",
[junit4] 2> "numShards":"3",
[junit4] 2> "operation":"state",
[junit4] 2> "base_url":"http://127.0.0.1:40502",
[junit4] 2> "shard":null,
[junit4] 2> "core":"collection1"} current state version: 3
[junit4] 2> 1199227 INFO (OverseerStateUpdate-93980491864997891-127.0.0.1:44663_-n_0000000000) [n:127.0.0.1:44663_ ] o.a.s.c.o.ReplicaMutator Update state numShards=3 message={
[junit4] 2> "collection":"collection1",
[junit4] 2> "state":"down",
[junit4] 2> "roles":null,
[junit4] 2> "node_name":"127.0.0.1:40502_",
[junit4] 2> "numShards":"3",
[junit4] 2> "operation":"state",
[junit4] 2> "base_url":"http://127.0.0.1:40502",
[junit4] 2> "shard":null,
[junit4] 2> "core":"collection1"}
[junit4] 2> 1199227 INFO (OverseerStateUpdate-93980491864997891-127.0.0.1:44663_-n_0000000000) [n:127.0.0.1:44663_ ] o.a.s.c.o.ClusterStateMutator building a new cName: collection1
[junit4] 2> 1199227 INFO (OverseerStateUpdate-93980491864997891-127.0.0.1:44663_-n_0000000000) [n:127.0.0.1:44663_ ] o.a.s.c.o.ReplicaMutator Assigning new node to shard shard=shard2
[junit4] 2> 1199329 INFO (zkCallback-1660-thread-1-processing-n:127.0.0.1:44663_) [n:127.0.0.1:44663_ ] o.a.s.c.c.ZkStateReader A cluster state change: WatchedEvent state:SyncConnected type:NodeDataChanged path:/clusterstate.json, has occurred - updating... (live nodes size: 2)
[junit4] 2> 1199329 INFO (zkCallback-1662-thread-1) [ ] o.a.s.c.c.ZkStateReader A cluster state change: WatchedEvent state:SyncConnected type:NodeDataChanged path:/clusterstate.json, has occurred - updating... (live nodes size: 2)
[junit4] 2> 1199329 INFO (zkCallback-1665-thread-1-processing-n:127.0.0.1:40502_) [n:127.0.0.1:40502_ ] o.a.s.c.c.ZkStateReader A cluster state change: WatchedEvent state:SyncConnected type:NodeDataChanged path:/clusterstate.json, has occurred - updating... (live nodes size: 2)
[junit4] 2> 1199330 INFO (zkCallback-1660-thread-1-processing-n:127.0.0.1:44663_) [n:127.0.0.1:44663_ ] o.a.s.c.c.ZkStateReader Updated cluster state version to 4
[junit4] 2> 1199330 INFO (zkCallback-1662-thread-1) [ ] o.a.s.c.c.ZkStateReader Updated cluster state version to 4
[junit4] 2> 1199330 INFO (zkCallback-1665-thread-1-processing-n:127.0.0.1:40502_) [n:127.0.0.1:40502_ ] o.a.s.c.c.ZkStateReader Updated cluster state version to 4
[junit4] 2> 1200226 INFO (coreLoadExecutor-2703-thread-1-processing-n:127.0.0.1:40502_) [n:127.0.0.1:40502_ c:collection1 x:collection1] o.a.s.c.ZkController waiting to find shard id in clusterstate for collection1
[junit4] 2> 1200226 INFO (coreLoadExecutor-2703-thread-1-processing-n:127.0.0.1:40502_) [n:127.0.0.1:40502_ c:collection1 x:collection1] o.a.s.c.ZkController Check for collection zkNode:collection1
[junit4] 2> 1200227 INFO (coreLoadExecutor-2703-thread-1-processing-n:127.0.0.1:40502_) [n:127.0.0.1:40502_ c:collection1 x:collection1] o.a.s.c.ZkController Collection zkNode exists
[junit4] 2> 1200227 INFO (coreLoadExecutor-2703-thread-1-processing-n:127.0.0.1:40502_) [n:127.0.0.1:40502_ c:collection1 x:collection1] o.a.s.c.c.ZkStateReader Load collection config from:/collections/collection1
[junit4] 2> 1200227 INFO (coreLoadExecutor-2703-thread-1-processing-n:127.0.0.1:40502_) [n:127.0.0.1:40502_ c:collection1 x:collection1] o.a.s.c.c.ZkStateReader path=/collections/collection1 configName=conf1 specified config exists in ZooKeeper
[junit4] 2> 1200227 INFO (coreLoadExecutor-2703-thread-1-processing-n:127.0.0.1:40502_) [n:127.0.0.1:40502_ c:collection1 x:collection1] o.a.s.c.SolrResourceLoader new SolrResourceLoader for directory: '/home/jenkins/workspace/Lucene-Solr-5.x-Linux/solr/build/solr-core/test/J1/temp/solr.cloud.FullSolrCloudDistribCmdsTest_35A7EAB14F623A99-001/shard-1-001/cores/collection1/'
[junit4] 2> 1200247 INFO (coreLoadExecutor-2703-thread-1-processing-n:127.0.0.1:40502_) [n:127.0.0.1:40502_ c:collection1 x:collection1] o.a.s.c.Config loaded config solrconfig.xml with version 0
[junit4] 2> 1200259 INFO (coreLoadExecutor-2703-thread-1-processing-n:127.0.0.1:40502_) [n:127.0.0.1:40502_ c:collection1 x:collection1] o.a.s.c.SolrConfig current version of requestparams : -1
[junit4] 2> 1200276 INFO (coreLoadExecutor-2703-thread-1-processing-n:127.0.0.1:40502_) [n:127.0.0.1:40502_ c:collection1 x:collection1] o.a.s.c.SolrConfig Using Lucene MatchVersion: 5.3.0
[junit4] 2> 1200312 INFO (coreLoadExecutor-2703-thread-1-processing-n:127.0.0.1:40502_) [n:127.0.0.1:40502_ c:collection1 x:collection1] o.a.s.c.Config Loaded SolrConfig: solrconfig.xml
[junit4] 2> 1200313 INFO (coreLoadExecutor-2703-thread-1-processing-n:127.0.0.1:40502_) [n:127.0.0.1:40502_ c:collection1 x:collection1] o.a.s.s.IndexSchema Reading Solr Schema from /configs/conf1/schema.xml
[junit4] 2> 1200322 INFO (coreLoadExecutor-2703-thread-1-processing-n:127.0.0.1:40502_) [n:127.0.0.1:40502_ c:collection1 x:collection1] o.a.s.s.IndexSchema [collection1] Schema name=test
[junit4] 2> 1200592 INFO (coreLoadExecutor-2703-thread-1-processing-n:127.0.0.1:40502_) [n:127.0.0.1:40502_ c:collection1 x:collection1] o.a.s.s.IndexSchema default search field in schema is text
[junit4] 2> 1200594 INFO (coreLoadExecutor-2703-thread-1-processing-n:127.0.0.1:40502_) [n:127.0.0.1:40502_ c:collection1 x:collection1] o.a.s.s.IndexSchema unique key field: id
[junit4] 2> 1200595 INFO (coreLoadExecutor-2703-thread-1-processing-n:127.0.0.1:40502_) [n:127.0.0.1:40502_ c:collection1 x:collection1] o.a.s.s.FileExchangeRateProvider Reloading exchange rates from file currency.xml
[junit4] 2> 1200598 INFO (coreLoadExecutor-2703-thread-1-processing-n:127.0.0.1:40502_) [n:127.0.0.1:40502_ c:collection1 x:collection1] o.a.s.s.FileExchangeRateProvider Reloading exchange rates from file currency.xml
[junit4] 2> 1200609 INFO (coreLoadExecutor-2703-thread-1-processing-n:127.0.0.1:40502_) [n:127.0.0.1:40502_ c:collection1 x:collection1] o.a.s.c.CoreContainer Creating SolrCore 'collection1' using configuration from collection collection1
[junit4] 2> 1200609 INFO (coreLoadExecutor-2703-thread-1-processing-n:127.0.0.1:40502_) [n:127.0.0.1:40502_ c:collection1 s:shard2 r:core_node1 x:collection1] o.a.s.c.SolrCore org.apache.solr.core.MockDirectoryFactory
[junit4] 2> 1200610 INFO (coreLoadExecutor-2703-thread-1-processing-n:127.0.0.1:40502_) [n:127.0.0.1:40502_ c:collection1 s:shard2 r:core_node1 x:collection1] o.a.s.c.SolrCore [[collection1] ] Opening new SolrCore at [/home/jenkins/workspace/Lucene-Solr-5.x-Linux/solr/build/solr-core/test/J1/temp/solr.cloud.FullSolrCloudDistribCmdsTest_35A7EAB14F623A99-001/shard-1-001/cores/collection1/], dataDir=[null]
[junit4] 2> 1200610 INFO (coreLoadExecutor-2703-thread-1-processing-n:127.0.0.1:40502_) [n:127.0.0.1:40502_ c:collection1 s:shard2 r:core_node1 x:collection1] o.a.s.c.JmxMonitoredMap JMX monitoring is enabled. Adding Solr mbeans to JMX Server: com.sun.jmx.mbeanserver.JmxMBeanServer@60461
[junit4] 2> 1200611 INFO (coreLoadExecutor-2703-thread-1-processing-n:127.0.0.1:40502_) [n:127.0.0.1:40502_ c:collection1 s:shard2 r:core_node1 x:collection1] o.a.s.c.CachingDirectoryFactory return new directory for /home/jenkins/workspace/Lucene-Solr-5.x-Linux/solr/build/solr-core/test/J1/temp/solr.cloud.FullSolrCloudDistribCmdsTest_35A7EAB14F623A99-001/shard-1-001/cores/collection1/data
[junit4] 2> 1200611 INFO (coreLoadExecutor-2703-thread-1-processing-n:127.0.0.1:40502_) [n:127.0.0.1:40502_ c:collection1 s:shard2 r:core_node1 x:collection1] o.a.s.c.SolrCore New index directory detected: old=null new=/home/jenkins/workspace/Lucene-Solr-5.x-Linux/solr/build/solr-core/test/J1/temp/solr.cloud.FullSolrCloudDistribCmdsTest_35A7EAB14F623A99-001/shard-1-001/cores/collection1/data/index/
[junit4] 2> 1200611 WARN (coreLoadExecutor-2703-thread-1-processing-n:127.0.0.1:40502_) [n:127.0.0.1:40502_ c:collection1 s:shard2 r:core_node1 x:collection1] o.a.s.c.SolrCore [collection1] Solr index directory '/home/jenkins/workspace/Lucene-Solr-5.x-Linux/solr/build/solr-core/test/J1/temp/solr.cloud.FullSolrCloudDistribCmdsTest_35A7EAB14F623A99-001/shard-1-001/cores/collection1/data/index' doesn't exist. Creating new index...
[junit4] 2> 1200612 INFO (coreLoadExecutor-2703-thread-1-processing-n:127.0.0.1:40502_) [n:127.0.0.1:40502_ c:collection1 s:shard2 r:core_node1 x:collection1] o.a.s.c.CachingDirectoryFactory return new directory for /home/jenkins/workspace/Lucene-Solr-5.x-Linux/solr/build/solr-core/test/J1/temp/solr.cloud.FullSolrCloudDistribCmdsTest_35A7EAB14F623A99-001/shard-1-001/cores/collection1/data/index
[junit4] 2> 1200612 INFO (coreLoadExecutor-2703-thread-1-processing-n:127.0.0.1:40502_) [n:127.0.0.1:40502_ c:collection1 s:shard2 r:core_node1 x:collection1] o.a.s.u.RandomMergePolicy RandomMergePolicy wrapping class org.apache.lucene.index.MockRandomMergePolicy: org.apache.lucene.index.MockRandomMergePolicy@ef806e
[junit4] 2> 1200612 INFO (coreLoadExecutor-2703-thread-1-processing-n:127.0.0.1:40502_) [n:127.0.0.1:40502_ c:collection1 s:shard2 r:core_node1 x:collection1] o.a.s.c.SolrCore SolrDeletionPolicy.onCommit: commits: num=1
[junit4] 2> commit{dir=MockDirectoryWrapper(RAMDirectory@1d8c07e lockFactory=org.apache.lucene.store.SingleInstanceLockFactory@145cdaa),segFN=segments_1,generation=1}
[junit4] 2> 1200613 INFO (coreLoadExecutor-2703-thread-1-processing-n:127.0.0.1:40502_) [n:127.0.0.1:40502_ c:collection1 s:shard2 r:core_node1 x:collection1] o.a.s.c.SolrCore newest commit generation = 1
[junit4] 2> 1200613 INFO (OldIndexDirectoryCleanupThreadForCore-collection1) [n:127.0.0.1:40502_ c:collection1 s:shard2 r:core_node1 x:collection1] o.a.s.c.SolrCore Looking for old index directories to cleanup for core collection1 in /home/jenkins/workspace/Lucene-Solr-5.x-Linux/solr/build/solr-core/test/J1/temp/solr.cloud.FullSolrCloudDistribCmdsTest_35A7EAB14F623A99-001/shard-1-001/cores/collection1/data/
[junit4] 2> 1200613 WARN (OldIndexDirectoryCleanupThreadForCore-collection1) [n:127.0.0.1:40502_ c:collection1 s:shard2 r:core_node1 x:collection1] o.a.s.c.DirectoryFactory /home/jenkins/workspace/Lucene-Solr-5.x-Linux/solr/build/solr-core/test/J1/temp/solr.cloud.FullSolrCloudDistribCmdsTest_35A7EAB14F623A99-001/shard-1-001/cores/collection1/data/ does not point to a valid data directory; skipping clean-up of old index directories.
[junit4] 2> 1200619 INFO (coreLoadExecutor-2703-thread-1-processing-n:127.0.0.1:40502_) [n:127.0.0.1:40502_ c:collection1 s:shard2 r:core_node1 x:collection1] o.a.s.u.p.UpdateRequestProcessorChain creating updateRequestProcessorChain "nodistrib"
[junit4] 2> 1200619 INFO (coreLoadExecutor-2703-thread-1-processing-n:127.0.0.1:40502_) [n:127.0.0.1:40502_ c:collection1 s:shard2 r:core_node1 x:collection1] o.a.s.u.p.UpdateRequestProcessorChain creating updateRequestProcessorChain "dedupe"
[junit4] 2> 1200619 INFO (coreLoadExecutor-2703-thread-1-processing-n:127.0.0.1:40502_) [n:127.0.0.1:40502_ c:collection1 s:shard2 r:core_node1 x:collection1] o.a.s.u.p.UpdateRequestProcessorChain inserting DistributedUpdateProcessorFactory into updateRequestProcessorChain "dedupe"
[junit4] 2> 1200620 INFO (coreLoadExecutor-2703-thread-1-processing-n:127.0.0.1:40502_) [n:127.0.0.1:40502_ c:collection1 s:shard2 r:core_node1 x:collection1] o.a.s.u.p.UpdateRequestProcessorChain creating updateRequestProcessorChain "stored_sig"
[junit4] 2> 1200620 INFO (coreLoadExecutor-2703-thread-1-processing-n:127.0.0.1:40502_) [n:127.0.0.1:40502_ c:collection1 s:shard2 r:core_node1 x:collection1] o.a.s.u.p.UpdateRequestProcessorChain inserting DistributedUpdateProcessorFactory into updateRequestProcessorChain "stored_sig"
[junit4] 2> 1200620 INFO (coreLoadExecutor-2703-thread-1-processing-n:127.0.0.1:40502_) [n:127.0.0.1:40502_ c:collection1 s:shard2 r:core_node1 x:collection1] o.a.s.u.p.UpdateRequestProcessorChain creating updateRequestProcessorChain "distrib-dup-test-chain-explicit"
[junit4] 2> 1200620 INFO (coreLoadExecutor-2703-thread-1-processing-n:127.0.0.1:40502_) [n:127.0.0.1:40502_ c:collection1 s:shard2 r:core_node1 x:collection1] o.a.s.u.p.UpdateRequestProcessorChain creating updateRequestProcessorChain "distrib-dup-test-chain-implicit"
[junit4] 2> 1200621 INFO (coreLoadExecutor-2703-thread-1-processing-n:127.0.0.1:40502_) [n:127.0.0.1:40502_ c:collection1 s:shard2 r:core_node1 x:collection1] o.a.s.u.p.UpdateRequestProcessorChain inserting DistributedUpdateProcessorFactory into updateRequestProcessorChain "distrib-dup-test-chain-implicit"
[junit4] 2> 1200621 INFO (coreLoadExecutor-2703-thread-1-processing-n:127.0.0.1:40502_) [n:127.0.0.1:40502_ c:collection1 s:shard2 r:core_node1 x:collection1] o.a.s.c.SolrCore no updateRequestProcessorChain defined as default, creating implicit default
[junit4] 2> 1200624 INFO (coreLoadExecutor-2703-thread-1-processing-n:127.0.0.1:40502_) [n:127.0.0.1:40502_ c:collection1 s:shard2 r:core_node1 x:collection1] o.a.s.h.l.XMLLoader xsltCacheLifetimeSeconds=60
[junit4] 2> 1200626 INFO (coreLoadExecutor-2703-thread-1-processing-n:127.0.0.1:40502_) [n:127.0.0.1:40502_ c:collection1 s:shard2 r:core_node1 x:collection1] o.a.s.h.l.XMLLoader xsltCacheLifetimeSeconds=60
[junit4] 2> 1200627 INFO (coreLoadExecutor-2703-thread-1-processing-n:127.0.0.1:40502_) [n:127.0.0.1:40502_ c:collection1 s:shard2 r:core_node1 x:collection1] o.a.s.h.l.XMLLoader xsltCacheLifetimeSeconds=60
[junit4] 2> 1200629 INFO (coreLoadExecutor-2703-thread-1-processing-n:127.0.0.1:40502_) [n:127.0.0.1:40502_ c:collection1 s:shard2 r:core_node1 x:collection1] o.a.s.h.l.XMLLoader xsltCacheLifetimeSeconds=60
[junit4] 2> 1200638 INFO (coreLoadExecutor-2703-thread-1-processing-n:127.0.0.1:40502_) [n:127.0.0.1:40502_ c:collection1 s:shard2 r:core_node1 x:collection1] o.a.s.c.RequestHandlers Registered paths: /admin/threads,/get,/update,/admin/file,/update/csv,/admin/ping,standard,/config,/update/json/docs,/admin/logging,/update/json,/admin/plugins,/admin/luke,/schema,/admin/segments,/admin/system,/admin/mbeans,/replication,/admin/properties
[junit4] 2> 1200640 INFO (coreLoadExecutor-2703-thread-1-processing-n:127.0.0.1:40502_) [n:127.0.0.1:40502_ c:collection1 s:shard2 r:core_node1 x:collection1] o.a.s.c.SolrCore Using default statsCache cache: org.apache.solr.search.stats.LocalStatsCache
[junit4] 2> 1200640 INFO (coreLoadExecutor-2703-thread-1-processing-n:127.0.0.1:40502_) [n:127.0.0.1:40502_ c:collection1 s:shard2 r:core_node1 x:collection1] o.a.s.u.UpdateHandler Using UpdateLog implementation: org.apache.solr.update.UpdateLog
[junit4] 2> 1200640 INFO (coreLoadExecutor-2703-thread-1-processing-n:127.0.0.1:40502_) [n:127.0.0.1:40502_ c:collection1 s:shard2 r:core_node1 x:collection1] o.a.s.u.UpdateLog Initializing UpdateLog: dataDir= defaultSyncLevel=FLUSH numRecordsToKeep=100 maxNumLogsToKeep=10 numVersionBuckets=65536
[junit4] 2> 1200642 INFO (coreLoadExecutor-2703-thread-1-processing-n:127.0.0.1:40502_) [n:127.0.0.1:40502_ c:collection1 s:shard2 r:core_node1 x:collection1] o.a.s.c.SolrCore Hard AutoCommit: disabled
[junit4] 2> 1200642 INFO (coreLoadExecutor-2703-thread-1-processing-n:127.0.0.1:40502_) [n:127.0.0.1:40502_ c:collection1 s:shard2 r:core_node1 x:collection1] o.a.s.c.SolrCore Soft AutoCommit: disabled
[junit4] 2> 1200643 INFO (coreLoadExecutor-2703-thread-1-processing-n:127.0.0.1:40502_) [n:127.0.0.1:40502_ c:collection1 s:shard2 r:core_node1 x:collection1] o.a.s.u.RandomMergePolicy RandomMergePolicy wrapping class org.apache.lucene.index.LogByteSizeMergePolicy: [LogByteSizeMergePolicy: minMergeSize=1677721, mergeFactor=17, maxMergeSize=2147483648, maxMergeSizeForForcedMerge=9223372036854775807, calibrateSizeByDeletes=true, maxMergeDocs=2147483647, maxCFSSegmentSizeMB=8.796093022207999E12, noCFSRatio=0.529550860781044]
[junit4] 2> 1200644 INFO (coreLoadExecutor-2703-thread-1-processing-n:127.0.0.1:40502_) [n:127.0.0.1:40502_ c:collection1 s:shard2 r:core_node1 x:collection1] o.a.s.c.SolrCore SolrDeletionPolicy.onInit: commits: num=1
[junit4] 2> commit{dir=MockDirectoryWrapper(RAMDirectory@1d8c07e lockFactory=org.apache.lucene.store.SingleInstanceLockFactory@145cdaa),segFN=segments_1,generation=1}
[jun
[...truncated too long message...]
x/solr/build/solr-core/test/J1/temp/solr.cloud.FullSolrCloudDistribCmdsTest_35A7EAB14F623A99-001/shard-6-001/cores/collection1/data;done=false>>]
[junit4] 2> 1242134 INFO (zkCallback-1682-thread-1-processing-n:127.0.0.1:53776_) [n:127.0.0.1:53776_ c:collection1 s:shard1 r:core_node6 x:collection1] o.a.s.c.CachingDirectoryFactory Closing directory: /home/jenkins/workspace/Lucene-Solr-5.x-Linux/solr/build/solr-core/test/J1/temp/solr.cloud.FullSolrCloudDistribCmdsTest_35A7EAB14F623A99-001/shard-6-001/cores/collection1/data
[junit4] 2> 1242134 INFO (zkCallback-1682-thread-1-processing-n:127.0.0.1:53776_) [n:127.0.0.1:53776_ c:collection1 s:shard1 r:core_node6 x:collection1] o.a.s.c.CachingDirectoryFactory looking to close /home/jenkins/workspace/Lucene-Solr-5.x-Linux/solr/build/solr-core/test/J1/temp/solr.cloud.FullSolrCloudDistribCmdsTest_35A7EAB14F623A99-001/shard-6-001/cores/collection1/data/index [CachedDir<<refCount=0;path=/home/jenkins/workspace/Lucene-Solr-5.x-Linux/solr/build/solr-core/test/J1/temp/solr.cloud.FullSolrCloudDistribCmdsTest_35A7EAB14F623A99-001/shard-6-001/cores/collection1/data/index;done=false>>]
[junit4] 2> 1242134 INFO (zkCallback-1682-thread-1-processing-n:127.0.0.1:53776_) [n:127.0.0.1:53776_ c:collection1 s:shard1 r:core_node6 x:collection1] o.a.s.c.CachingDirectoryFactory Closing directory: /home/jenkins/workspace/Lucene-Solr-5.x-Linux/solr/build/solr-core/test/J1/temp/solr.cloud.FullSolrCloudDistribCmdsTest_35A7EAB14F623A99-001/shard-6-001/cores/collection1/data/index
[junit4] 2> 1242670 WARN (zkCallback-1682-thread-3-processing-n:127.0.0.1:53776_) [n:127.0.0.1:53776_ ] o.a.s.c.c.ZkStateReader ZooKeeper watch triggered, but Solr cannot talk to ZK
[junit4] 2> 1242671 INFO (TEST-FullSolrCloudDistribCmdsTest.test-seed#[35A7EAB14F623A99]) [ ] o.e.j.s.ServerConnector Stopped ServerConnector@1a437ac{HTTP/1.1}{127.0.0.1:0}
[junit4] 2> 1242671 INFO (TEST-FullSolrCloudDistribCmdsTest.test-seed#[35A7EAB14F623A99]) [ ] o.e.j.s.h.ContextHandler Stopped o.e.j.s.ServletContextHandler@3b65d7{/,null,UNAVAILABLE}
[junit4] 2> 1242672 INFO (TEST-FullSolrCloudDistribCmdsTest.test-seed#[35A7EAB14F623A99]) [n:127.0.0.1:53776_ c:collection1 s:shard1 r:core_node6 x:collection1] o.a.s.c.ZkTestServer connecting to 127.0.0.1:59819 59819
[junit4] 2> 1242774 INFO (Thread-2209) [ ] o.a.s.c.ZkTestServer connecting to 127.0.0.1:59819 59819
[junit4] 2> 1242775 WARN (Thread-2209) [ ] o.a.s.c.ZkTestServer Watch limit violations:
[junit4] 2> Maximum concurrent create/delete watches above limit:
[junit4] 2>
[junit4] 2> 14 /solr/clusterstate.json
[junit4] 2> 13 /solr/aliases.json
[junit4] 2> 7 /solr/configs/conf1
[junit4] 2>
[junit4] 2> Maximum concurrent children watches above limit:
[junit4] 2>
[junit4] 2> 13 /solr/live_nodes
[junit4] 2> 6 /solr/overseer/collection-queue-work
[junit4] 2> 6 /solr/overseer/queue
[junit4] 2>
[junit4] 2> NOTE: reproduce with: ant test -Dtestcase=FullSolrCloudDistribCmdsTest -Dtests.method=test -Dtests.seed=35A7EAB14F623A99 -Dtests.multiplier=3 -Dtests.slow=true -Dtests.locale=ar_BH -Dtests.timezone=Pacific/Wake -Dtests.asserts=true -Dtests.file.encoding=ISO-8859-1
[junit4] ERROR 46.4s J1 | FullSolrCloudDistribCmdsTest.test <<<
[junit4] > Throwable #1: org.apache.zookeeper.KeeperException$SessionExpiredException: KeeperErrorCode = Session expired for /live_nodes
[junit4] > at __randomizedtesting.SeedInfo.seed([35A7EAB14F623A99:BDF3D56BE19E5761]:0)
[junit4] > at org.apache.zookeeper.KeeperException.create(KeeperException.java:127)
[junit4] > at org.apache.zookeeper.KeeperException.create(KeeperException.java:51)
[junit4] > at org.apache.zookeeper.ZooKeeper.getChildren(ZooKeeper.java:1472)
[junit4] > at org.apache.solr.common.cloud.SolrZkClient$6.execute(SolrZkClient.java:328)
[junit4] > at org.apache.solr.common.cloud.SolrZkClient$6.execute(SolrZkClient.java:325)
[junit4] > at org.apache.solr.common.cloud.ZkCmdExecutor.retryOperation(ZkCmdExecutor.java:61)
[junit4] > at org.apache.solr.common.cloud.SolrZkClient.getChildren(SolrZkClient.java:325)
[junit4] > at org.apache.solr.common.cloud.ZkStateReader.updateClusterState(ZkStateReader.java:536)
[junit4] > at org.apache.solr.common.cloud.ZkStateReader.updateClusterState(ZkStateReader.java:269)
[junit4] > at org.apache.solr.cloud.AbstractFullDistribZkTestBase.updateMappingsFromZk(AbstractFullDistribZkTestBase.java:605)
[junit4] > at org.apache.solr.cloud.AbstractFullDistribZkTestBase.checkShardConsistency(AbstractFullDistribZkTestBase.java:1230)
[junit4] > at org.apache.solr.cloud.AbstractFullDistribZkTestBase.checkShardConsistency(AbstractFullDistribZkTestBase.java:1221)
[junit4] > at org.apache.solr.cloud.AbstractFullDistribZkTestBase.checkShardConsistency(AbstractFullDistribZkTestBase.java:1213)
[junit4] > at org.apache.solr.cloud.FullSolrCloudDistribCmdsTest.testConcurrentIndexing(FullSolrCloudDistribCmdsTest.java:711)
[junit4] > at org.apache.solr.cloud.FullSolrCloudDistribCmdsTest.test(FullSolrCloudDistribCmdsTest.java:138)
[junit4] > at org.apache.solr.BaseDistributedSearchTestCase$ShardsRepeatRule$ShardsFixedStatement.callStatement(BaseDistributedSearchTestCase.java:960)
[junit4] > at org.apache.solr.BaseDistributedSearchTestCase$ShardsRepeatRule$ShardsStatement.evaluate(BaseDistributedSearchTestCase.java:935)
[junit4] > at java.lang.Thread.run(Thread.java:745)
[junit4] 2> 1242782 INFO (SUITE-FullSolrCloudDistribCmdsTest-seed#[35A7EAB14F623A99]-worker) [n:127.0.0.1:53776_ c:collection1 s:shard1 r:core_node6 x:collection1] o.a.s.SolrTestCaseJ4 ###deleteCore
[junit4] 2> NOTE: leaving temporary files on disk at: /home/jenkins/workspace/Lucene-Solr-5.x-Linux/solr/build/solr-core/test/J1/temp/solr.cloud.FullSolrCloudDistribCmdsTest_35A7EAB14F623A99-001
[junit4] 2> Jun 11, 2015 1:15:47 PM com.carrotsearch.randomizedtesting.ThreadLeakControl checkThreadLeaks
[junit4] 2> WARNING: Will linger awaiting termination of 1 leaked thread(s).
[junit4] 2> NOTE: test params are: codec=Asserting(Lucene50), sim=DefaultSimilarity, locale=ar_BH, timezone=Pacific/Wake
[junit4] 2> NOTE: Linux 3.13.0-53-generic i386/Oracle Corporation 1.7.0_80 (32-bit)/cpus=12,threads=1,free=311408360,total=518979584
[junit4] 2> NOTE: All tests run in this JVM: [TestRawResponseWriter, DistributedMLTComponentTest, RulesTest, PreAnalyzedUpdateProcessorTest, DeleteInactiveReplicaTest, ScriptEngineTest, ResourceLoaderTest, TestValueSourceCache, DocValuesMissingTest, TestShortCircuitedRequests, JsonLoaderTest, UpdateParamsTest, TestSchemaSimilarityResource, TestSolrDeletionPolicy2, TestDefaultSearchFieldResource, TestLMJelinekMercerSimilarityFactory, TestCursorMarkWithoutUniqueKey, TestNamedUpdateProcessors, TestSolr4Spatial2, CoreAdminHandlerTest, TestTolerantSearch, DocumentAnalysisRequestHandlerTest, TestObjectReleaseTracker, ConvertedLegacyTest, TestCoreContainer, BadComponentTest, LukeRequestHandlerTest, RecoveryAfterSoftCommitTest, PreAnalyzedFieldTest, TestDistributedGrouping, RAMDirectoryFactoryTest, TestStressVersions, AddBlockUpdateTest, MultiThreadedOCPTest, ClusterStateUpdateTest, TestCloudManagedSchemaConcurrent, TestSolrDynamicMBean, HdfsChaosMonkeySafeLeaderTest, FieldAnalysisRequestHandlerTest, JSONWriterTest, TestStressUserVersions, TestElisionMultitermQuery, TestDynamicFieldResource, AnalysisAfterCoreReloadTest, FieldMutatingUpdateProcessorTest, TestHashPartitioner, SolrXmlInZkTest, TestSolrCloudWithKerberosAlt, WordBreakSolrSpellCheckerTest, SliceStateTest, DirectSolrConnectionTest, ZkCLITest, StressHdfsTest, ChaosMonkeySafeLeaderTest, EnumFieldTest, FileUtilsTest, TestFastWriter, OpenCloseCoreStressTest, TestFuzzyAnalyzedSuggestions, TestSearcherReuse, TestLRUCache, TestMiniSolrCloudClusterSSL, ActionThrottleTest, ShowFileRequestHandlerTest, TestSolrQueryParserResource, TestSchemaVersionResource, CurrencyFieldOpenExchangeTest, TestCustomSort, TestAtomicUpdateErrorCases, SpellingQueryConverterTest, TestEmbeddedSolrServerConstructors, RequiredFieldsTest, AnalyticsMergeStrategyTest, TestLMDirichletSimilarityFactory, ConcurrentDeleteAndCreateCollectionTest, EchoParamsTest, CopyFieldTest, DisMaxRequestHandlerTest, SpellPossibilityIteratorTest, TestReloadAndDeleteDocs, DistributedTermsComponentTest, VMParamsZkACLAndCredentialsProvidersTest, BasicDistributedZk2Test, CollectionsAPIDistributedZkTest, FullSolrCloudDistribCmdsTest]
[junit4] Completed [258/500] on J1 in 46.68s, 1 test, 1 error <<< FAILURES!
[...truncated 747 lines...]
BUILD FAILED
/home/jenkins/workspace/Lucene-Solr-5.x-Linux/build.xml:536: The following error occurred while executing this line:
/home/jenkins/workspace/Lucene-Solr-5.x-Linux/build.xml:484: The following error occurred while executing this line:
/home/jenkins/workspace/Lucene-Solr-5.x-Linux/build.xml:61: The following error occurred while executing this line:
/home/jenkins/workspace/Lucene-Solr-5.x-Linux/extra-targets.xml:39: The following error occurred while executing this line:
/home/jenkins/workspace/Lucene-Solr-5.x-Linux/solr/build.xml:230: The following error occurred while executing this line:
/home/jenkins/workspace/Lucene-Solr-5.x-Linux/solr/common-build.xml:511: The following error occurred while executing this line:
/home/jenkins/workspace/Lucene-Solr-5.x-Linux/lucene/common-build.xml:1444: The following error occurred while executing this line:
/home/jenkins/workspace/Lucene-Solr-5.x-Linux/lucene/common-build.xml:999: There were test failures: 500 suites, 1979 tests, 1 error, 59 ignored (25 assumptions)
Total time: 66 minutes 59 seconds
Build step 'Invoke Ant' marked build as failure
Archiving artifacts
Recording test results
Email was triggered for: Failure - Any
Sending email for trigger: Failure - Any