You are viewing a plain text version of this content. The canonical link for it is here.
Posted to builds@lucene.apache.org by Policeman Jenkins Server <je...@thetaphi.de> on 2025/07/26 02:44:50 UTC

[JENKINS-EA] Lucene-nightly-main-Linux (64bit/hotspot/jdk-26-ea+2) - Build # 427 - Unstable!

Build: https://jenkins.thetaphi.de/job/Lucene-nightly-main-Linux/427/
Java: 64bit/hotspot/jdk-26-ea+2 -XX:-UseCompressedOops -XX:+UseSerialGC

2 tests failed.
FAILED:  org.apache.lucene.search.join.TestParentBlockJoinByteKnnVectorQuery.testTimeout

Error Message:
java.lang.AssertionError: expected:<1> but was:<0>

Stack Trace:
java.lang.AssertionError: expected:<1> but was:<0>
	at __randomizedtesting.SeedInfo.seed([8FA558650EC49796:DF9DD3DE6B2CB58A]:0)
	at junit@4.13.2/org.junit.Assert.fail(Assert.java:89)
	at junit@4.13.2/org.junit.Assert.failNotEquals(Assert.java:835)
	at junit@4.13.2/org.junit.Assert.assertEquals(Assert.java:647)
	at junit@4.13.2/org.junit.Assert.assertEquals(Assert.java:633)
	at org.apache.lucene.search.join.ParentBlockJoinKnnVectorQueryTestCase.testTimeout(ParentBlockJoinKnnVectorQueryTestCase.java:318)
	at org.apache.lucene.search.join.TestParentBlockJoinByteKnnVectorQuery.testTimeout(TestParentBlockJoinByteKnnVectorQuery.java:39)
	at java.base/jdk.internal.reflect.DirectMethodHandleAccessor.invoke(DirectMethodHandleAccessor.java:104)
	at java.base/java.lang.reflect.Method.invoke(Method.java:565)
	at randomizedtesting.runner@2.8.3/com.carrotsearch.randomizedtesting.RandomizedRunner.invoke(RandomizedRunner.java:1763)
	at randomizedtesting.runner@2.8.3/com.carrotsearch.randomizedtesting.RandomizedRunner$8.evaluate(RandomizedRunner.java:946)
	at randomizedtesting.runner@2.8.3/com.carrotsearch.randomizedtesting.RandomizedRunner$9.evaluate(RandomizedRunner.java:982)
	at randomizedtesting.runner@2.8.3/com.carrotsearch.randomizedtesting.RandomizedRunner$10.evaluate(RandomizedRunner.java:996)
	at org.apache.lucene.test_framework@11.0.0-SNAPSHOT/org.apache.lucene.tests.util.TestRuleSetupTeardownChained$1.evaluate(TestRuleSetupTeardownChained.java:48)
	at org.apache.lucene.test_framework@11.0.0-SNAPSHOT/org.apache.lucene.tests.util.AbstractBeforeAfterRule$1.evaluate(AbstractBeforeAfterRule.java:43)
	at org.apache.lucene.test_framework@11.0.0-SNAPSHOT/org.apache.lucene.tests.util.TestRuleThreadAndTestName$1.evaluate(TestRuleThreadAndTestName.java:45)
	at org.apache.lucene.test_framework@11.0.0-SNAPSHOT/org.apache.lucene.tests.util.TestRuleIgnoreAfterMaxFailures$1.evaluate(TestRuleIgnoreAfterMaxFailures.java:60)
	at org.apache.lucene.test_framework@11.0.0-SNAPSHOT/org.apache.lucene.tests.util.TestRuleMarkFailure$1.evaluate(TestRuleMarkFailure.java:44)
	at junit@4.13.2/org.junit.rules.RunRules.evaluate(RunRules.java:20)
	at randomizedtesting.runner@2.8.3/com.carrotsearch.randomizedtesting.rules.StatementAdapter.evaluate(StatementAdapter.java:36)
	at randomizedtesting.runner@2.8.3/com.carrotsearch.randomizedtesting.ThreadLeakControl$StatementRunner.run(ThreadLeakControl.java:390)
	at randomizedtesting.runner@2.8.3/com.carrotsearch.randomizedtesting.ThreadLeakControl.forkTimeoutingTask(ThreadLeakControl.java:843)
	at randomizedtesting.runner@2.8.3/com.carrotsearch.randomizedtesting.ThreadLeakControl$3.evaluate(ThreadLeakControl.java:490)
	at randomizedtesting.runner@2.8.3/com.carrotsearch.randomizedtesting.RandomizedRunner.runSingleTest(RandomizedRunner.java:955)
	at randomizedtesting.runner@2.8.3/com.carrotsearch.randomizedtesting.RandomizedRunner$5.evaluate(RandomizedRunner.java:840)
	at randomizedtesting.runner@2.8.3/com.carrotsearch.randomizedtesting.RandomizedRunner$6.evaluate(RandomizedRunner.java:891)
	at randomizedtesting.runner@2.8.3/com.carrotsearch.randomizedtesting.RandomizedRunner$7.evaluate(RandomizedRunner.java:902)
	at org.apache.lucene.test_framework@11.0.0-SNAPSHOT/org.apache.lucene.tests.util.AbstractBeforeAfterRule$1.evaluate(AbstractBeforeAfterRule.java:43)
	at randomizedtesting.runner@2.8.3/com.carrotsearch.randomizedtesting.rules.StatementAdapter.evaluate(StatementAdapter.java:36)
	at org.apache.lucene.test_framework@11.0.0-SNAPSHOT/org.apache.lucene.tests.util.TestRuleStoreClassName$1.evaluate(TestRuleStoreClassName.java:38)
	at randomizedtesting.runner@2.8.3/com.carrotsearch.randomizedtesting.rules.NoShadowingOrOverridesOnMethodsRule$1.evaluate(NoShadowingOrOverridesOnMethodsRule.java:40)
	at randomizedtesting.runner@2.8.3/com.carrotsearch.randomizedtesting.rules.NoShadowingOrOverridesOnMethodsRule$1.evaluate(NoShadowingOrOverridesOnMethodsRule.java:40)
	at randomizedtesting.runner@2.8.3/com.carrotsearch.randomizedtesting.rules.StatementAdapter.evaluate(StatementAdapter.java:36)
	at randomizedtesting.runner@2.8.3/com.carrotsearch.randomizedtesting.rules.StatementAdapter.evaluate(StatementAdapter.java:36)
	at org.apache.lucene.test_framework@11.0.0-SNAPSHOT/org.apache.lucene.tests.util.TestRuleAssertionsRequired$1.evaluate(TestRuleAssertionsRequired.java:53)
	at org.apache.lucene.test_framework@11.0.0-SNAPSHOT/org.apache.lucene.tests.util.AbstractBeforeAfterRule$1.evaluate(AbstractBeforeAfterRule.java:43)
	at org.apache.lucene.test_framework@11.0.0-SNAPSHOT/org.apache.lucene.tests.util.TestRuleMarkFailure$1.evaluate(TestRuleMarkFailure.java:44)
	at org.apache.lucene.test_framework@11.0.0-SNAPSHOT/org.apache.lucene.tests.util.TestRuleIgnoreAfterMaxFailures$1.evaluate(TestRuleIgnoreAfterMaxFailures.java:60)
	at org.apache.lucene.test_framework@11.0.0-SNAPSHOT/org.apache.lucene.tests.util.TestRuleIgnoreTestSuites$1.evaluate(TestRuleIgnoreTestSuites.java:47)
	at junit@4.13.2/org.junit.rules.RunRules.evaluate(RunRules.java:20)
	at randomizedtesting.runner@2.8.3/com.carrotsearch.randomizedtesting.rules.StatementAdapter.evaluate(StatementAdapter.java:36)
	at randomizedtesting.runner@2.8.3/com.carrotsearch.randomizedtesting.ThreadLeakControl$StatementRunner.run(ThreadLeakControl.java:390)
	at randomizedtesting.runner@2.8.3/com.carrotsearch.randomizedtesting.ThreadLeakControl.lambda$forkTimeoutingTask$0(ThreadLeakControl.java:850)
	at java.base/java.lang.Thread.run(Thread.java:1474)


FAILED:  org.apache.lucene.search.join.TestParentBlockJoinFloatKnnVectorQuery.testTimeout

Error Message:
java.lang.AssertionError: expected:<1> but was:<0>

Stack Trace:
java.lang.AssertionError: expected:<1> but was:<0>
	at __randomizedtesting.SeedInfo.seed([8FA558650EC49796:DF9DD3DE6B2CB58A]:0)
	at junit@4.13.2/org.junit.Assert.fail(Assert.java:89)
	at junit@4.13.2/org.junit.Assert.failNotEquals(Assert.java:835)
	at junit@4.13.2/org.junit.Assert.assertEquals(Assert.java:647)
	at junit@4.13.2/org.junit.Assert.assertEquals(Assert.java:633)
	at org.apache.lucene.search.join.ParentBlockJoinKnnVectorQueryTestCase.testTimeout(ParentBlockJoinKnnVectorQueryTestCase.java:318)
	at org.apache.lucene.search.join.TestParentBlockJoinFloatKnnVectorQuery.testTimeout(TestParentBlockJoinFloatKnnVectorQuery.java:40)
	at java.base/jdk.internal.reflect.DirectMethodHandleAccessor.invoke(DirectMethodHandleAccessor.java:104)
	at java.base/java.lang.reflect.Method.invoke(Method.java:565)
	at randomizedtesting.runner@2.8.3/com.carrotsearch.randomizedtesting.RandomizedRunner.invoke(RandomizedRunner.java:1763)
	at randomizedtesting.runner@2.8.3/com.carrotsearch.randomizedtesting.RandomizedRunner$8.evaluate(RandomizedRunner.java:946)
	at randomizedtesting.runner@2.8.3/com.carrotsearch.randomizedtesting.RandomizedRunner$9.evaluate(RandomizedRunner.java:982)
	at randomizedtesting.runner@2.8.3/com.carrotsearch.randomizedtesting.RandomizedRunner$10.evaluate(RandomizedRunner.java:996)
	at org.apache.lucene.test_framework@11.0.0-SNAPSHOT/org.apache.lucene.tests.util.TestRuleSetupTeardownChained$1.evaluate(TestRuleSetupTeardownChained.java:48)
	at org.apache.lucene.test_framework@11.0.0-SNAPSHOT/org.apache.lucene.tests.util.AbstractBeforeAfterRule$1.evaluate(AbstractBeforeAfterRule.java:43)
	at org.apache.lucene.test_framework@11.0.0-SNAPSHOT/org.apache.lucene.tests.util.TestRuleThreadAndTestName$1.evaluate(TestRuleThreadAndTestName.java:45)
	at org.apache.lucene.test_framework@11.0.0-SNAPSHOT/org.apache.lucene.tests.util.TestRuleIgnoreAfterMaxFailures$1.evaluate(TestRuleIgnoreAfterMaxFailures.java:60)
	at org.apache.lucene.test_framework@11.0.0-SNAPSHOT/org.apache.lucene.tests.util.TestRuleMarkFailure$1.evaluate(TestRuleMarkFailure.java:44)
	at junit@4.13.2/org.junit.rules.RunRules.evaluate(RunRules.java:20)
	at randomizedtesting.runner@2.8.3/com.carrotsearch.randomizedtesting.rules.StatementAdapter.evaluate(StatementAdapter.java:36)
	at randomizedtesting.runner@2.8.3/com.carrotsearch.randomizedtesting.ThreadLeakControl$StatementRunner.run(ThreadLeakControl.java:390)
	at randomizedtesting.runner@2.8.3/com.carrotsearch.randomizedtesting.ThreadLeakControl.forkTimeoutingTask(ThreadLeakControl.java:843)
	at randomizedtesting.runner@2.8.3/com.carrotsearch.randomizedtesting.ThreadLeakControl$3.evaluate(ThreadLeakControl.java:490)
	at randomizedtesting.runner@2.8.3/com.carrotsearch.randomizedtesting.RandomizedRunner.runSingleTest(RandomizedRunner.java:955)
	at randomizedtesting.runner@2.8.3/com.carrotsearch.randomizedtesting.RandomizedRunner$5.evaluate(RandomizedRunner.java:840)
	at randomizedtesting.runner@2.8.3/com.carrotsearch.randomizedtesting.RandomizedRunner$6.evaluate(RandomizedRunner.java:891)
	at randomizedtesting.runner@2.8.3/com.carrotsearch.randomizedtesting.RandomizedRunner$7.evaluate(RandomizedRunner.java:902)
	at org.apache.lucene.test_framework@11.0.0-SNAPSHOT/org.apache.lucene.tests.util.AbstractBeforeAfterRule$1.evaluate(AbstractBeforeAfterRule.java:43)
	at randomizedtesting.runner@2.8.3/com.carrotsearch.randomizedtesting.rules.StatementAdapter.evaluate(StatementAdapter.java:36)
	at org.apache.lucene.test_framework@11.0.0-SNAPSHOT/org.apache.lucene.tests.util.TestRuleStoreClassName$1.evaluate(TestRuleStoreClassName.java:38)
	at randomizedtesting.runner@2.8.3/com.carrotsearch.randomizedtesting.rules.NoShadowingOrOverridesOnMethodsRule$1.evaluate(NoShadowingOrOverridesOnMethodsRule.java:40)
	at randomizedtesting.runner@2.8.3/com.carrotsearch.randomizedtesting.rules.NoShadowingOrOverridesOnMethodsRule$1.evaluate(NoShadowingOrOverridesOnMethodsRule.java:40)
	at randomizedtesting.runner@2.8.3/com.carrotsearch.randomizedtesting.rules.StatementAdapter.evaluate(StatementAdapter.java:36)
	at randomizedtesting.runner@2.8.3/com.carrotsearch.randomizedtesting.rules.StatementAdapter.evaluate(StatementAdapter.java:36)
	at org.apache.lucene.test_framework@11.0.0-SNAPSHOT/org.apache.lucene.tests.util.TestRuleAssertionsRequired$1.evaluate(TestRuleAssertionsRequired.java:53)
	at org.apache.lucene.test_framework@11.0.0-SNAPSHOT/org.apache.lucene.tests.util.AbstractBeforeAfterRule$1.evaluate(AbstractBeforeAfterRule.java:43)
	at org.apache.lucene.test_framework@11.0.0-SNAPSHOT/org.apache.lucene.tests.util.TestRuleMarkFailure$1.evaluate(TestRuleMarkFailure.java:44)
	at org.apache.lucene.test_framework@11.0.0-SNAPSHOT/org.apache.lucene.tests.util.TestRuleIgnoreAfterMaxFailures$1.evaluate(TestRuleIgnoreAfterMaxFailures.java:60)
	at org.apache.lucene.test_framework@11.0.0-SNAPSHOT/org.apache.lucene.tests.util.TestRuleIgnoreTestSuites$1.evaluate(TestRuleIgnoreTestSuites.java:47)
	at junit@4.13.2/org.junit.rules.RunRules.evaluate(RunRules.java:20)
	at randomizedtesting.runner@2.8.3/com.carrotsearch.randomizedtesting.rules.StatementAdapter.evaluate(StatementAdapter.java:36)
	at randomizedtesting.runner@2.8.3/com.carrotsearch.randomizedtesting.ThreadLeakControl$StatementRunner.run(ThreadLeakControl.java:390)
	at randomizedtesting.runner@2.8.3/com.carrotsearch.randomizedtesting.ThreadLeakControl.lambda$forkTimeoutingTask$0(ThreadLeakControl.java:850)
	at java.base/java.lang.Thread.run(Thread.java:1474)

[JENKINS] Lucene-nightly-main-Linux (64bit/hotspot/jdk-24) - Build # 428 - Still Unstable!

Posted by Policeman Jenkins Server <je...@thetaphi.de>.
Build: https://jenkins.thetaphi.de/job/Lucene-nightly-main-Linux/428/
Java: 64bit/hotspot/jdk-24 -XX:-UseCompressedOops -XX:+UseParallelGC

1 tests failed.
FAILED:  org.apache.lucene.search.TestLiveFieldValues.test

Error Message:
org.apache.lucene.store.AlreadyClosedException: this IndexWriter is closed

Stack Trace:
org.apache.lucene.store.AlreadyClosedException: this IndexWriter is closed
	at app//org.apache.lucene.index.IndexWriter.ensureOpen(IndexWriter.java:914)
	at app//org.apache.lucene.index.IndexWriter.ensureOpen(IndexWriter.java:927)
	at app//org.apache.lucene.index.IndexWriter.nrtIsCurrent(IndexWriter.java:5768)
	at app//org.apache.lucene.index.StandardDirectoryReader.doOpenFromWriter(StandardDirectoryReader.java:368)
	at app//org.apache.lucene.index.StandardDirectoryReader.doOpenIfChanged(StandardDirectoryReader.java:346)
	at app//org.apache.lucene.index.DirectoryReader.openIfChanged(DirectoryReader.java:182)
	at app//org.apache.lucene.search.SearcherManager.refreshIfNeeded(SearcherManager.java:200)
	at app//org.apache.lucene.search.SearcherManager.refreshIfNeeded(SearcherManager.java:53)
	at app//org.apache.lucene.search.ReferenceManager.doMaybeRefresh(ReferenceManager.java:167)
	at app//org.apache.lucene.search.ReferenceManager.maybeRefresh(ReferenceManager.java:213)
	at app//org.apache.lucene.search.TestLiveFieldValues.test(TestLiveFieldValues.java:172)
	at java.base@24/jdk.internal.reflect.DirectMethodHandleAccessor.invoke(DirectMethodHandleAccessor.java:104)
	at java.base@24/java.lang.reflect.Method.invoke(Method.java:565)
	at app//com.carrotsearch.randomizedtesting.RandomizedRunner.invoke(RandomizedRunner.java:1763)
	at app//com.carrotsearch.randomizedtesting.RandomizedRunner$8.evaluate(RandomizedRunner.java:946)
	at app//com.carrotsearch.randomizedtesting.RandomizedRunner$9.evaluate(RandomizedRunner.java:982)
	at app//com.carrotsearch.randomizedtesting.RandomizedRunner$10.evaluate(RandomizedRunner.java:996)
	at app//org.apache.lucene.tests.util.TestRuleSetupTeardownChained$1.evaluate(TestRuleSetupTeardownChained.java:48)
	at app//org.apache.lucene.tests.util.AbstractBeforeAfterRule$1.evaluate(AbstractBeforeAfterRule.java:43)
	at app//org.apache.lucene.tests.util.TestRuleThreadAndTestName$1.evaluate(TestRuleThreadAndTestName.java:45)
	at app//org.apache.lucene.tests.util.TestRuleIgnoreAfterMaxFailures$1.evaluate(TestRuleIgnoreAfterMaxFailures.java:60)
	at app//org.apache.lucene.tests.util.TestRuleMarkFailure$1.evaluate(TestRuleMarkFailure.java:44)
	at app//org.junit.rules.RunRules.evaluate(RunRules.java:20)
	at app//com.carrotsearch.randomizedtesting.rules.StatementAdapter.evaluate(StatementAdapter.java:36)
	at app//com.carrotsearch.randomizedtesting.ThreadLeakControl$StatementRunner.run(ThreadLeakControl.java:390)
	at app//com.carrotsearch.randomizedtesting.ThreadLeakControl.forkTimeoutingTask(ThreadLeakControl.java:843)
	at app//com.carrotsearch.randomizedtesting.ThreadLeakControl$3.evaluate(ThreadLeakControl.java:490)
	at app//com.carrotsearch.randomizedtesting.RandomizedRunner.runSingleTest(RandomizedRunner.java:955)
	at app//com.carrotsearch.randomizedtesting.RandomizedRunner$5.evaluate(RandomizedRunner.java:840)
	at app//com.carrotsearch.randomizedtesting.RandomizedRunner$6.evaluate(RandomizedRunner.java:891)
	at app//com.carrotsearch.randomizedtesting.RandomizedRunner$7.evaluate(RandomizedRunner.java:902)
	at app//org.apache.lucene.tests.util.AbstractBeforeAfterRule$1.evaluate(AbstractBeforeAfterRule.java:43)
	at app//com.carrotsearch.randomizedtesting.rules.StatementAdapter.evaluate(StatementAdapter.java:36)
	at app//org.apache.lucene.tests.util.TestRuleStoreClassName$1.evaluate(TestRuleStoreClassName.java:38)
	at app//com.carrotsearch.randomizedtesting.rules.NoShadowingOrOverridesOnMethodsRule$1.evaluate(NoShadowingOrOverridesOnMethodsRule.java:40)
	at app//com.carrotsearch.randomizedtesting.rules.NoShadowingOrOverridesOnMethodsRule$1.evaluate(NoShadowingOrOverridesOnMethodsRule.java:40)
	at app//com.carrotsearch.randomizedtesting.rules.StatementAdapter.evaluate(StatementAdapter.java:36)
	at app//com.carrotsearch.randomizedtesting.rules.StatementAdapter.evaluate(StatementAdapter.java:36)
	at app//org.apache.lucene.tests.util.TestRuleAssertionsRequired$1.evaluate(TestRuleAssertionsRequired.java:53)
	at app//org.apache.lucene.tests.util.AbstractBeforeAfterRule$1.evaluate(AbstractBeforeAfterRule.java:43)
	at app//org.apache.lucene.tests.util.TestRuleMarkFailure$1.evaluate(TestRuleMarkFailure.java:44)
	at app//org.apache.lucene.tests.util.TestRuleIgnoreAfterMaxFailures$1.evaluate(TestRuleIgnoreAfterMaxFailures.java:60)
	at app//org.apache.lucene.tests.util.TestRuleIgnoreTestSuites$1.evaluate(TestRuleIgnoreTestSuites.java:47)
	at app//org.junit.rules.RunRules.evaluate(RunRules.java:20)
	at app//com.carrotsearch.randomizedtesting.rules.StatementAdapter.evaluate(StatementAdapter.java:36)
	at app//com.carrotsearch.randomizedtesting.ThreadLeakControl$StatementRunner.run(ThreadLeakControl.java:390)
	at app//com.carrotsearch.randomizedtesting.ThreadLeakControl.lambda$forkTimeoutingTask$0(ThreadLeakControl.java:850)
	at java.base@24/java.lang.Thread.run(Thread.java:1447)
Caused by: java.nio.file.FileSystemException: /home/jenkins/workspace/Lucene-nightly-main-Linux/lucene/core/build/tests-tmp/lucene.search.TestLiveFieldValues_D42BE6085CEAD87D-001/livefieldupdates-001/_xe.fdm: Too many open files
	at org.apache.lucene.tests.mockfile.HandleLimitFS.onOpen(HandleLimitFS.java:67)
	at org.apache.lucene.tests.mockfile.HandleTrackingFS.callOpenHook(HandleTrackingFS.java:82)
	at org.apache.lucene.tests.mockfile.HandleTrackingFS.newOutputStream(HandleTrackingFS.java:163)
	at org.apache.lucene.tests.mockfile.HandleTrackingFS.newOutputStream(HandleTrackingFS.java:132)
	at org.apache.lucene.tests.mockfile.FilterFileSystemProvider.newOutputStream(FilterFileSystemProvider.java:200)
	at java.base/java.nio.file.Files.newOutputStream(Files.java:215)
	at org.apache.lucene.store.FSDirectory$FSIndexOutput.<init>(FSDirectory.java:389)
	at org.apache.lucene.store.FSDirectory$FSIndexOutput.<init>(FSDirectory.java:382)
	at org.apache.lucene.store.FSDirectory.createOutput(FSDirectory.java:215)
	at org.apache.lucene.tests.store.MockDirectoryWrapper.createOutput(MockDirectoryWrapper.java:718)
	at org.apache.lucene.store.LockValidatingDirectoryWrapper.createOutput(LockValidatingDirectoryWrapper.java:43)
	at org.apache.lucene.store.TrackingDirectoryWrapper.createOutput(TrackingDirectoryWrapper.java:41)
	at org.apache.lucene.codecs.lucene90.compressing.Lucene90CompressingStoredFieldsWriter.<init>(Lucene90CompressingStoredFieldsWriter.java:129)
	at org.apache.lucene.codecs.lucene90.compressing.Lucene90CompressingStoredFieldsFormat.fieldsWriter(Lucene90CompressingStoredFieldsFormat.java:140)
	at org.apache.lucene.codecs.lucene90.Lucene90StoredFieldsFormat.fieldsWriter(Lucene90StoredFieldsFormat.java:154)
	at org.apache.lucene.index.StoredFieldsConsumer.initStoredFieldsWriter(StoredFieldsConsumer.java:50)
	at org.apache.lucene.index.StoredFieldsConsumer.startDocument(StoredFieldsConsumer.java:57)
	at org.apache.lucene.index.IndexingChain.startStoredFields(IndexingChain.java:536)
	at org.apache.lucene.index.IndexingChain.processDocument(IndexingChain.java:567)
	at org.apache.lucene.index.DocumentsWriterPerThread.updateDocuments(DocumentsWriterPerThread.java:274)
	at org.apache.lucene.index.DocumentsWriter.updateDocuments(DocumentsWriter.java:427)
	at org.apache.lucene.index.IndexWriter.updateDocuments(IndexWriter.java:1563)
	at org.apache.lucene.index.IndexWriter.updateDocument(IndexWriter.java:1845)
	at org.apache.lucene.search.TestLiveFieldValues$3.run(TestLiveFieldValues.java:117)