You are viewing a plain text version of this content. The canonical link for it is here.
Posted to builds@beam.apache.org by Apache Jenkins Server <je...@builds.apache.org> on 2021/11/16 19:48:57 UTC
Build failed in Jenkins: beam_PostCommit_Java_DataflowV2 #914
See <https://ci-beam.apache.org/job/beam_PostCommit_Java_DataflowV2/914/display/redirect?page=changes>
Changes:
[noreply] [BEAM-3293] Finish E2E implementation of MultiMap side inputs, add
------------------------------------------
[...truncated 37.43 KB...]
> Task :runners:core-construction-java:compileJava FROM-CACHE
> Task :runners:core-construction-java:classes UP-TO-DATE
> Task :runners:core-construction-java:jar
> Task :runners:core-java:compileJava FROM-CACHE
> Task :runners:core-java:classes UP-TO-DATE
> Task :runners:core-java:jar
> Task :sdks:java:core:compileTestJava FROM-CACHE
> Task :sdks:java:core:testClasses
> Task :sdks:java:extensions:google-cloud-platform-core:compileJava FROM-CACHE
> Task :sdks:java:extensions:google-cloud-platform-core:classes UP-TO-DATE
> Task :sdks:java:extensions:google-cloud-platform-core:jar
> Task :sdks:java:core:shadowTestJar FROM-CACHE
> Task :sdks:java:harness:compileJava FROM-CACHE
> Task :sdks:java:harness:classes UP-TO-DATE
> Task :sdks:java:harness:jar
> Task :sdks:java:extensions:google-cloud-platform-core:compileTestJava FROM-CACHE
> Task :sdks:java:extensions:google-cloud-platform-core:testClasses UP-TO-DATE
> Task :sdks:java:extensions:google-cloud-platform-core:testJar
> Task :sdks:java:extensions:protobuf:extractIncludeTestProto
> Task :sdks:java:extensions:protobuf:generateTestProto FROM-CACHE
> Task :sdks:java:extensions:protobuf:compileTestJava FROM-CACHE
> Task :sdks:java:extensions:protobuf:testClasses
> Task :sdks:java:extensions:protobuf:testJar
> Task :sdks:java:harness:shadowJar FROM-CACHE
> Task :sdks:java:container:buildLinuxAmd64
> Task :sdks:java:container:goBuild
> Task :sdks:java:container:java8:copySdkHarnessLauncher
> Task :sdks:java:container:generateLicenseReport
> Task :runners:java-fn-execution:compileJava FROM-CACHE
> Task :runners:java-fn-execution:classes UP-TO-DATE
> Task :runners:java-fn-execution:jar
> Task :sdks:java:expansion-service:compileJava FROM-CACHE
> Task :sdks:java:expansion-service:classes UP-TO-DATE
> Task :sdks:java:expansion-service:jar
> Task :runners:direct-java:compileJava FROM-CACHE
> Task :runners:direct-java:classes UP-TO-DATE
> Task :sdks:java:io:kafka:compileJava FROM-CACHE
> Task :sdks:java:io:kafka:classes UP-TO-DATE
> Task :sdks:java:extensions:ml:compileJava FROM-CACHE
> Task :sdks:java:extensions:ml:classes UP-TO-DATE
> Task :runners:direct-java:shadowJar FROM-CACHE
> Task :sdks:java:io:kafka:jar
> Task :sdks:java:extensions:ml:jar
> Task :sdks:java:io:google-cloud-platform:compileJava FROM-CACHE
> Task :sdks:java:io:google-cloud-platform:classes UP-TO-DATE
> Task :sdks:java:io:google-cloud-platform:jar
> Task :runners:google-cloud-dataflow-java:compileJava FROM-CACHE
> Task :runners:google-cloud-dataflow-java:classes
> Task :sdks:java:container:java8:copyDockerfileDependencies
> Task :runners:google-cloud-dataflow-java:jar
> Task :examples:java:compileJava FROM-CACHE
> Task :examples:java:classes UP-TO-DATE
> Task :examples:java:jar
> Task :sdks:java:io:google-cloud-platform:compileTestJava FROM-CACHE
> Task :sdks:java:io:google-cloud-platform:testClasses
> Task :examples:java:compileTestJava FROM-CACHE
> Task :examples:java:testClasses
> Task :examples:java:testJar
> Task :sdks:java:io:google-cloud-platform:testJar
> Task :sdks:java:container:pullLicenses
DEPRECATION: Python 3.5 reached the end of its life on September 13th, 2020. Please upgrade your Python as Python 3.5 is no longer maintained. pip 21.0 will drop support for Python 3.5 in January 2021. pip 21.0 will remove support for this functionality.
INFO:root:Pulling license for 209 dependencies using 16 threads.
INFO:root:pull_licenses_java.py succeed. It took 4.703122 seconds with 16 threads.
> Task :sdks:java:container:java8:copyJavaThirdPartyLicenses
> Task :release:go-licenses:java:dockerRun
+ go-licenses save github.com/apache/beam/sdks/java/container --save_path=/output/licenses
+ tee /output/licenses/list.csv
+ go-licenses csv github.com/apache/beam/sdks/java/container
+ chmod -R a+w /output/licenses
> Task :release:go-licenses:java:createLicenses
> Task :sdks:java:container:java8:copyGolangLicenses
> Task :sdks:java:container:java8:dockerPrepare
> Task :sdks:java:container:java8:docker
> Task :runners:google-cloud-dataflow-java:buildAndPushDockerContainer
WARNING: `gcloud docker` will not be supported for Docker client versions above 18.03.
As an alternative, use `gcloud auth configure-docker` to configure `docker` to
use `gcloud` as a credential helper, then use `docker` as you would for non-GCR
registries, e.g. `docker pull gcr.io/project-id/my-image`. Add
`--verbosity=error` to silence this warning: `gcloud docker
--verbosity=error -- pull gcr.io/project-id/my-image`.
See: https://cloud.google.com/container-registry/docs/support/deprecation-notices#gcloud-docker
The push refers to repository [us.gcr.io/apache-beam-testing/java-postcommit-it/java]
0332ef3bb192: Preparing
756ae9ba71fd: Preparing
b1ce58f785f4: Preparing
54effd0fce30: Preparing
94c281a2006e: Preparing
b98b84c68df6: Preparing
ee967e5b445f: Preparing
50e0c785f58d: Preparing
f9e74d7e1883: Preparing
c23bca69432c: Preparing
238eee249584: Preparing
35b2e5cbc190: Preparing
ebf469e844a6: Preparing
94c94d3b2e6b: Preparing
36e0782f1159: Preparing
ba6e5ff31f23: Preparing
9f9f651e9303: Preparing
0b3c02b5d746: Preparing
62a747bf1719: Preparing
f9e74d7e1883: Waiting
c23bca69432c: Waiting
ee967e5b445f: Waiting
238eee249584: Waiting
ba6e5ff31f23: Waiting
94c94d3b2e6b: Waiting
62a747bf1719: Waiting
9f9f651e9303: Waiting
36e0782f1159: Waiting
0b3c02b5d746: Waiting
35b2e5cbc190: Waiting
50e0c785f58d: Waiting
ebf469e844a6: Waiting
b98b84c68df6: Waiting
94c281a2006e: Pushed
54effd0fce30: Pushed
b1ce58f785f4: Pushed
756ae9ba71fd: Pushed
0332ef3bb192: Pushed
f9e74d7e1883: Pushed
b98b84c68df6: Pushed
ee967e5b445f: Pushed
50e0c785f58d: Pushed
ebf469e844a6: Layer already exists
94c94d3b2e6b: Layer already exists
36e0782f1159: Layer already exists
ba6e5ff31f23: Layer already exists
9f9f651e9303: Layer already exists
0b3c02b5d746: Layer already exists
62a747bf1719: Layer already exists
35b2e5cbc190: Pushed
238eee249584: Pushed
c23bca69432c: Pushed
20211116180101: digest: sha256:61e48c43cd4128fc0eca1675d52f3138c0ed6726099d54cd6d1d79cc42fb3117 size: 4311
> Task :runners:google-cloud-dataflow-java:coreSDKJavaRunnerV2IntegrationTest NO-SOURCE
> Task :runners:google-cloud-dataflow-java:examplesJavaRunnerV2IntegrationTest
***********************************************************
***********************************************************
**********************Set Up Pubsub************************
The Pub/Sub topic has been set up for this example: projects/apache-beam-testing/topics/testpipeline-jenkins-1116180439-d7226054
The Pub/Sub subscription has been set up for this example: projects/apache-beam-testing/subscriptions/testpipeline-jenkins-1116180439-d7226054
******************Set Up Big Query Table*******************
The BigQuery table has been set up for this example: apache-beam-testing:traffic_routes_1637085872153.traffic_routes_table
*************************Tear Down*************************
The Pub/Sub topic has been deleted: projects/apache-beam-testing/topics/testpipeline-jenkins-1116180439-d7226054
The Pub/Sub subscription has been deleted: projects/apache-beam-testing/subscriptions/testpipeline-jenkins-1116180439-d7226054
The BigQuery table might contain the example's output, and it is not deleted automatically: apache-beam-testing:traffic_routes_1637085872153.traffic_routes_table
Please go to the Developers Console to delete it manually. Otherwise, you may be charged for its usage.
***********************************************************
***********************************************************
***********************************************************
***********************************************************
**********************Set Up Pubsub************************
The Pub/Sub topic has been set up for this example: projects/apache-beam-testing/topics/testpipeline-jenkins-1116182926-dc61b6a5
The Pub/Sub subscription has been set up for this example: projects/apache-beam-testing/subscriptions/testpipeline-jenkins-1116182926-dc61b6a5
******************Set Up Big Query Table*******************
The BigQuery table has been set up for this example: apache-beam-testing:traffic_max_lane_flow_1637087365434.traffic_max_lane_flow_table
*************************Tear Down*************************
The Pub/Sub topic has been deleted: projects/apache-beam-testing/topics/testpipeline-jenkins-1116182926-dc61b6a5
The Pub/Sub subscription has been deleted: projects/apache-beam-testing/subscriptions/testpipeline-jenkins-1116182926-dc61b6a5
The BigQuery table might contain the example's output, and it is not deleted automatically: apache-beam-testing:traffic_max_lane_flow_1637087365434.traffic_max_lane_flow_table
Please go to the Developers Console to delete it manually. Otherwise, you may be charged for its usage.
***********************************************************
***********************************************************
> Task :runners:google-cloud-dataflow-java:googleCloudPlatformRunnerV2IntegrationTest
org.apache.beam.sdk.io.gcp.pubsublite.ReadWriteIT > testReadWrite FAILED
java.lang.AssertionError at ReadWriteIT.java:261
38 tests completed, 1 failed, 1 skipped
> Task :runners:google-cloud-dataflow-java:googleCloudPlatformRunnerV2IntegrationTest FAILED
> Task :runners:google-cloud-dataflow-java:cleanUpDockerImages
Untagged: us.gcr.io/apache-beam-testing/java-postcommit-it/java:20211116180101
Untagged: us.gcr.io/apache-beam-testing/java-postcommit-it/java@sha256:61e48c43cd4128fc0eca1675d52f3138c0ed6726099d54cd6d1d79cc42fb3117
Deleted: sha256:1c1de2023e837315c0c00b410aa038dc1f120758bf4e89e8ee99b576b203a740
Deleted: sha256:016dd3c736e605050a4561e8a837553428be754ccb80e37d5b830d1302c1b288
Deleted: sha256:6f18d60ed7adcf3219e521b84cedf576f6670c911e1f7f6be559bbd6148dc9b8
Deleted: sha256:002963ae3a5376ca45b02bbcbe1998743356f9f89870f7f8a9bff06a972ebefe
Deleted: sha256:d45ffbf52b5d7b471625de2beed5b4427a62a2229fcc5871d57c19035add0c3d
Deleted: sha256:2c978fee92e6d869b1b3dac198e28e614979c425898fb4ecf0353a9edeb20b7b
Deleted: sha256:4e4a05495fb6bf7a561e755d5a74995e3cd88125ee53d9c54c5a994a8caa52fb
Deleted: sha256:d08e36979f9d0bfe1382a1f51898ef469160d50d7f0efb0418a6d91e725754cb
Deleted: sha256:1637f2ef643849bc9b7c7068746cc3dded0a511437eda181149ad467030083d1
Deleted: sha256:3e40fabe726cd01fb3bc453bd245926b29a9c02daa3a62dd474ef1c55eda4e67
Deleted: sha256:1b18cbd9f1dfe2ef7b66b7d75450ec62037b1db026b9deb8c0c023f72bae5791
Deleted: sha256:f5c28a7301ddcee0aa58b23fa28f7019996108c3072c6e143ca88245e78e5c0e
Deleted: sha256:bd6c650f14aa12e6549fe95d9b3e813cad468899a48b862493ddb005a9e0f904
Deleted: sha256:42b64f54cc33f8adcfd3fc3a4404aa4ac00dd38aed0c184762bde21a7de50b43
Deleted: sha256:97b8918f5ee778d7953a52d38c4022f0f79e88a39cdb3c4909b0c97d56791a75
Deleted: sha256:2e0f2fc58814a3605dd7acee0b55eeb73590f42625305636f1cf589b359bb089
Deleted: sha256:a67bd37b651ad1ea32804db08c3fca936fa354b0d0e7be3e4c46d102294f1ae4
Deleted: sha256:80106c04b19ef7eee43243e0ee2ae43b560b6661ebeaa4a5dbf4802c730696ce
Deleted: sha256:9343715b7326545bb2386623564f5aa42c07cd382ea784e8738562559d9aa133
Deleted: sha256:2c90a2f6d74b82944d265e91b270687a53a456cae2c4088c046e70d8f0cd9afa
Deleted: sha256:e2a21f1a35a521e1e5623470bceb71c8944351b6899ace9db4a358a1080861a8
Deleted: sha256:17a19320f6c766e562ec85f280a09117499ab410bf60056479a37d1e33767005
Deleted: sha256:c38211c88d2f6326fd1863cdb3c6a24d028e6dd042445ec530c15c6619becf44
Deleted: sha256:fde7e3f7f149e7b86650dae32c7bf55f2576edfa138597d68cbc6701f48d36a5
Deleted: sha256:7471563b0819905a1545675b28431d4e0bba7f2d6430ceaa5e315929f1781c00
Deleted: sha256:d88201e075e6ed0d9727d813116a5ef7b4edc0f57fdbf2065de43904dc2143df
Deleted: sha256:64b4e32743c252c3ad0906eb2eee0c010dc2466a05516cd16613ec7be6cc8911
Deleted: sha256:2a8fef05e8f78262a875b10b68f16090e1a715795b3769ac072ef8d8b7acb277
Tag: [us.gcr.io/apache-beam-testing/java-postcommit-it/java:20211116180101]
- referencing digest: [us.gcr.io/apache-beam-testing/java-postcommit-it/java@sha256:61e48c43cd4128fc0eca1675d52f3138c0ed6726099d54cd6d1d79cc42fb3117]
Deleted [[us.gcr.io/apache-beam-testing/java-postcommit-it/java:20211116180101] (referencing [us.gcr.io/apache-beam-testing/java-postcommit-it/java@sha256:61e48c43cd4128fc0eca1675d52f3138c0ed6726099d54cd6d1d79cc42fb3117])].
Removing untagged image us.gcr.io/apache-beam-testing/java-postcommit-it/java@sha256:61e48c43cd4128fc0eca1675d52f3138c0ed6726099d54cd6d1d79cc42fb3117
Digests:
- us.gcr.io/apache-beam-testing/java-postcommit-it/java@sha256:61e48c43cd4128fc0eca1675d52f3138c0ed6726099d54cd6d1d79cc42fb3117
Deleted [us.gcr.io/apache-beam-testing/java-postcommit-it/java@sha256:61e48c43cd4128fc0eca1675d52f3138c0ed6726099d54cd6d1d79cc42fb3117].
FAILURE: Build failed with an exception.
* What went wrong:
Execution failed for task ':runners:google-cloud-dataflow-java:googleCloudPlatformRunnerV2IntegrationTest'.
> There were failing tests. See the report at: file://<https://ci-beam.apache.org/job/beam_PostCommit_Java_DataflowV2/ws/src/runners/google-cloud-dataflow-java/build/reports/tests/googleCloudPlatformRunnerV2IntegrationTest/index.html>
* Try:
Run with --stacktrace option to get the stack trace. Run with --info or --debug option to get more log output. Run with --scan to get full insights.
* Get more help at https://help.gradle.org
Deprecated Gradle features were used in this build, making it incompatible with Gradle 7.0.
Use '--warning-mode all' to show the individual deprecation warnings.
See https://docs.gradle.org/6.9.1/userguide/command_line_interface.html#sec:command_line_warnings
BUILD FAILED in 1h 48m 24s
129 actionable tasks: 87 executed, 40 from cache, 2 up-to-date
Publishing build scan...
https://gradle.com/s/dvt4nphf2xtku
Build step 'Invoke Gradle script' changed build result to FAILURE
Build step 'Invoke Gradle script' marked build as failure
---------------------------------------------------------------------
To unsubscribe, e-mail: builds-unsubscribe@beam.apache.org
For additional commands, e-mail: builds-help@beam.apache.org
Jenkins build is back to normal : beam_PostCommit_Java_DataflowV2 #915
Posted by Apache Jenkins Server <je...@builds.apache.org>.
See <https://ci-beam.apache.org/job/beam_PostCommit_Java_DataflowV2/915/display/redirect?page=changes>
---------------------------------------------------------------------
To unsubscribe, e-mail: builds-unsubscribe@beam.apache.org
For additional commands, e-mail: builds-help@beam.apache.org