You are viewing a plain text version of this content. The canonical link for it is here.
Posted to builds@lucene.apache.org by Apache Jenkins Server <je...@builds.apache.org> on 2025/01/16 09:14:12 UTC
[JENKINS] Lucene » Lucene-NightlyTests-main - Build # 1543 - Unstable!
Build: https://ci-builds.apache.org/job/Lucene/job/Lucene-NightlyTests-main/1543/
2 tests failed.
FAILED: org.apache.lucene.misc.store.TestDirectIODirectory.testRandomByte
Error Message:
java.lang.Exception: Test abandoned because suite timeout was reached.
Stack Trace:
java.lang.Exception: Test abandoned because suite timeout was reached.
at __randomizedtesting.SeedInfo.seed([8F580F5900B09751]:0)
FAILED: org.apache.lucene.misc.store.TestDirectIODirectory.classMethod
Error Message:
java.lang.Exception: Suite timeout exceeded (>= 7200000 msec).
Stack Trace:
java.lang.Exception: Suite timeout exceeded (>= 7200000 msec).
at __randomizedtesting.SeedInfo.seed([8F580F5900B09751]:0)
Build Log:
[...truncated 1134 lines...]
ERROR: The following test(s) have failed:
- org.apache.lucene.misc.store.TestDirectIODirectory.testRandomByte (:lucene:misc)
Test output: /home/jenkins/jenkins-slave/workspace/Lucene/Lucene-NightlyTests-main/checkout/lucene/misc/build/test-results/test/outputs/OUTPUT-org.apache.lucene.misc.store.TestDirectIODirectory.txt
Reproduce with: gradlew :lucene:misc:test --tests "org.apache.lucene.misc.store.TestDirectIODirectory.testRandomByte" -Ptests.jvms=4 -Ptests.jvmargs= -Ptests.seed=8F580F5900B09751 -Ptests.multiplier=2 -Ptests.nightly=true -Ptests.gui=true -Ptests.file.encoding=US-ASCII -Ptests.linedocsfile=/home/jenkins/jenkins-slave/workspace/Lucene/Lucene-NightlyTests-main/test-data/enwiki.random.lines.txt -Ptests.vectorsize=128 -Ptests.forceintegervectors=true
- org.apache.lucene.misc.store.TestDirectIODirectory.classMethod (:lucene:misc)
Test output: /home/jenkins/jenkins-slave/workspace/Lucene/Lucene-NightlyTests-main/checkout/lucene/misc/build/test-results/test/outputs/OUTPUT-org.apache.lucene.misc.store.TestDirectIODirectory.txt
Reproduce with: gradlew :lucene:misc:test --tests "org.apache.lucene.misc.store.TestDirectIODirectory.classMethod" -Ptests.jvms=4 -Ptests.jvmargs= -Ptests.seed=8F580F5900B09751 -Ptests.multiplier=2 -Ptests.nightly=true -Ptests.gui=true -Ptests.file.encoding=US-ASCII -Ptests.linedocsfile=/home/jenkins/jenkins-slave/workspace/Lucene/Lucene-NightlyTests-main/test-data/enwiki.random.lines.txt -Ptests.vectorsize=128 -Ptests.forceintegervectors=true
Deprecated Gradle features were used in this build, making it incompatible with Gradle 9.0.
You can use '--warning-mode all' to show the individual deprecation warnings and determine if they come from your own scripts or plugins.
For more on this, please refer to https://docs.gradle.org/8.10/userguide/command_line_interface.html#sec:command_line_warnings in the Gradle documentation.
BUILD SUCCESSFUL in 4h 18m 31s
246 actionable tasks: 185 executed, 61 up-to-date
Publishing build scan...
The Develocity server (develocity.apache.org) rejected the access key with prefix 'eyJraWQiOiJhdXRoLWtleS1pZC03Mjk5ZDhkZi1mNjA2LTQ5NmUtYTkzMy04OWQ4NTdhZWRhOWEiLCJhbGciOiJSUzI1NiIsInR5cCI6IkpXVCJ9.eyJpc19hbm9ueW1vdXMiOmZhbHNlLCJwZXJtaXNzaW9ucyI6WyJWSUVXX1NDQU4iLCJFWFBPUlRfREFUQSIsIlBVQkxJU0hfU0NBTiIsIlBSRURJQ1RJVkVfVEVTVF9TRUxFQ1RJT04iLCJSRUFEX0NBQ0hFIiwiQUNDRVNTX0FMTF9EQVRBIiwiQUNDRVNTX0RBVEFfV0lUSE9VVF9BU1NPQ0lBVEVEX1BST0pFQ1QiLCJNWV9TRVRUSU5HUyIsIlJFQURfVkVSU0lPTiJdLCJhbGxEYXRhUGVybWlzc2lvbnMiOlsiVklFV19TQ0FOIiwiUFJFRElDVElWRV9URVNUX1NFTEVDVElPTiIsIlJFQURfQ0FDSEUiLCJBQ0NFU1NfQUxMX0RBVEEiLCJBQ0NFU1NfREFUQV9XSVRIT1VUX0FTU09DSUFURURfUFJPSkVDVCIsIkVYUE9SVF9EQVRBIiwiUFVCTElTSF9TQ0FOIiwiTVlfU0VUVElOR1MiLCJSRUFEX1ZFUlNJT04iXSwicHJvamVjdHMiOnt9LCJ'.
Your access key has expired - please visit https://develocity.apache.org/settings/access-keys to refresh it.
Build step 'Invoke Gradle script' changed build result to SUCCESS
Archiving artifacts
‘**/*.events’ doesn’t match anything: ‘**’ exists but not ‘**/*.events’
No artifacts found that match the file pattern "**/*.events,heapdumps/**,**/hs_err_pid*". Configuration error?
Recording test results
[Checks API] No suitable checks publisher found.
Build step 'Publish JUnit test result report' changed build result to UNSTABLE
Email was triggered for: Unstable (Test Failures)
Sending email for trigger: Unstable (Test Failures)
[JENKINS] Lucene » Lucene-NightlyTests-main - Build # 1544 - Still Unstable!
Posted by Apache Jenkins Server <je...@builds.apache.org>.
Build: https://ci-builds.apache.org/job/Lucene/job/Lucene-NightlyTests-main/1544/
3 tests failed.
FAILED: org.apache.lucene.search.TestLatLonPointQueries.testRandomDistanceHuge
Error Message:
java.lang.IllegalArgumentException: cost must be >= 0, got -5
Stack Trace:
java.lang.IllegalArgumentException: cost must be >= 0, got -5
at __randomizedtesting.SeedInfo.seed([2DCACEECD36E781F:4CCBDC6918EF4259]:0)
at org.apache.lucene.util.BitSetIterator.<init>(BitSetIterator.java:61)
at org.apache.lucene.document.LatLonPointDistanceQuery$1$1.get(LatLonPointDistanceQuery.java:157)
at org.apache.lucene.search.ScorerSupplier.bulkScorer(ScorerSupplier.java:45)
at org.apache.lucene.search.LRUQueryCache$CachingWrapperWeight$1.get(LRUQueryCache.java:777)
at org.apache.lucene.search.ScorerSupplier.bulkScorer(ScorerSupplier.java:45)
at org.apache.lucene.tests.search.AssertingWeight$1.bulkScorer(AssertingWeight.java:90)
at org.apache.lucene.search.LRUQueryCache$CachingWrapperWeight$1.get(LRUQueryCache.java:777)
at org.apache.lucene.search.ScorerSupplier.bulkScorer(ScorerSupplier.java:45)
at org.apache.lucene.tests.search.AssertingWeight$1.bulkScorer(AssertingWeight.java:90)
at org.apache.lucene.search.IndexSearcher.searchLeaf(IndexSearcher.java:843)
at org.apache.lucene.search.IndexSearcher.search(IndexSearcher.java:810)
at org.apache.lucene.tests.search.AssertingIndexSearcher.search(AssertingIndexSearcher.java:77)
at org.apache.lucene.search.IndexSearcher.lambda$search$1(IndexSearcher.java:780)
at java.base/java.util.concurrent.FutureTask.run(FutureTask.java:317)
at org.apache.lucene.search.TaskExecutor$Task.run(TaskExecutor.java:173)
at org.apache.lucene.search.TaskExecutor.invokeAll(TaskExecutor.java:111)
at org.apache.lucene.search.IndexSearcher.search(IndexSearcher.java:784)
at org.apache.lucene.search.IndexSearcher.search(IndexSearcher.java:751)
at org.apache.lucene.search.IndexSearcher.searchAfter(IndexSearcher.java:731)
at org.apache.lucene.search.IndexSearcher.search(IndexSearcher.java:674)
at org.apache.lucene.tests.geo.BaseGeoPointTestCase.doRandomDistanceTest(BaseGeoPointTestCase.java:1511)
at org.apache.lucene.tests.geo.BaseGeoPointTestCase.testRandomDistanceHuge(BaseGeoPointTestCase.java:1445)
at java.base/jdk.internal.reflect.DirectMethodHandleAccessor.invoke(DirectMethodHandleAccessor.java:103)
at java.base/java.lang.reflect.Method.invoke(Method.java:580)
at com.carrotsearch.randomizedtesting.RandomizedRunner.invoke(RandomizedRunner.java:1758)
at com.carrotsearch.randomizedtesting.RandomizedRunner$8.evaluate(RandomizedRunner.java:946)
at com.carrotsearch.randomizedtesting.RandomizedRunner$9.evaluate(RandomizedRunner.java:982)
at com.carrotsearch.randomizedtesting.RandomizedRunner$10.evaluate(RandomizedRunner.java:996)
at org.apache.lucene.tests.util.TestRuleSetupTeardownChained$1.evaluate(TestRuleSetupTeardownChained.java:48)
at org.apache.lucene.tests.util.AbstractBeforeAfterRule$1.evaluate(AbstractBeforeAfterRule.java:43)
at org.apache.lucene.tests.util.TestRuleThreadAndTestName$1.evaluate(TestRuleThreadAndTestName.java:45)
at org.apache.lucene.tests.util.TestRuleIgnoreAfterMaxFailures$1.evaluate(TestRuleIgnoreAfterMaxFailures.java:60)
at org.apache.lucene.tests.util.TestRuleMarkFailure$1.evaluate(TestRuleMarkFailure.java:44)
at org.junit.rules.RunRules.evaluate(RunRules.java:20)
at com.carrotsearch.randomizedtesting.rules.StatementAdapter.evaluate(StatementAdapter.java:36)
at com.carrotsearch.randomizedtesting.ThreadLeakControl$StatementRunner.run(ThreadLeakControl.java:390)
at com.carrotsearch.randomizedtesting.ThreadLeakControl.forkTimeoutingTask(ThreadLeakControl.java:843)
at com.carrotsearch.randomizedtesting.ThreadLeakControl$3.evaluate(ThreadLeakControl.java:490)
at com.carrotsearch.randomizedtesting.RandomizedRunner.runSingleTest(RandomizedRunner.java:955)
at com.carrotsearch.randomizedtesting.RandomizedRunner$5.evaluate(RandomizedRunner.java:840)
at com.carrotsearch.randomizedtesting.RandomizedRunner$6.evaluate(RandomizedRunner.java:891)
at com.carrotsearch.randomizedtesting.RandomizedRunner$7.evaluate(RandomizedRunner.java:902)
at org.apache.lucene.tests.util.AbstractBeforeAfterRule$1.evaluate(AbstractBeforeAfterRule.java:43)
at com.carrotsearch.randomizedtesting.rules.StatementAdapter.evaluate(StatementAdapter.java:36)
at org.apache.lucene.tests.util.TestRuleStoreClassName$1.evaluate(TestRuleStoreClassName.java:38)
at com.carrotsearch.randomizedtesting.rules.NoShadowingOrOverridesOnMethodsRule$1.evaluate(NoShadowingOrOverridesOnMethodsRule.java:40)
at com.carrotsearch.randomizedtesting.rules.NoShadowingOrOverridesOnMethodsRule$1.evaluate(NoShadowingOrOverridesOnMethodsRule.java:40)
at com.carrotsearch.randomizedtesting.rules.StatementAdapter.evaluate(StatementAdapter.java:36)
at com.carrotsearch.randomizedtesting.rules.StatementAdapter.evaluate(StatementAdapter.java:36)
at org.apache.lucene.tests.util.TestRuleAssertionsRequired$1.evaluate(TestRuleAssertionsRequired.java:53)
at org.apache.lucene.tests.util.AbstractBeforeAfterRule$1.evaluate(AbstractBeforeAfterRule.java:43)
at org.apache.lucene.tests.util.TestRuleMarkFailure$1.evaluate(TestRuleMarkFailure.java:44)
at org.apache.lucene.tests.util.TestRuleIgnoreAfterMaxFailures$1.evaluate(TestRuleIgnoreAfterMaxFailures.java:60)
at org.apache.lucene.tests.util.TestRuleIgnoreTestSuites$1.evaluate(TestRuleIgnoreTestSuites.java:47)
at org.junit.rules.RunRules.evaluate(RunRules.java:20)
at com.carrotsearch.randomizedtesting.rules.StatementAdapter.evaluate(StatementAdapter.java:36)
at com.carrotsearch.randomizedtesting.ThreadLeakControl$StatementRunner.run(ThreadLeakControl.java:390)
at com.carrotsearch.randomizedtesting.ThreadLeakControl.lambda$forkTimeoutingTask$0(ThreadLeakControl.java:850)
at java.base/java.lang.Thread.run(Thread.java:1583)
FAILED: org.apache.lucene.misc.store.TestDirectIODirectory.testRandomByte
Error Message:
java.lang.Exception: Test abandoned because suite timeout was reached.
Stack Trace:
java.lang.Exception: Test abandoned because suite timeout was reached.
at __randomizedtesting.SeedInfo.seed([2DCACEECD36E781F]:0)
FAILED: org.apache.lucene.misc.store.TestDirectIODirectory.classMethod
Error Message:
java.lang.Exception: Suite timeout exceeded (>= 7200000 msec).
Stack Trace:
java.lang.Exception: Suite timeout exceeded (>= 7200000 msec).
at __randomizedtesting.SeedInfo.seed([2DCACEECD36E781F]:0)
Build Log:
[...truncated 1269 lines...]
ERROR: The following test(s) have failed:
- org.apache.lucene.misc.store.TestDirectIODirectory.testRandomByte (:lucene:misc)
Test output: /home/jenkins/jenkins-slave/workspace/Lucene/Lucene-NightlyTests-main/checkout/lucene/misc/build/test-results/test/outputs/OUTPUT-org.apache.lucene.misc.store.TestDirectIODirectory.txt
Reproduce with: gradlew :lucene:misc:test --tests "org.apache.lucene.misc.store.TestDirectIODirectory.testRandomByte" -Ptests.jvms=4 -Ptests.jvmargs= -Ptests.seed=2DCACEECD36E781F -Ptests.multiplier=2 -Ptests.nightly=true -Ptests.gui=true -Ptests.file.encoding=US-ASCII -Ptests.linedocsfile=/home/jenkins/jenkins-slave/workspace/Lucene/Lucene-NightlyTests-main/test-data/enwiki.random.lines.txt -Ptests.vectorsize=128 -Ptests.forceintegervectors=true
- org.apache.lucene.misc.store.TestDirectIODirectory.classMethod (:lucene:misc)
Test output: /home/jenkins/jenkins-slave/workspace/Lucene/Lucene-NightlyTests-main/checkout/lucene/misc/build/test-results/test/outputs/OUTPUT-org.apache.lucene.misc.store.TestDirectIODirectory.txt
Reproduce with: gradlew :lucene:misc:test --tests "org.apache.lucene.misc.store.TestDirectIODirectory.classMethod" -Ptests.jvms=4 -Ptests.jvmargs= -Ptests.seed=2DCACEECD36E781F -Ptests.multiplier=2 -Ptests.nightly=true -Ptests.gui=true -Ptests.file.encoding=US-ASCII -Ptests.linedocsfile=/home/jenkins/jenkins-slave/workspace/Lucene/Lucene-NightlyTests-main/test-data/enwiki.random.lines.txt -Ptests.vectorsize=128 -Ptests.forceintegervectors=true
- org.apache.lucene.search.TestLatLonPointQueries.testRandomDistanceHuge (:lucene:core)
Test output: /home/jenkins/jenkins-slave/workspace/Lucene/Lucene-NightlyTests-main/checkout/lucene/core/build/test-results/test/outputs/OUTPUT-org.apache.lucene.search.TestLatLonPointQueries.txt
Reproduce with: gradlew :lucene:core:test --tests "org.apache.lucene.search.TestLatLonPointQueries.testRandomDistanceHuge" -Ptests.jvms=4 -Ptests.jvmargs= -Ptests.seed=2DCACEECD36E781F -Ptests.multiplier=2 -Ptests.nightly=true -Ptests.gui=true -Ptests.file.encoding=US-ASCII -Ptests.linedocsfile=/home/jenkins/jenkins-slave/workspace/Lucene/Lucene-NightlyTests-main/test-data/enwiki.random.lines.txt -Ptests.vectorsize=128 -Ptests.forceintegervectors=true
Deprecated Gradle features were used in this build, making it incompatible with Gradle 9.0.
You can use '--warning-mode all' to show the individual deprecation warnings and determine if they come from your own scripts or plugins.
For more on this, please refer to https://docs.gradle.org/8.10/userguide/command_line_interface.html#sec:command_line_warnings in the Gradle documentation.
BUILD SUCCESSFUL in 4h 19m 49s
246 actionable tasks: 183 executed, 63 up-to-date
Publishing build scan...
The Develocity server (develocity.apache.org) rejected the access key with prefix 'eyJraWQiOiJhdXRoLWtleS1pZC03Mjk5ZDhkZi1mNjA2LTQ5NmUtYTkzMy04OWQ4NTdhZWRhOWEiLCJhbGciOiJSUzI1NiIsInR5cCI6IkpXVCJ9.eyJpc19hbm9ueW1vdXMiOmZhbHNlLCJwZXJtaXNzaW9ucyI6WyJWSUVXX1NDQU4iLCJFWFBPUlRfREFUQSIsIlBVQkxJU0hfU0NBTiIsIlBSRURJQ1RJVkVfVEVTVF9TRUxFQ1RJT04iLCJSRUFEX0NBQ0hFIiwiQUNDRVNTX0FMTF9EQVRBIiwiQUNDRVNTX0RBVEFfV0lUSE9VVF9BU1NPQ0lBVEVEX1BST0pFQ1QiLCJNWV9TRVRUSU5HUyIsIlJFQURfVkVSU0lPTiJdLCJhbGxEYXRhUGVybWlzc2lvbnMiOlsiVklFV19TQ0FOIiwiUFJFRElDVElWRV9URVNUX1NFTEVDVElPTiIsIlJFQURfQ0FDSEUiLCJBQ0NFU1NfQUxMX0RBVEEiLCJBQ0NFU1NfREFUQV9XSVRIT1VUX0FTU09DSUFURURfUFJPSkVDVCIsIkVYUE9SVF9EQVRBIiwiUFVCTElTSF9TQ0FOIiwiTVlfU0VUVElOR1MiLCJSRUFEX1ZFUlNJT04iXSwicHJvamVjdHMiOnt9LCJ'.
Your access key has expired - please visit https://develocity.apache.org/settings/access-keys to refresh it.
Build step 'Invoke Gradle script' changed build result to SUCCESS
Archiving artifacts
‘**/*.events’ doesn’t match anything: ‘**’ exists but not ‘**/*.events’
No artifacts found that match the file pattern "**/*.events,heapdumps/**,**/hs_err_pid*". Configuration error?
Recording test results
[Checks API] No suitable checks publisher found.
Build step 'Publish JUnit test result report' changed build result to UNSTABLE
Email was triggered for: Unstable (Test Failures)
Sending email for trigger: Unstable (Test Failures)