You are viewing a plain text version of this content. The canonical link for it is here.
Posted to builds@solr.apache.org by Apache Jenkins Server <je...@builds.apache.org> on 2026/01/10 03:13:51 UTC
[JENKINS] Solr » Solr-Test-9.x - Build # 10089 - Still Failing!
Build: https://ci-builds.apache.org/job/Solr/job/Solr-Test-9.x/10089/
All tests passed
Build Log:
[...truncated 444 lines...]
BUILD FAILED in 43m 42s
165 actionable tasks: 165 executed
Publishing build scan...
https://develocity.apache.org/s/3wxo3arymwfpa
Build step 'Invoke Gradle script' changed build result to FAILURE
Build step 'Invoke Gradle script' marked build as failure
Archiving artifacts
Recording test results
[Checks API] No suitable checks publisher found.
Email was triggered for: Failure - Any
Sending email for trigger: Failure - Any
[JENKINS] Solr » Solr-Test-9.x - Build # 10091 - Still Failing!
Posted by Apache Jenkins Server <je...@builds.apache.org>.
Build: https://ci-builds.apache.org/job/Solr/job/Solr-Test-9.x/10091/
All tests passed
Build Log:
[...truncated 444 lines...]
BUILD FAILED in 44m 28s
165 actionable tasks: 165 executed
Publishing build scan...
https://develocity.apache.org/s/swvobqoqdroau
Build step 'Invoke Gradle script' changed build result to FAILURE
Build step 'Invoke Gradle script' marked build as failure
Archiving artifacts
Recording test results
[Checks API] No suitable checks publisher found.
Email was triggered for: Failure - Any
Sending email for trigger: Failure - Any
[JENKINS] Solr » Solr-Test-9.x - Build # 10090 - Still Failing!
Posted by Apache Jenkins Server <je...@builds.apache.org>.
Build: https://ci-builds.apache.org/job/Solr/job/Solr-Test-9.x/10090/
All tests passed
Build Log:
[...truncated 445 lines...]
BUILD FAILED in 43m 28s
165 actionable tasks: 165 executed
Publishing build scan...
https://develocity.apache.org/s/bemdcnlzq6ft6
Build step 'Invoke Gradle script' changed build result to FAILURE
Build step 'Invoke Gradle script' marked build as failure
Archiving artifacts
Recording test results
[Checks API] No suitable checks publisher found.
Email was triggered for: Failure - Any
Sending email for trigger: Failure - Any