You are viewing a plain text version of this content. The canonical link for it is here.
Posted to dev@zookeeper.apache.org by Apache Jenkins Server <je...@builds.apache.org> on 2018/12/11 00:14:24 UTC
ZooKeeper-trunk - Build # 304 - Failure
See https://builds.apache.org/job/ZooKeeper-trunk/304/
###################################################################################
########################## LAST 60 LINES OF THE CONSOLE ###########################
[...truncated 178.28 KB...]
[junit] Running org.apache.zookeeper.test.SessionInvalidationTest in thread 4
[junit] Tests run: 1, Failures: 0, Errors: 0, Skipped: 0, Time elapsed: 0.734 sec, Thread: 4, Class: org.apache.zookeeper.test.SessionInvalidationTest
[junit] Running org.apache.zookeeper.test.SessionTest in thread 4
[junit] Tests run: 106, Failures: 0, Errors: 0, Skipped: 0, Time elapsed: 338.787 sec, Thread: 2, Class: org.apache.zookeeper.test.NettyNettySuiteTest
[junit] Running org.apache.zookeeper.test.SessionTimeoutTest in thread 2
[junit] Tests run: 4, Failures: 0, Errors: 0, Skipped: 0, Time elapsed: 1.66 sec, Thread: 2, Class: org.apache.zookeeper.test.SessionTimeoutTest
[junit] Running org.apache.zookeeper.test.SessionTrackerCheckTest in thread 2
[junit] Tests run: 2, Failures: 0, Errors: 0, Skipped: 0, Time elapsed: 0.11 sec, Thread: 2, Class: org.apache.zookeeper.test.SessionTrackerCheckTest
[junit] Running org.apache.zookeeper.test.SessionUpgradeTest in thread 2
[junit] Tests run: 6, Failures: 0, Errors: 0, Skipped: 0, Time elapsed: 16.294 sec, Thread: 4, Class: org.apache.zookeeper.test.SessionTest
[junit] Running org.apache.zookeeper.test.StandaloneTest in thread 4
[junit] Tests run: 4, Failures: 0, Errors: 0, Skipped: 0, Time elapsed: 2.777 sec, Thread: 4, Class: org.apache.zookeeper.test.StandaloneTest
[junit] Running org.apache.zookeeper.test.StatTest in thread 4
[junit] Tests run: 4, Failures: 0, Errors: 0, Skipped: 0, Time elapsed: 1.18 sec, Thread: 4, Class: org.apache.zookeeper.test.StatTest
[junit] Running org.apache.zookeeper.test.StaticHostProviderTest in thread 4
[junit] Tests run: 26, Failures: 0, Errors: 0, Skipped: 0, Time elapsed: 1.839 sec, Thread: 4, Class: org.apache.zookeeper.test.StaticHostProviderTest
[junit] Running org.apache.zookeeper.test.StringUtilTest in thread 4
[junit] Tests run: 1, Failures: 0, Errors: 0, Skipped: 0, Time elapsed: 0.095 sec, Thread: 4, Class: org.apache.zookeeper.test.StringUtilTest
[junit] Running org.apache.zookeeper.test.SyncCallTest in thread 4
[junit] Tests run: 1, Failures: 0, Errors: 0, Skipped: 0, Time elapsed: 0.786 sec, Thread: 4, Class: org.apache.zookeeper.test.SyncCallTest
[junit] Running org.apache.zookeeper.test.TruncateTest in thread 4
[junit] Tests run: 3, Failures: 0, Errors: 0, Skipped: 0, Time elapsed: 5.133 sec, Thread: 4, Class: org.apache.zookeeper.test.TruncateTest
[junit] Running org.apache.zookeeper.test.WatchEventWhenAutoResetTest in thread 4
[junit] Tests run: 4, Failures: 0, Errors: 0, Skipped: 0, Time elapsed: 18.996 sec, Thread: 2, Class: org.apache.zookeeper.test.SessionUpgradeTest
[junit] Running org.apache.zookeeper.test.WatchedEventTest in thread 2
[junit] Tests run: 4, Failures: 0, Errors: 0, Skipped: 0, Time elapsed: 0.2 sec, Thread: 2, Class: org.apache.zookeeper.test.WatchedEventTest
[junit] Running org.apache.zookeeper.test.WatcherFuncTest in thread 2
[junit] Tests run: 6, Failures: 0, Errors: 0, Skipped: 0, Time elapsed: 2.381 sec, Thread: 2, Class: org.apache.zookeeper.test.WatcherFuncTest
[junit] Running org.apache.zookeeper.test.WatcherTest in thread 2
[junit] Tests run: 4, Failures: 0, Errors: 0, Skipped: 0, Time elapsed: 18.766 sec, Thread: 4, Class: org.apache.zookeeper.test.WatchEventWhenAutoResetTest
[junit] Running org.apache.zookeeper.test.X509AuthTest in thread 4
[junit] Tests run: 3, Failures: 0, Errors: 0, Skipped: 0, Time elapsed: 0.088 sec, Thread: 4, Class: org.apache.zookeeper.test.X509AuthTest
[junit] Running org.apache.zookeeper.test.ZkDatabaseCorruptionTest in thread 4
[junit] Tests run: 2, Failures: 0, Errors: 0, Skipped: 0, Time elapsed: 5.92 sec, Thread: 4, Class: org.apache.zookeeper.test.ZkDatabaseCorruptionTest
[junit] Running org.apache.zookeeper.test.ZooKeeperQuotaTest in thread 4
[junit] Tests run: 1, Failures: 0, Errors: 0, Skipped: 0, Time elapsed: 0.85 sec, Thread: 4, Class: org.apache.zookeeper.test.ZooKeeperQuotaTest
[junit] Running org.apache.zookeeper.util.PemReaderTest in thread 4
[junit] Tests run: 64, Failures: 0, Errors: 0, Skipped: 0, Time elapsed: 3.543 sec, Thread: 4, Class: org.apache.zookeeper.util.PemReaderTest
[junit] Running org.apache.jute.BinaryInputArchiveTest in thread 4
[junit] Tests run: 1, Failures: 0, Errors: 0, Skipped: 0, Time elapsed: 0.076 sec, Thread: 4, Class: org.apache.jute.BinaryInputArchiveTest
[junit] Tests run: 8, Failures: 0, Errors: 0, Skipped: 0, Time elapsed: 28.817 sec, Thread: 2, Class: org.apache.zookeeper.test.WatcherTest
[junit] Tests run: 106, Failures: 0, Errors: 0, Skipped: 0, Time elapsed: 355.473 sec, Thread: 1, Class: org.apache.zookeeper.test.NioNettySuiteTest
[junit] Tests run: 13, Failures: 0, Errors: 0, Skipped: 0, Time elapsed: 253.757 sec, Thread: 3, Class: org.apache.zookeeper.test.ReconfigTest
fail.build.on.test.failure:
BUILD FAILED
/home/jenkins/jenkins-slave/workspace/ZooKeeper-trunk/build.xml:1472: The following error occurred while executing this line:
/home/jenkins/jenkins-slave/workspace/ZooKeeper-trunk/build.xml:1325: The following error occurred while executing this line:
/home/jenkins/jenkins-slave/workspace/ZooKeeper-trunk/build.xml:1329: Tests failed!
Total time: 20 minutes 36 seconds
Build step 'Execute shell' marked build as failure
[FINDBUGS] Skipping publisher since build result is FAILURE
[WARNINGS] Skipping publisher since build result is FAILURE
Archiving artifacts
Recording test results
Email was triggered for: Failure - Any
Sending email for trigger: Failure - Any
###################################################################################
############################## FAILED TESTS (if any) ##############################
3 tests failed.
FAILED: org.apache.zookeeper.server.quorum.QuorumPeerMainTest.testMetricsProviderConfiguration
Error Message:
Server 1 never came up
Stack Trace:
junit.framework.AssertionFailedError: Server 1 never came up
at org.apache.zookeeper.server.quorum.QuorumPeerMainTest.testMetricsProviderConfiguration(QuorumPeerMainTest.java:1458)
at org.apache.zookeeper.JUnit4ZKTestRunner$LoggedInvokeMethod.evaluate(JUnit4ZKTestRunner.java:79)
FAILED: org.apache.zookeeper.server.quorum.QuorumSSLTest.testOCSP
Error Message:
null
Stack Trace:
junit.framework.AssertionFailedError
at org.apache.zookeeper.server.quorum.QuorumSSLTest.testOCSP(QuorumSSLTest.java:656)
at org.apache.zookeeper.JUnit4ZKTestRunner$LoggedInvokeMethod.evaluate(JUnit4ZKTestRunner.java:79)
at java.util.concurrent.FutureTask.run(FutureTask.java:266)
at java.lang.Thread.run(Thread.java:748)
FAILED: org.apache.zookeeper.server.quorum.ReconfigBackupTest.testReconfigCreateNewVersionFile
Error Message:
waiting for server 0 being up
Stack Trace:
junit.framework.AssertionFailedError: waiting for server 0 being up
at org.apache.zookeeper.server.quorum.ReconfigBackupTest.testReconfigCreateNewVersionFile(ReconfigBackupTest.java:169)
at org.apache.zookeeper.JUnit4ZKTestRunner$LoggedInvokeMethod.evaluate(JUnit4ZKTestRunner.java:79)
ZooKeeper-trunk - Build # 305 - Still Failing
Posted by Apache Jenkins Server <je...@builds.apache.org>.
See https://builds.apache.org/job/ZooKeeper-trunk/305/
###################################################################################
########################## LAST 60 LINES OF THE CONSOLE ###########################
[...truncated 322.67 KB...]
[exec] 7f0f62183000-7f0f62383000 ---p 001c0000 08:03 10223790 /lib/x86_64-linux-gnu/libc-2.23.so
[exec] 7f0f62383000-7f0f62387000 r--p 001c0000 08:03 10223790 /lib/x86_64-linux-gnu/libc-2.23.so
[exec] 7f0f62387000-7f0f62389000 rw-p 001c4000 08:03 10223790 /lib/x86_64-linux-gnu/libc-2.23.so
[exec] 7f0f62389000-7f0f6238d000 rw-p 00000000 00:00 0
[exec] 7f0f6238d000-7f0f623a3000 r-xp 00000000 08:03 10223681 /lib/x86_64-linux-gnu/libgcc_s.so.1
[exec] 7f0f623a3000-7f0f625a2000 ---p 00016000 08:03 10223681 /lib/x86_64-linux-gnu/libgcc_s.so.1
[exec] 7f0f625a2000-7f0f625a3000 rw-p 00015000 08:03 10223681 /lib/x86_64-linux-gnu/libgcc_s.so.1
[exec] 7f0f625a3000-7f0f626ab000 r-xp 00000000 08:03 10223781 /lib/x86_64-linux-gnu/libm-2.23.so
[exec] 7f0f626ab000-7f0f628aa000 ---p 00108000 08:03 10223781 /lib/x86_64-linux-gnu/libm-2.23.so
[exec] 7f0f628aa000-7f0f628ab000 r--p 00107000 08:03 10223781 /lib/x86_64-linux-gnu/libm-2.23.so
[exec] 7f0f628ab000-7f0f628ac000 rw-p 00108000 08:03 10223781 /lib/x86_64-linux-gnu/libm-2.23.so
[exec] 7f0f628ac000-7f0f62a1e000 r-xp 00000000 08:03 2622487 /usr/lib/x86_64-linux-gnu/libstdc++.so.6.0.21
[exec] 7f0f62a1e000-7f0f62c1e000 ---p 00172000 08:03 2622487 /usr/lib/x86_64-linux-gnu/libstdc++.so.6.0.21
[exec] 7f0f62c1e000-7f0f62c28000 r--p 00172000 08:03 2622487 /usr/lib/x86_64-linux-gnu/libstdc++.so.6.0.21
[exec] 7f0f62c28000-7f0f62c2a000 rw-p 0017c000 08:03 2622487 /usr/lib/x86_64-linux-gnu/libstdc++.so.6.0.21
[exec] 7f0f62c2a000-7f0f62c2e000 rw-p 00000000 00:00 0
[exec] 7f0f62c2e000-7f0f62c31000 r-xp 00000000 08:03 10223792 /lib/x86_64-linux-gnu/libdl-2.23.so
[exec] 7f0f62c31000-7f0f62e30000 ---p 00003000 08:03 10223792 /lib/x86_64-linux-gnu/libdl-2.23.so
[exec] 7f0f62e30000-7f0f62e31000 r--p 00002000 08:03 10223792 /lib/x86_64-linux-gnu/libdl-2.23.so
[exec] 7f0f62e31000-7f0f62e32000 rw-p 00003000 08:03 10223792 /lib/x86_64-linux-gnu/libdl-2.23.so
[exec] 7f0f62e32000-7f0f62e6c000 r-xp 00000000 08:03 2640294 /usr/lib/x86_64-linux-gnu/libcppunit-1.13.so.0.0.2
[exec] 7f0f62e6c000-7f0f6306c000 ---p 0003a000 08:03 2640294 /usr/lib/x86_64-linux-gnu/libcppunit-1.13.so.0.0.2
[exec] 7f0f6306c000-7f0f6306e000 r--p 0003a000 08:03 2640294 /usr/lib/x86_64-linux-gnu/libcppunit-1.13.so.0.0.2
[exec] 7f0f6306e000-7f0f6306f000 rw-p 0003c000 08:03 2640294 /usr/lib/x86_64-linux-gnu/libcppunit-1.13.so.0.0.2
[exec] 7f0f6306f000-7f0f63087000 r-xp 00000000 08:03 10223788 /lib/x86_64-linux-gnu/libpthread-2.23.so
[exec] 7f0f63087000-7f0f63286000 ---p 00018000 08:03 10223788 /lib/x86_64-linux-gnu/libpthread-2.23.so
[exec] 7f0f63286000-7f0f63287000 r--p 00017000 08:03 10223788 /lib/x86_64-linux-gnu/libpthread-2.23.so
[exec] 7f0f63287000-7f0f63288000 rw-p 00018000 08:03 10223788 /lib/x86_64-linux-gnu/libpthread-2.23.so
[exec] 7f0f63288000-7f0f6328c000 rw-p 00000000 00:00 0
[exec] 7f0f6328c000-7f0f632b2000 r-xp 00000000 08:03 10223786 /lib/x86_64-linux-gnu/ld-2.23.so
[exec] 7f0f63498000-7f0f6349f000 rw-p 00000000 00:00 0
[exec] 7f0f634b0000-7f0f634b1000 rw-p 00000000 00:00 0
[exec] 7f0f634b1000-7f0f634b2000 r--p 00025000 08:03 10223786 /lib/x86_64-linux-gnu/ld-2.23.so
[exec] 7f0f634b2000-7f0f634b3000 rw-p 00026000 08:03 10223786 /lib/x86_64-linux-gnu/ld-2.23.so
[exec] 7f0f634b3000-7f0f634b4000 rw-p 00000000 00:00 0
[exec] 7ffe89808000-7ffe89833000 rw-p 00000000 00:00 0 [stack]
[exec] 7ffe899d4000-7ffe899d7000 r--p 00000000 00:00 0 [vvar]
[exec] 7ffe899d7000-7ffe899d9000 r-xp 00000000 00:00 0 [vdso]
[exec] ffffffffff600000-ffffffffff601000 r-xp 00000000 00:00 0 [vsyscall]
[exec] /bin/bash: line 5: 26058 Aborted ZKROOT=/home/jenkins/jenkins-slave/workspace/ZooKeeper-trunk/zookeeper-client/zookeeper-client-c/../.. CLASSPATH=$CLASSPATH:$CLOVER_HOME/lib/clover.jar ${dir}$tst
[exec] make[1]: *** [check-TESTS] Error 1
[exec] make: *** [check-am] Error 2
BUILD FAILED
/home/jenkins/jenkins-slave/workspace/ZooKeeper-trunk/build.xml:1472: The following error occurred while executing this line:
/home/jenkins/jenkins-slave/workspace/ZooKeeper-trunk/build.xml:1432: The following error occurred while executing this line:
/home/jenkins/jenkins-slave/workspace/ZooKeeper-trunk/build.xml:1442: exec returned: 2
Total time: 23 minutes 54 seconds
Build step 'Execute shell' marked build as failure
[FINDBUGS] Skipping publisher since build result is FAILURE
[WARNINGS] Skipping publisher since build result is FAILURE
Archiving artifacts
[JIRA] Updating issue ZOOKEEPER-3207
[JIRA] Updating issue ZOOKEEPER-3208
[JIRA] Updating issue ZOOKEEPER-3032
Recording test results
Email was triggered for: Failure - Any
Sending email for trigger: Failure - Any
###################################################################################
############################## FAILED TESTS (if any) ##############################
All tests passed