You are viewing a plain text version of this content. The canonical link for it is here.
Posted to dev@hbase.apache.org by Apache Jenkins Server <je...@builds.apache.org> on 2013/03/06 23:11:45 UTC

Build failed in Jenkins: hbase-0.95 #31

See <https://builds.apache.org/job/hbase-0.95/31/>

------------------------------------------
[...truncated 3714 lines...]
Tests run: 6, Failures: 0, Errors: 0, Skipped: 0, Time elapsed: 710.62 sec
Running org.apache.hadoop.hbase.replication.TestReplicationSource
Tests run: 1, Failures: 0, Errors: 0, Skipped: 0, Time elapsed: 7.11 sec
Running org.apache.hadoop.hbase.TestZooKeeper
Tests run: 9, Failures: 0, Errors: 0, Skipped: 0, Time elapsed: 53.979 sec
Running org.apache.hadoop.hbase.replication.regionserver.TestReplicationSink
Tests run: 5, Failures: 0, Errors: 0, Skipped: 0, Time elapsed: 35.224 sec
Running org.apache.hadoop.hbase.replication.regionserver.TestReplicationSourceManager
Tests run: 1, Failures: 0, Errors: 0, Skipped: 0, Time elapsed: 3.556 sec
Running org.apache.hadoop.hbase.replication.TestReplicationQueueFailoverCompressed
Tests run: 1, Failures: 0, Errors: 0, Skipped: 0, Time elapsed: 89.439 sec
Running org.apache.hadoop.hbase.replication.TestMasterReplication
Tests run: 2, Failures: 0, Errors: 0, Skipped: 0, Time elapsed: 119.587 sec
Running org.apache.hadoop.hbase.replication.TestReplicationSmallTests
Tests run: 8, Failures: 0, Errors: 0, Skipped: 0, Time elapsed: 112.297 sec
Running org.apache.hadoop.hbase.replication.TestReplicationDisableInactivePeer
Tests run: 1, Failures: 0, Errors: 0, Skipped: 0, Time elapsed: 72.063 sec
Running org.apache.hadoop.hbase.replication.TestMultiSlaveReplication
Tests run: 1, Failures: 0, Errors: 0, Skipped: 0, Time elapsed: 71.389 sec
Running org.apache.hadoop.hbase.catalog.TestMetaReaderEditorNoCluster
Tests run: 2, Failures: 0, Errors: 0, Skipped: 0, Time elapsed: 6.689 sec
Running org.apache.hadoop.hbase.TestMultiVersions
Tests run: 3, Failures: 0, Errors: 0, Skipped: 0, Time elapsed: 38.953 sec
Running org.apache.hadoop.hbase.catalog.TestCatalogTracker
Tests run: 10, Failures: 0, Errors: 0, Skipped: 1, Time elapsed: 10.573 sec
Running org.apache.hadoop.hbase.catalog.TestMetaReaderEditor
Tests run: 5, Failures: 0, Errors: 0, Skipped: 0, Time elapsed: 45.897 sec
Running org.apache.hadoop.hbase.replication.TestReplicationQueueFailover
Tests run: 1, Failures: 1, Errors: 0, Skipped: 0, Time elapsed: 111.865 sec <<< FAILURE!
Running org.apache.hadoop.hbase.coprocessor.TestAggregateProtocol
Tests run: 45, Failures: 0, Errors: 0, Skipped: 0, Time elapsed: 24.038 sec
Running org.apache.hadoop.hbase.TestHBaseTestingUtility
Tests run: 7, Failures: 0, Errors: 0, Skipped: 0, Time elapsed: 115.047 sec
Running org.apache.hadoop.hbase.coprocessor.TestRowProcessorEndpoint
Tests run: 4, Failures: 0, Errors: 0, Skipped: 0, Time elapsed: 40.311 sec
Running org.apache.hadoop.hbase.catalog.TestMetaMigrationConvertingToPB
Tests run: 3, Failures: 0, Errors: 0, Skipped: 0, Time elapsed: 83.443 sec
Running org.apache.hadoop.hbase.coprocessor.TestBigDecimalColumnInterpreter
Tests run: 38, Failures: 0, Errors: 0, Skipped: 0, Time elapsed: 20.891 sec
Running org.apache.hadoop.hbase.coprocessor.TestMasterObserver
Tests run: 4, Failures: 0, Errors: 0, Skipped: 0, Time elapsed: 56.225 sec
Running org.apache.hadoop.hbase.coprocessor.TestCoprocessorEndpoint
Tests run: 6, Failures: 0, Errors: 0, Skipped: 0, Time elapsed: 23.511 sec
Running org.apache.hadoop.hbase.coprocessor.TestMasterCoprocessorExceptionWithRemove
Tests run: 1, Failures: 0, Errors: 0, Skipped: 0, Time elapsed: 23.757 sec
Running org.apache.hadoop.hbase.coprocessor.TestClassLoading
Tests run: 7, Failures: 0, Errors: 0, Skipped: 0, Time elapsed: 42.643 sec
Running org.apache.hadoop.hbase.coprocessor.TestRegionServerCoprocessorExceptionWithRemove
Tests run: 1, Failures: 0, Errors: 0, Skipped: 0, Time elapsed: 27.408 sec
Running org.apache.hadoop.hbase.coprocessor.TestRegionObserverInterface
Tests run: 7, Failures: 0, Errors: 0, Skipped: 0, Time elapsed: 49.975 sec
Running org.apache.hadoop.hbase.coprocessor.TestWALObserver
Tests run: 3, Failures: 0, Errors: 0, Skipped: 0, Time elapsed: 24.603 sec
Running org.apache.hadoop.hbase.coprocessor.TestMasterCoprocessorExceptionWithAbort
Tests run: 1, Failures: 0, Errors: 0, Skipped: 0, Time elapsed: 34.458 sec
Running org.apache.hadoop.hbase.coprocessor.TestRegionServerCoprocessorExceptionWithAbort
Tests run: 1, Failures: 0, Errors: 0, Skipped: 0, Time elapsed: 26.517 sec
Running org.apache.hadoop.hbase.coprocessor.TestRegionObserverBypass
Tests run: 2, Failures: 0, Errors: 0, Skipped: 0, Time elapsed: 28.574 sec
Running org.apache.hadoop.hbase.thrift2.TestThriftHBaseServiceHandler
Tests run: 12, Failures: 0, Errors: 0, Skipped: 0, Time elapsed: 24.777 sec
Running org.apache.hadoop.hbase.procedure.TestZKProcedure
Tests run: 4, Failures: 0, Errors: 0, Skipped: 0, Time elapsed: 3.364 sec
Running org.apache.hadoop.hbase.procedure.TestZKProcedureControllers
Tests run: 4, Failures: 0, Errors: 0, Skipped: 0, Time elapsed: 2.904 sec
Running org.apache.hadoop.hbase.trace.TestHTraceHooks
Tests run: 1, Failures: 0, Errors: 0, Skipped: 0, Time elapsed: 21.491 sec
Running org.apache.hadoop.hbase.regionserver.TestHRegionOnCluster
Tests run: 1, Failures: 0, Errors: 0, Skipped: 0, Time elapsed: 35.285 sec
Running org.apache.hadoop.hbase.thrift.TestThriftServerCmdLine
Tests run: 32, Failures: 0, Errors: 0, Skipped: 0, Time elapsed: 70.199 sec
Running org.apache.hadoop.hbase.regionserver.TestRegionServerNoMaster
Tests run: 7, Failures: 0, Errors: 0, Skipped: 0, Time elapsed: 35.738 sec
Running org.apache.hadoop.hbase.regionserver.TestMasterAddressManager
Tests run: 1, Failures: 0, Errors: 0, Skipped: 0, Time elapsed: 1.484 sec
Running org.apache.hadoop.hbase.thrift.TestThriftServer
Running org.apache.hadoop.hbase.regionserver.TestRegionServerMetrics
Tests run: 1, Failures: 0, Errors: 0, Skipped: 0, Time elapsed: 103.231 sec
Tests run: 8, Failures: 0, Errors: 0, Skipped: 0, Time elapsed: 36.108 sec
Running org.apache.hadoop.hbase.regionserver.TestMemStore
Tests run: 22, Failures: 0, Errors: 0, Skipped: 0, Time elapsed: 46.323 sec
Running org.apache.hadoop.hbase.regionserver.TestCompoundBloomFilter
Tests run: 3, Failures: 0, Errors: 0, Skipped: 0, Time elapsed: 30.983 sec
Running org.apache.hadoop.hbase.regionserver.TestSplitLogWorker
Tests run: 5, Failures: 0, Errors: 0, Skipped: 0, Time elapsed: 3.926 sec
Running org.apache.hadoop.hbase.regionserver.TestHRegion
Tests run: 62, Failures: 0, Errors: 0, Skipped: 0, Time elapsed: 78.125 sec
Running org.apache.hadoop.hbase.regionserver.TestCompactionWithCoprocessor
Tests run: 17, Failures: 0, Errors: 0, Skipped: 0, Time elapsed: 54.062 sec
Running org.apache.hadoop.hbase.regionserver.TestStoreFileBlockCacheSummary
Tests run: 1, Failures: 0, Errors: 0, Skipped: 0, Time elapsed: 24.507 sec
Running org.apache.hadoop.hbase.regionserver.TestHRegionBusyWait
Tests run: 63, Failures: 0, Errors: 0, Skipped: 0, Time elapsed: 64.284 sec
Running org.apache.hadoop.hbase.regionserver.TestStore
Tests run: 14, Failures: 0, Errors: 0, Skipped: 0, Time elapsed: 14.616 sec
Running org.apache.hadoop.hbase.regionserver.TestAtomicOperation
Tests run: 5, Failures: 0, Errors: 0, Skipped: 0, Time elapsed: 31.107 sec
Running org.apache.hadoop.hbase.regionserver.TestBlocksRead
Tests run: 4, Failures: 0, Errors: 0, Skipped: 0, Time elapsed: 1.551 sec
Running org.apache.hadoop.hbase.regionserver.TestServerCustomProtocol
Tests run: 7, Failures: 0, Errors: 0, Skipped: 0, Time elapsed: 65.762 sec
Running org.apache.hadoop.hbase.regionserver.TestFSErrorsExposed
Tests run: 3, Failures: 0, Errors: 0, Skipped: 1, Time elapsed: 1.488 sec
Running org.apache.hadoop.hbase.regionserver.TestClusterId
Tests run: 1, Failures: 0, Errors: 0, Skipped: 0, Time elapsed: 45.278 sec
Running org.apache.hadoop.hbase.regionserver.TestSeekOptimizations
Tests run: 6, Failures: 0, Errors: 0, Skipped: 0, Time elapsed: 3.922 sec
Running org.apache.hadoop.hbase.regionserver.handler.TestCloseRegionHandler
Tests run: 3, Failures: 0, Errors: 0, Skipped: 0, Time elapsed: 2.929 sec
Running org.apache.hadoop.hbase.regionserver.handler.TestOpenRegionHandler
Tests run: 5, Failures: 0, Errors: 0, Skipped: 0, Time elapsed: 3.085 sec
Running org.apache.hadoop.hbase.regionserver.TestRSKilledWhenMasterInitializing
Tests run: 1, Failures: 0, Errors: 0, Skipped: 0, Time elapsed: 51.189 sec
Running org.apache.hadoop.hbase.regionserver.TestGetClosestAtOrBefore
Tests run: 3, Failures: 0, Errors: 0, Skipped: 0, Time elapsed: 3.068 sec
Running org.apache.hadoop.hbase.regionserver.TestParallelPut
Tests run: 2, Failures: 0, Errors: 0, Skipped: 0, Time elapsed: 14.021 sec
Running org.apache.hadoop.hbase.regionserver.TestCacheOnWriteInSchema
Tests run: 3, Failures: 0, Errors: 0, Skipped: 0, Time elapsed: 4.241 sec
Running org.apache.hadoop.hbase.regionserver.TestPriorityRpc
Tests run: 3, Failures: 0, Errors: 0, Skipped: 0, Time elapsed: 4.175 sec
Running org.apache.hadoop.hbase.regionserver.TestHRegionServerBulkLoad
Tests run: 1, Failures: 0, Errors: 0, Skipped: 0, Time elapsed: 73.525 sec
Running org.apache.hadoop.hbase.regionserver.TestCompactionState
Tests run: 5, Failures: 0, Errors: 0, Skipped: 0, Time elapsed: 187.894 sec
Running org.apache.hadoop.hbase.regionserver.TestSplitTransactionOnCluster
Tests run: 10, Failures: 1, Errors: 0, Skipped: 0, Time elapsed: 173.797 sec <<< FAILURE!
Running org.apache.hadoop.hbase.regionserver.wal.TestHLog
Tests run: 11, Failures: 0, Errors: 0, Skipped: 0, Time elapsed: 105.507 sec
Running org.apache.hadoop.hbase.regionserver.wal.TestLogRollAbort
Tests run: 1, Failures: 0, Errors: 0, Skipped: 0, Time elapsed: 181.823 sec
Running org.apache.hadoop.hbase.regionserver.wal.TestWALReplay
Tests run: 8, Failures: 0, Errors: 0, Skipped: 0, Time elapsed: 112.945 sec
Running org.apache.hadoop.hbase.regionserver.TestJoinedScanners
Tests run: 1, Failures: 0, Errors: 0, Skipped: 0, Time elapsed: 441.738 sec
Running org.apache.hadoop.hbase.regionserver.wal.TestLogRolling
Tests run: 2, Failures: 0, Errors: 0, Skipped: 0, Time elapsed: 361.25 sec
Running org.apache.hadoop.hbase.regionserver.TestStoreScanner
Tests run: 16, Failures: 0, Errors: 0, Skipped: 0, Time elapsed: 0.256 sec
Running org.apache.hadoop.hbase.regionserver.wal.TestHLogFiltering
Tests run: 1, Failures: 0, Errors: 0, Skipped: 0, Time elapsed: 44.03 sec
Running org.apache.hadoop.hbase.regionserver.wal.TestWALReplayCompressed
Tests run: 8, Failures: 0, Errors: 0, Skipped: 0, Time elapsed: 77.737 sec
Running org.apache.hadoop.hbase.regionserver.TestCompaction
Tests run: 17, Failures: 0, Errors: 0, Skipped: 0, Time elapsed: 45.174 sec
Running org.apache.hadoop.hbase.regionserver.wal.TestHLogSplit
Running org.apache.hadoop.hbase.regionserver.TestEndToEndSplitTransaction
Tests run: 32, Failures: 0, Errors: 0, Skipped: 1, Time elapsed: 363.266 sec
Tests run: 2, Failures: 0, Errors: 0, Skipped: 0, Time elapsed: 81.704 sec
Running org.apache.hadoop.hbase.regionserver.TestMultiColumnScanner
Tests run: 12, Failures: 0, Errors: 0, Skipped: 0, Time elapsed: 35.826 sec
Running org.apache.hadoop.hbase.mapred.TestTableInputFormat
Tests run: 10, Failures: 0, Errors: 0, Skipped: 0, Time elapsed: 38.248 sec
Running org.apache.hadoop.hbase.backup.example.TestZooKeeperTableArchiveClient
Tests run: 3, Failures: 0, Errors: 0, Skipped: 0, Time elapsed: 8.889 sec
Running org.apache.hadoop.hbase.regionserver.wal.TestHLogSplitCompressed
Tests run: 32, Failures: 0, Errors: 0, Skipped: 1, Time elapsed: 389.698 sec
Running org.apache.hadoop.hbase.fs.TestBlockReorder
Tests run: 3, Failures: 0, Errors: 0, Skipped: 0, Time elapsed: 63.768 sec
Running org.apache.hadoop.hbase.TestClusterBootOrder
Tests run: 2, Failures: 0, Errors: 0, Skipped: 0, Time elapsed: 56.671 sec
Running org.apache.hadoop.hbase.TestDrainingServer
Tests run: 2, Failures: 0, Errors: 0, Skipped: 0, Time elapsed: 54.004 sec
Running org.apache.hadoop.hbase.mapred.TestTableMapReduce
Tests run: 1, Failures: 0, Errors: 0, Skipped: 0, Time elapsed: 147.803 sec
Running org.apache.hadoop.hbase.mapreduce.TestTimeRangeMapRed
Tests run: 1, Failures: 0, Errors: 0, Skipped: 0, Time elapsed: 60.973 sec
Running org.apache.hadoop.hbase.mapreduce.TestRowCounter
Tests run: 3, Failures: 0, Errors: 0, Skipped: 0, Time elapsed: 111.383 sec
Running org.apache.hadoop.hbase.mapreduce.TestSecureLoadIncrementalHFiles
Tests run: 6, Failures: 0, Errors: 0, Skipped: 0, Time elapsed: 74.614 sec
Running org.apache.hadoop.hbase.backup.TestHFileArchiving
Tests run: 5, Failures: 0, Errors: 0, Skipped: 0, Time elapsed: 286.543 sec
Running org.apache.hadoop.hbase.mapreduce.TestMultiTableInputFormat
Tests run: 5, Failures: 0, Errors: 0, Skipped: 0, Time elapsed: 421.585 sec
Running org.apache.hadoop.hbase.mapreduce.TestImportTsv
Tests run: 13, Failures: 0, Errors: 0, Skipped: 0, Time elapsed: 304.327 sec
Running org.apache.hadoop.hbase.mapreduce.TestImportExport
Tests run: 5, Failures: 0, Errors: 0, Skipped: 0, Time elapsed: 237.463 sec
Running org.apache.hadoop.hbase.mapreduce.TestWALPlayer
Tests run: 1, Failures: 0, Errors: 0, Skipped: 0, Time elapsed: 78.16 sec
Running org.apache.hadoop.hbase.mapreduce.TestHFileOutputFormat
Tests run: 10, Failures: 0, Errors: 0, Skipped: 0, Time elapsed: 520.403 sec
Running org.apache.hadoop.hbase.mapreduce.TestLoadIncrementalHFilesSplitRecovery
Tests run: 4, Failures: 0, Errors: 0, Skipped: 0, Time elapsed: 131.356 sec
Running org.apache.hadoop.hbase.mapreduce.TestSecureLoadIncrementalHFilesSplitRecovery
Tests run: 4, Failures: 0, Errors: 0, Skipped: 0, Time elapsed: 115.923 sec
Running org.apache.hadoop.hbase.mapreduce.TestHLogRecordReader
Tests run: 2, Failures: 0, Errors: 0, Skipped: 0, Time elapsed: 13.834 sec
Running org.apache.hadoop.hbase.mapreduce.TestMultithreadedTableMapper
Tests run: 1, Failures: 0, Errors: 0, Skipped: 0, Time elapsed: 162.015 sec
Running org.apache.hadoop.hbase.mapreduce.TestLoadIncrementalHFiles
Tests run: 6, Failures: 0, Errors: 0, Skipped: 0, Time elapsed: 50.925 sec
Running org.apache.hadoop.hbase.mapreduce.TestTableInputFormatScan
Tests run: 12, Failures: 0, Errors: 0, Skipped: 0, Time elapsed: 617.234 sec
Running org.apache.hadoop.hbase.mapreduce.TestTableMapReduce
Tests run: 2, Failures: 0, Errors: 0, Skipped: 0, Time elapsed: 248.261 sec

Results :

Failed tests:   testRegionShouldNotBeDeployed(org.apache.hadoop.hbase.util.TestHBaseFsck): expected:<[SHOULD_NOT_BE_DEPLOYED]> but was:<[]>
  queueFailover(org.apache.hadoop.hbase.replication.TestReplicationQueueFailover): Waited too much time for queueFailover replication. Waited 13173ms.
  testShouldThrowIOExceptionIfStoreFileSizeIsEmptyAndShouldSuccessfullyExecuteRollback(org.apache.hadoop.hbase.regionserver.TestSplitTransactionOnCluster): not able to find a splittable region

Tests run: 1465, Failures: 3, Errors: 0, Skipped: 13

[INFO]                                                                         
[INFO] ------------------------------------------------------------------------
[INFO] Skipping HBase
[INFO] This project has been banned from the build due to previous failures.
[INFO] ------------------------------------------------------------------------
[INFO]                                                                         
[INFO] ------------------------------------------------------------------------
[INFO] Skipping HBase
[INFO] This project has been banned from the build due to previous failures.
[INFO] ------------------------------------------------------------------------
[INFO] ------------------------------------------------------------------------
[INFO] Reactor Summary:
[INFO] 
[INFO] HBase ............................................. SUCCESS [6.219s]
[INFO] HBase - Common .................................... SUCCESS [23.032s]
[INFO] HBase - Protocol .................................. SUCCESS [7.587s]
[INFO] HBase - Client .................................... SUCCESS [8.261s]
[INFO] HBase - Prefix Tree ............................... SUCCESS [3.503s]
[INFO] HBase - Hadoop Compatibility ...................... SUCCESS [0.584s]
[INFO] HBase - Hadoop One Compatibility .................. SUCCESS [1.673s]
[INFO] HBase - Server .................................... FAILURE [1:06:57.013s]
[INFO] HBase - Integration Tests ......................... SKIPPED
[INFO] HBase - Examples .................................. SKIPPED
[INFO] ------------------------------------------------------------------------
[INFO] BUILD FAILURE
[INFO] ------------------------------------------------------------------------
[INFO] Total time: 1:07:48.850s
[INFO] Finished at: Wed Mar 06 22:10:40 UTC 2013
[INFO] Final Memory: 74M/1274M
[INFO] ------------------------------------------------------------------------
[ERROR] Failed to execute goal org.apache.maven.plugins:maven-surefire-plugin:2.12-TRUNK-HBASE-2:test (secondPartTestsExecution) on project hbase-server: Failure or timeout -> [Help 1]
[ERROR] 
[ERROR] To see the full stack trace of the errors, re-run Maven with the -e switch.
[ERROR] Re-run Maven using the -X switch to enable full debug logging.
[ERROR] 
[ERROR] For more information about the errors and possible solutions, please read the following articles:
[ERROR] [Help 1] http://cwiki.apache.org/confluence/display/MAVEN/MojoExecutionException
[ERROR] 
[ERROR] After correcting the problems, you can resume the build with the command
[ERROR]   mvn <goals> -rf :hbase-server
Build step 'Invoke top-level Maven targets' marked build as failure
Archiving artifacts
Recording test results

Build failed in Jenkins: hbase-0.95 #36

Posted by Apache Jenkins Server <je...@builds.apache.org>.
See <https://builds.apache.org/job/hbase-0.95/36/changes>

Changes:

[stack] HBASE-8027 hbase-7994 redux; shutdown hbase-example unit tests

------------------------------------------
[...truncated 3250 lines...]
Running org.apache.hadoop.hbase.rest.model.TestColumnSchemaModel
Tests run: 2, Failures: 0, Errors: 0, Skipped: 0, Time elapsed: 0.004 sec
Running org.apache.hadoop.hbase.rest.model.TestRowModel
Tests run: 2, Failures: 0, Errors: 0, Skipped: 0, Time elapsed: 0.046 sec
Running org.apache.hadoop.hbase.rest.model.TestTableSchemaModel
Tests run: 3, Failures: 0, Errors: 0, Skipped: 0, Time elapsed: 0.088 sec
Running org.apache.hadoop.hbase.rest.model.TestStorageClusterVersionModel
Tests run: 2, Failures: 0, Errors: 0, Skipped: 0, Time elapsed: 0.004 sec
Running org.apache.hadoop.hbase.rest.model.TestTableListModel
Tests run: 3, Failures: 0, Errors: 0, Skipped: 0, Time elapsed: 0.043 sec
Running org.apache.hadoop.hbase.rest.model.TestCellSetModel
Tests run: 3, Failures: 0, Errors: 0, Skipped: 0, Time elapsed: 0.031 sec
Running org.apache.hadoop.hbase.rest.model.TestTableRegionModel
Tests run: 4, Failures: 0, Errors: 0, Skipped: 0, Time elapsed: 0.007 sec
Running org.apache.hadoop.hbase.rest.model.TestVersionModel
Tests run: 3, Failures: 0, Errors: 0, Skipped: 0, Time elapsed: 0.097 sec
Running org.apache.hadoop.hbase.monitoring.TestTaskMonitor
Tests run: 3, Failures: 0, Errors: 0, Skipped: 0, Time elapsed: 0.779 sec
Running org.apache.hadoop.hbase.monitoring.TestMemoryBoundedLogMessageBuffer
Tests run: 2, Failures: 0, Errors: 0, Skipped: 0, Time elapsed: 0.061 sec
Running org.apache.hadoop.hbase.TestHRegionLocation
Tests run: 3, Failures: 0, Errors: 0, Skipped: 0, Time elapsed: 0.093 sec
Running org.apache.hadoop.hbase.TestHColumnDescriptor
Tests run: 3, Failures: 0, Errors: 0, Skipped: 0, Time elapsed: 0.006 sec
Running org.apache.hadoop.hbase.metrics.TestMetricsMBeanBase
Tests run: 3, Failures: 0, Errors: 0, Skipped: 0, Time elapsed: 1.172 sec
Running org.apache.hadoop.hbase.metrics.TestExponentiallyDecayingSample
Tests run: 2, Failures: 0, Errors: 0, Skipped: 0, Time elapsed: 0.014 sec
Running org.apache.hadoop.hbase.metrics.TestMetricsHistogram
Tests run: 2, Failures: 0, Errors: 0, Skipped: 0, Time elapsed: 0.042 sec
Running org.apache.hadoop.hbase.metrics.TestExactCounterMetric
Tests run: 1, Failures: 0, Errors: 0, Skipped: 0, Time elapsed: 0.088 sec
Running org.apache.hadoop.hbase.regionserver.TestBlocksScanned
Tests run: 1, Failures: 0, Errors: 0, Skipped: 0, Time elapsed: 3.283 sec
Running org.apache.hadoop.hbase.regionserver.TestScanWildcardColumnTracker
Tests run: 2, Failures: 0, Errors: 0, Skipped: 0, Time elapsed: 0.034 sec
Running org.apache.hadoop.hbase.regionserver.TestRSStatusServlet
Tests run: 2, Failures: 0, Errors: 0, Skipped: 0, Time elapsed: 1.532 sec
Running org.apache.hadoop.hbase.regionserver.TestColumnSeeking
Tests run: 2, Failures: 0, Errors: 0, Skipped: 0, Time elapsed: 6.899 sec
Running org.apache.hadoop.hbase.regionserver.TestHBase7051
Tests run: 1, Failures: 0, Errors: 0, Skipped: 0, Time elapsed: 1.672 sec
Running org.apache.hadoop.hbase.regionserver.TestMetricsRegion
Tests run: 1, Failures: 0, Errors: 0, Skipped: 0, Time elapsed: 0.035 sec
Running org.apache.hadoop.hbase.regionserver.TestOffPeakCompactions
Tests run: 1, Failures: 0, Errors: 0, Skipped: 0, Time elapsed: 0.003 sec
Running org.apache.hadoop.hbase.regionserver.wal.TestKeyValueCompression
Tests run: 2, Failures: 0, Errors: 0, Skipped: 0, Time elapsed: 0.092 sec
Running org.apache.hadoop.hbase.regionserver.wal.TestCompressor
Tests run: 4, Failures: 0, Errors: 0, Skipped: 0, Time elapsed: 0.012 sec
Running org.apache.hadoop.hbase.regionserver.wal.TestLogRollingNoCluster
Tests run: 1, Failures: 0, Errors: 0, Skipped: 0, Time elapsed: 1.903 sec
Running org.apache.hadoop.hbase.regionserver.wal.TestWALActionsListener
Tests run: 1, Failures: 0, Errors: 0, Skipped: 0, Time elapsed: 0.141 sec
Running org.apache.hadoop.hbase.regionserver.wal.TestHLogMethods
Tests run: 3, Failures: 0, Errors: 0, Skipped: 0, Time elapsed: 0.174 sec
Running org.apache.hadoop.hbase.regionserver.wal.TestLRUDictionary
Tests run: 5, Failures: 0, Errors: 0, Skipped: 0, Time elapsed: 0.303 sec
Running org.apache.hadoop.hbase.regionserver.TestKeyValueScanFixture
Tests run: 1, Failures: 0, Errors: 0, Skipped: 0, Time elapsed: 0.014 sec
Running org.apache.hadoop.hbase.regionserver.TestExplicitColumnTracker
Tests run: 4, Failures: 0, Errors: 0, Skipped: 0, Time elapsed: 0.44 sec
Running org.apache.hadoop.hbase.regionserver.TestMultiVersionConsistencyControl
Tests run: 1, Failures: 0, Errors: 0, Skipped: 0, Time elapsed: 10.088 sec
Running org.apache.hadoop.hbase.regionserver.TestStoreFile
Tests run: 12, Failures: 0, Errors: 0, Skipped: 0, Time elapsed: 1.122 sec
Running org.apache.hadoop.hbase.regionserver.TestWideScanner
Tests run: 1, Failures: 0, Errors: 0, Skipped: 0, Time elapsed: 2.093 sec
Running org.apache.hadoop.hbase.regionserver.TestQueryMatcher
Tests run: 4, Failures: 0, Errors: 0, Skipped: 0, Time elapsed: 0.065 sec
Running org.apache.hadoop.hbase.regionserver.TestResettingCounters
Tests run: 1, Failures: 0, Errors: 0, Skipped: 0, Time elapsed: 0.077 sec
Running org.apache.hadoop.hbase.regionserver.TestKeepDeletes
Tests run: 11, Failures: 0, Errors: 0, Skipped: 0, Time elapsed: 1.043 sec
Running org.apache.hadoop.hbase.regionserver.TestMinVersions
Tests run: 6, Failures: 0, Errors: 0, Skipped: 0, Time elapsed: 0.42 sec
Running org.apache.hadoop.hbase.regionserver.TestMemStoreLAB
Tests run: 3, Failures: 0, Errors: 0, Skipped: 0, Time elapsed: 0.88 sec
Running org.apache.hadoop.hbase.regionserver.TestSplitTransaction
Tests run: 7, Failures: 0, Errors: 0, Skipped: 0, Time elapsed: 4.963 sec
Running org.apache.hadoop.hbase.regionserver.TestScanDeleteTracker
Tests run: 7, Failures: 0, Errors: 0, Skipped: 0, Time elapsed: 0.203 sec
Running org.apache.hadoop.hbase.regionserver.TestScanWithBloomError
Tests run: 3, Failures: 0, Errors: 0, Skipped: 0, Time elapsed: 0.431 sec
Running org.apache.hadoop.hbase.regionserver.TestKeyValueSkipListSet
Tests run: 4, Failures: 0, Errors: 0, Skipped: 0, Time elapsed: 0.009 sec
Running org.apache.hadoop.hbase.regionserver.TestKeyValueHeap
Tests run: 3, Failures: 0, Errors: 0, Skipped: 0, Time elapsed: 0.09 sec
Running org.apache.hadoop.hbase.regionserver.TestScanner
Tests run: 7, Failures: 0, Errors: 0, Skipped: 0, Time elapsed: 4.538 sec
Running org.apache.hadoop.hbase.regionserver.TestRegionSplitPolicy
Tests run: 6, Failures: 0, Errors: 0, Skipped: 0, Time elapsed: 0.197 sec
Running org.apache.hadoop.hbase.regionserver.TestDefaultStoreEngine
Tests run: 1, Failures: 0, Errors: 0, Skipped: 0, Time elapsed: 0.046 sec
Running org.apache.hadoop.hbase.regionserver.TestHRegionInfo
Tests run: 7, Failures: 0, Errors: 0, Skipped: 0, Time elapsed: 1.12 sec
Running org.apache.hadoop.hbase.regionserver.TestMiniBatchOperationInProgress
Tests run: 1, Failures: 0, Errors: 0, Skipped: 0, Time elapsed: 0.008 sec
Running org.apache.hadoop.hbase.regionserver.TestDefaultCompactSelection
Tests run: 2, Failures: 0, Errors: 0, Skipped: 0, Time elapsed: 0.243 sec
Running org.apache.hadoop.hbase.regionserver.TestMetricsRegionServer
Tests run: 3, Failures: 0, Errors: 0, Skipped: 0, Time elapsed: 0.169 sec
Running org.apache.hadoop.hbase.TestIPv6NIOServerSocketChannel
Tests run: 2, Failures: 0, Errors: 0, Skipped: 0, Time elapsed: 0.038 sec
Running org.apache.hadoop.hbase.filter.TestFilterSerialization
Tests run: 25, Failures: 0, Errors: 0, Skipped: 0, Time elapsed: 0.666 sec
Running org.apache.hadoop.hbase.filter.TestColumnPaginationFilter
Tests run: 1, Failures: 0, Errors: 0, Skipped: 0, Time elapsed: 0.007 sec
Running org.apache.hadoop.hbase.filter.TestPageFilter
Tests run: 2, Failures: 0, Errors: 0, Skipped: 0, Time elapsed: 0.004 sec
Running org.apache.hadoop.hbase.filter.TestParseFilter
Tests run: 34, Failures: 0, Errors: 0, Skipped: 0, Time elapsed: 0.118 sec
Running org.apache.hadoop.hbase.filter.TestFuzzyRowFilter
Tests run: 2, Failures: 0, Errors: 0, Skipped: 0, Time elapsed: 0.059 sec
Running org.apache.hadoop.hbase.filter.TestRandomRowFilter
Tests run: 2, Failures: 0, Errors: 0, Skipped: 0, Time elapsed: 0.306 sec
Running org.apache.hadoop.hbase.filter.TestFirstKeyValueMatchingQualifiersFilter
Tests run: 1, Failures: 0, Errors: 0, Skipped: 0, Time elapsed: 0.004 sec
Running org.apache.hadoop.hbase.filter.TestPrefixFilter
Tests run: 3, Failures: 0, Errors: 0, Skipped: 0, Time elapsed: 0.006 sec
Running org.apache.hadoop.hbase.filter.TestBitComparator
Tests run: 6, Failures: 0, Errors: 0, Skipped: 0, Time elapsed: 0.016 sec
Running org.apache.hadoop.hbase.filter.TestComparatorSerialization
Tests run: 6, Failures: 0, Errors: 0, Skipped: 0, Time elapsed: 0.073 sec
Running org.apache.hadoop.hbase.filter.TestDependentColumnFilter
Tests run: 2, Failures: 0, Errors: 0, Skipped: 0, Time elapsed: 0.14 sec
Running org.apache.hadoop.hbase.filter.TestSingleColumnValueFilter
Tests run: 2, Failures: 0, Errors: 0, Skipped: 0, Time elapsed: 0.019 sec
Running org.apache.hadoop.hbase.filter.TestInclusiveStopFilter
Tests run: 2, Failures: 0, Errors: 0, Skipped: 0, Time elapsed: 0.005 sec
Running org.apache.hadoop.hbase.filter.TestFilterList
Tests run: 6, Failures: 0, Errors: 0, Skipped: 0, Time elapsed: 0.025 sec
Running org.apache.hadoop.hbase.filter.TestFilter
Tests run: 19, Failures: 0, Errors: 0, Skipped: 0, Time elapsed: 2.05 sec
Running org.apache.hadoop.hbase.filter.TestMultipleColumnPrefixFilter
Tests run: 3, Failures: 0, Errors: 0, Skipped: 0, Time elapsed: 3.897 sec
Running org.apache.hadoop.hbase.filter.TestColumnPrefixFilter
Tests run: 2, Failures: 0, Errors: 0, Skipped: 0, Time elapsed: 1.222 sec
Running org.apache.hadoop.hbase.filter.TestSingleColumnValueExcludeFilter
Tests run: 1, Failures: 0, Errors: 0, Skipped: 0, Time elapsed: 0.002 sec
Running org.apache.hadoop.hbase.TestCheckTestClasses
Tests run: 1, Failures: 0, Errors: 0, Skipped: 0, Time elapsed: 5.254 sec
Running org.apache.hadoop.hbase.protobuf.TestProtobufUtil
Tests run: 6, Failures: 0, Errors: 0, Skipped: 0, Time elapsed: 0.041 sec
Running org.apache.hadoop.hbase.security.TestUser
Tests run: 3, Failures: 0, Errors: 0, Skipped: 0, Time elapsed: 0.089 sec
Running org.apache.hadoop.hbase.coprocessor.TestCoprocessorInterface
Tests run: 2, Failures: 0, Errors: 0, Skipped: 0, Time elapsed: 4.132 sec
Running org.apache.hadoop.hbase.coprocessor.TestRegionObserverStacking
Tests run: 1, Failures: 0, Errors: 0, Skipped: 0, Time elapsed: 0.06 sec
Running org.apache.hadoop.hbase.constraint.TestConstraints
Tests run: 6, Failures: 0, Errors: 0, Skipped: 0, Time elapsed: 0.753 sec
Running org.apache.hadoop.hbase.procedure.TestProcedureMember
Tests run: 8, Failures: 0, Errors: 0, Skipped: 0, Time elapsed: 0.696 sec
Running org.apache.hadoop.hbase.procedure.TestProcedureCoordinator
Tests run: 7, Failures: 0, Errors: 0, Skipped: 0, Time elapsed: 0.381 sec
Running org.apache.hadoop.hbase.procedure.TestProcedure
Tests run: 4, Failures: 0, Errors: 0, Skipped: 0, Time elapsed: 0.124 sec
Running org.apache.hadoop.hbase.snapshot.TestWALReferenceTask
Tests run: 1, Failures: 0, Errors: 0, Skipped: 0, Time elapsed: 0.186 sec
Running org.apache.hadoop.hbase.snapshot.TestRestoreSnapshotHelper
Tests run: 1, Failures: 0, Errors: 0, Skipped: 0, Time elapsed: 0.457 sec
Running org.apache.hadoop.hbase.snapshot.TestReferenceRegionHFilesTask
Tests run: 1, Failures: 0, Errors: 0, Skipped: 0, Time elapsed: 0.057 sec
Running org.apache.hadoop.hbase.snapshot.TestSnapshotLogSplitter
Tests run: 2, Failures: 0, Errors: 0, Skipped: 0, Time elapsed: 0.465 sec
Running org.apache.hadoop.hbase.snapshot.TestCopyRecoveredEditsTask
Tests run: 2, Failures: 0, Errors: 0, Skipped: 0, Time elapsed: 0.044 sec
Running org.apache.hadoop.hbase.snapshot.TestSnapshotTask
Tests run: 1, Failures: 0, Errors: 0, Skipped: 0, Time elapsed: 0.003 sec
Running org.apache.hadoop.hbase.errorhandling.TestForeignExceptionDispatcher
Tests run: 3, Failures: 0, Errors: 0, Skipped: 0, Time elapsed: 0.029 sec
Running org.apache.hadoop.hbase.errorhandling.TestTimeoutExceptionInjector
Tests run: 4, Failures: 0, Errors: 0, Skipped: 0, Time elapsed: 0.107 sec
Running org.apache.hadoop.hbase.errorhandling.TestForeignExceptionSerialization
Tests run: 2, Failures: 0, Errors: 0, Skipped: 0, Time elapsed: 0.085 sec
Running org.apache.hadoop.hbase.TestServerName
Tests run: 4, Failures: 0, Errors: 0, Skipped: 0, Time elapsed: 0.095 sec
Running org.apache.hadoop.hbase.master.TestCatalogJanitor
Tests run: 6, Failures: 0, Errors: 0, Skipped: 0, Time elapsed: 10.17 sec
Running org.apache.hadoop.hbase.master.TestClockSkewDetection
Tests run: 1, Failures: 0, Errors: 0, Skipped: 0, Time elapsed: 0.083 sec
Running org.apache.hadoop.hbase.master.cleaner.TestHFileLinkCleaner
Tests run: 1, Failures: 0, Errors: 0, Skipped: 0, Time elapsed: 10.03 sec
Running org.apache.hadoop.hbase.master.cleaner.TestCleanerChore
Tests run: 6, Failures: 0, Errors: 0, Skipped: 0, Time elapsed: 0.142 sec
Running org.apache.hadoop.hbase.master.snapshot.TestSnapshotHFileCleaner
Tests run: 1, Failures: 0, Errors: 0, Skipped: 0, Time elapsed: 0.045 sec
Running org.apache.hadoop.hbase.master.snapshot.TestSnapshotManager
Tests run: 2, Failures: 0, Errors: 0, Skipped: 0, Time elapsed: 0.184 sec
Running org.apache.hadoop.hbase.TestNodeHealthCheckChore
Tests run: 2, Failures: 1, Errors: 0, Skipped: 0, Time elapsed: 132.52 sec <<< FAILURE!
Running org.apache.hadoop.hbase.master.snapshot.TestSnapshotLogCleaner
Tests run: 1, Failures: 0, Errors: 0, Skipped: 0, Time elapsed: 132.52 sec

Results :

Failed tests:   testHealthChecker(org.apache.hadoop.hbase.TestNodeHealthCheckChore): expected:<SUCCESS> but was:<TIMED_OUT>

Tests run: 609, Failures: 1, Errors: 0, Skipped: 0

[INFO]                                                                         
[INFO] ------------------------------------------------------------------------
[INFO] Skipping HBase
[INFO] This project has been banned from the build due to previous failures.
[INFO] ------------------------------------------------------------------------
[INFO]                                                                         
[INFO] ------------------------------------------------------------------------
[INFO] Skipping HBase
[INFO] This project has been banned from the build due to previous failures.
[INFO] ------------------------------------------------------------------------
[INFO] ------------------------------------------------------------------------
[INFO] Reactor Summary:
[INFO] 
[INFO] HBase ............................................. SUCCESS [9.238s]
[INFO] HBase - Common .................................... SUCCESS [20.394s]
[INFO] HBase - Protocol .................................. SUCCESS [9.530s]
[INFO] HBase - Client .................................... SUCCESS [8.487s]
[INFO] HBase - Prefix Tree ............................... SUCCESS [3.584s]
[INFO] HBase - Hadoop Compatibility ...................... SUCCESS [0.563s]
[INFO] HBase - Hadoop One Compatibility .................. SUCCESS [1.600s]
[INFO] HBase - Server .................................... FAILURE [2:34.719s]
[INFO] HBase - Integration Tests ......................... SKIPPED
[INFO] HBase - Examples .................................. SKIPPED
[INFO] ------------------------------------------------------------------------
[INFO] BUILD FAILURE
[INFO] ------------------------------------------------------------------------
[INFO] Total time: 3:29.060s
[INFO] Finished at: Thu Mar 07 19:17:31 UTC 2013
[INFO] Final Memory: 70M/903M
[INFO] ------------------------------------------------------------------------
[ERROR] Failed to execute goal org.apache.maven.plugins:maven-surefire-plugin:2.12-TRUNK-HBASE-2:test (default-test) on project hbase-server: There are test failures.
[ERROR] 
[ERROR] Please refer to <https://builds.apache.org/job/hbase-0.95/ws/0.95/hbase-server/target/surefire-reports> for the individual test results.
[ERROR] -> [Help 1]
[ERROR] 
[ERROR] To see the full stack trace of the errors, re-run Maven with the -e switch.
[ERROR] Re-run Maven using the -X switch to enable full debug logging.
[ERROR] 
[ERROR] For more information about the errors and possible solutions, please read the following articles:
[ERROR] [Help 1] http://cwiki.apache.org/confluence/display/MAVEN/MojoFailureException
[ERROR] 
[ERROR] After correcting the problems, you can resume the build with the command
[ERROR]   mvn <goals> -rf :hbase-server
Build step 'Invoke top-level Maven targets' marked build as failure
Archiving artifacts
Recording test results
Updating HBASE-7994
Updating HBASE-8027

Build failed in Jenkins: hbase-0.95 #35

Posted by Apache Jenkins Server <je...@builds.apache.org>.
See <https://builds.apache.org/job/hbase-0.95/35/changes>

Changes:

[nkeywal] HBASE-8002  Make TimeOut Management for Assignment optional in master and regionservers

------------------------------------------
[...truncated 3717 lines...]
Running org.apache.hadoop.hbase.regionserver.TestMemStore
Tests run: 1, Failures: 0, Errors: 0, Skipped: 0, Time elapsed: 47.027 sec
Tests run: 22, Failures: 0, Errors: 0, Skipped: 0, Time elapsed: 37.871 sec
Tests run: 32, Failures: 0, Errors: 0, Skipped: 1, Time elapsed: 393.253 sec
Running org.apache.hadoop.hbase.regionserver.TestGetClosestAtOrBefore
Tests run: 3, Failures: 0, Errors: 0, Skipped: 0, Time elapsed: 3.7 sec
Running org.apache.hadoop.hbase.regionserver.handler.TestCloseRegionHandler
Tests run: 3, Failures: 0, Errors: 0, Skipped: 0, Time elapsed: 3.278 sec
Running org.apache.hadoop.hbase.regionserver.handler.TestOpenRegionHandler
Tests run: 5, Failures: 0, Errors: 0, Skipped: 0, Time elapsed: 2.714 sec
Running org.apache.hadoop.hbase.regionserver.TestMultiColumnScanner
Tests run: 12, Failures: 0, Errors: 0, Skipped: 0, Time elapsed: 41.271 sec
Running org.apache.hadoop.hbase.regionserver.TestHRegionServerBulkLoad
Running org.apache.hadoop.hbase.regionserver.TestSplitTransactionOnCluster
Tests run: 1, Failures: 0, Errors: 0, Skipped: 0, Time elapsed: 97.92 sec
Running org.apache.hadoop.hbase.regionserver.TestMasterAddressManager
Tests run: 1, Failures: 0, Errors: 0, Skipped: 0, Time elapsed: 9.605 sec
Tests run: 10, Failures: 0, Errors: 0, Skipped: 0, Time elapsed: 174.311 sec
Running org.apache.hadoop.hbase.regionserver.TestSplitLogWorker
Tests run: 5, Failures: 0, Errors: 0, Skipped: 0, Time elapsed: 11.03 sec
Running org.apache.hadoop.hbase.regionserver.wal.TestHLogSplitCompressed
Running org.apache.hadoop.hbase.regionserver.TestSeekOptimizations
Tests run: 6, Failures: 0, Errors: 0, Skipped: 0, Time elapsed: 7.919 sec
Running org.apache.hadoop.hbase.regionserver.TestFSErrorsExposed
Tests run: 3, Failures: 0, Errors: 0, Skipped: 1, Time elapsed: 1.688 sec
Running org.apache.hadoop.hbase.regionserver.TestPriorityRpc
Tests run: 3, Failures: 0, Errors: 0, Skipped: 0, Time elapsed: 4.848 sec
Tests run: 32, Failures: 0, Errors: 0, Skipped: 1, Time elapsed: 507.699 sec
Running org.apache.hadoop.hbase.regionserver.TestRSKilledWhenMasterInitializing
Tests run: 1, Failures: 0, Errors: 0, Skipped: 0, Time elapsed: 186.18 sec
Running org.apache.hadoop.hbase.filter.TestColumnRangeFilter
Tests run: 1, Failures: 0, Errors: 0, Skipped: 0, Time elapsed: 49.686 sec
Running org.apache.hadoop.hbase.filter.TestFilterWithScanLimits
Tests run: 1, Failures: 0, Errors: 0, Skipped: 0, Time elapsed: 31.131 sec
Running org.apache.hadoop.hbase.filter.TestFilterWrapper
Tests run: 1, Failures: 0, Errors: 0, Skipped: 0, Time elapsed: 51.99 sec
Running org.apache.hadoop.hbase.regionserver.TestCompactionState
Running org.apache.hadoop.hbase.TestGlobalMemStoreSize
Tests run: 5, Failures: 0, Errors: 0, Skipped: 0, Time elapsed: 170.021 sec
Tests run: 1, Failures: 0, Errors: 0, Skipped: 0, Time elapsed: 59.272 sec
Running org.apache.hadoop.hbase.security.token.TestTokenAuthentication
Tests run: 2, Failures: 0, Errors: 0, Skipped: 0, Time elapsed: 11.314 sec
Running org.apache.hadoop.hbase.security.token.TestZKSecretWatcher
Tests run: 1, Failures: 0, Errors: 0, Skipped: 0, Time elapsed: 17.002 sec
Running org.apache.hadoop.hbase.security.access.TestZKPermissionsWatcher
Tests run: 1, Failures: 0, Errors: 0, Skipped: 0, Time elapsed: 20.928 sec
Running org.apache.hadoop.hbase.security.access.TestAccessControlFilter
Tests run: 1, Failures: 0, Errors: 0, Skipped: 0, Time elapsed: 26.869 sec
Running org.apache.hadoop.hbase.security.access.TestTablePermissions
Tests run: 7, Failures: 0, Errors: 0, Skipped: 0, Time elapsed: 62.94 sec
Running org.apache.hadoop.hbase.TestHBaseTestingUtility
Tests run: 7, Failures: 0, Errors: 0, Skipped: 0, Time elapsed: 158.062 sec
Running org.apache.hadoop.hbase.TestMultiVersions
Tests run: 3, Failures: 0, Errors: 0, Skipped: 0, Time elapsed: 87.561 sec
Running org.apache.hadoop.hbase.security.access.TestAccessController
Tests run: 35, Failures: 0, Errors: 0, Skipped: 0, Time elapsed: 124.873 sec
Running org.apache.hadoop.hbase.replication.TestReplicationZookeeper
Tests run: 4, Failures: 0, Errors: 0, Skipped: 0, Time elapsed: 6.751 sec
Running org.apache.hadoop.hbase.replication.regionserver.TestReplicationSourceManager
Tests run: 1, Failures: 0, Errors: 0, Skipped: 0, Time elapsed: 4.122 sec
Running org.apache.hadoop.hbase.thrift2.TestThriftHBaseServiceHandler
Tests run: 12, Failures: 0, Errors: 0, Skipped: 0, Time elapsed: 69.637 sec
Running org.apache.hadoop.hbase.replication.regionserver.TestReplicationSink
Tests run: 5, Failures: 0, Errors: 0, Skipped: 0, Time elapsed: 132.832 sec
Running org.apache.hadoop.hbase.TestRegionRebalancing
Tests run: 2, Failures: 0, Errors: 0, Skipped: 0, Time elapsed: 257.362 sec
Running org.apache.hadoop.hbase.replication.TestMasterReplication
Tests run: 2, Failures: 0, Errors: 0, Skipped: 0, Time elapsed: 325.031 sec
Running org.apache.hadoop.hbase.replication.TestReplicationQueueFailoverCompressed
Tests run: 1, Failures: 0, Errors: 0, Skipped: 0, Time elapsed: 302.108 sec
Running org.apache.hadoop.hbase.replication.TestReplicationSource
Tests run: 1, Failures: 0, Errors: 0, Skipped: 0, Time elapsed: 59.787 sec
Running org.apache.hadoop.hbase.replication.TestMultiSlaveReplication
Tests run: 1, Failures: 0, Errors: 0, Skipped: 0, Time elapsed: 212.45 sec
Running org.apache.hadoop.hbase.replication.TestReplicationDisableInactivePeer
Tests run: 1, Failures: 0, Errors: 0, Skipped: 0, Time elapsed: 185.17 sec
Running org.apache.hadoop.hbase.TestLocalHBaseCluster
Tests run: 1, Failures: 0, Errors: 0, Skipped: 0, Time elapsed: 33.899 sec
Running org.apache.hadoop.hbase.coprocessor.TestRegionServerCoprocessorExceptionWithRemove
Tests run: 1, Failures: 0, Errors: 1, Skipped: 0, Time elapsed: 191.705 sec <<< FAILURE!
Running org.apache.hadoop.hbase.TestAcidGuarantees
Tests run: 3, Failures: 0, Errors: 0, Skipped: 0, Time elapsed: 392.578 sec
Running org.apache.hadoop.hbase.replication.TestReplicationQueueFailover
Running org.apache.hadoop.hbase.fs.TestBlockReorder
Tests run: 3, Failures: 0, Errors: 0, Skipped: 0, Time elapsed: 435.669 sec
Tests run: 1, Failures: 0, Errors: 1, Skipped: 0, Time elapsed: 475.135 sec <<< FAILURE!
Running org.apache.hadoop.hbase.coprocessor.TestRegionObserverInterface
Tests run: 7, Failures: 0, Errors: 0, Skipped: 0, Time elapsed: 172.402 sec
Running org.apache.hadoop.hbase.coprocessor.TestMasterObserver
Running org.apache.hadoop.hbase.replication.TestReplicationSmallTests
Running org.apache.hadoop.hbase.coprocessor.TestCoprocessorEndpoint
Tests run: 6, Failures: 0, Errors: 0, Skipped: 0, Time elapsed: 44.088 sec
Tests run: 4, Failures: 0, Errors: 0, Skipped: 0, Time elapsed: 83.781 sec
Tests run: 8, Failures: 1, Errors: 2, Skipped: 0, Time elapsed: 550.31 sec <<< FAILURE!
Running org.apache.hadoop.hbase.coprocessor.TestBigDecimalColumnInterpreter
Running org.apache.hadoop.hbase.coprocessor.TestWALObserver
Tests run: 38, Failures: 0, Errors: 0, Skipped: 0, Time elapsed: 47.288 sec
Tests run: 3, Failures: 0, Errors: 0, Skipped: 0, Time elapsed: 65.695 sec
Running org.apache.hadoop.hbase.coprocessor.TestRegionObserverBypass
Tests run: 2, Failures: 0, Errors: 0, Skipped: 0, Time elapsed: 39.404 sec
Running org.apache.hadoop.hbase.coprocessor.TestRegionServerCoprocessorExceptionWithAbort
Running org.apache.hadoop.hbase.coprocessor.TestMasterCoprocessorExceptionWithAbort
Tests run: 1, Failures: 0, Errors: 0, Skipped: 0, Time elapsed: 56.689 sec
Tests run: 1, Failures: 0, Errors: 0, Skipped: 0, Time elapsed: 50.261 sec
Running org.apache.hadoop.hbase.coprocessor.TestMasterCoprocessorExceptionWithRemove
Running org.apache.hadoop.hbase.coprocessor.TestAggregateProtocol
Tests run: 1, Failures: 0, Errors: 0, Skipped: 0, Time elapsed: 50.232 sec
Tests run: 45, Failures: 0, Errors: 0, Skipped: 0, Time elapsed: 51.093 sec
Running org.apache.hadoop.hbase.coprocessor.TestClassLoading
Tests run: 7, Failures: 0, Errors: 0, Skipped: 0, Time elapsed: 69.7 sec
Running org.apache.hadoop.hbase.procedure.TestZKProcedure
Running org.apache.hadoop.hbase.procedure.TestZKProcedureControllers
Tests run: 4, Failures: 0, Errors: 0, Skipped: 0, Time elapsed: 12.929 sec
Tests run: 4, Failures: 0, Errors: 0, Skipped: 0, Time elapsed: 4.182 sec
Running org.apache.hadoop.hbase.constraint.TestConstraint
Tests run: 5, Failures: 0, Errors: 0, Skipped: 0, Time elapsed: 60.092 sec
Running org.apache.hadoop.hbase.coprocessor.TestRowProcessorEndpoint
Running org.apache.hadoop.hbase.snapshot.TestSnapshotDescriptionUtils
Tests run: 2, Failures: 0, Errors: 0, Skipped: 0, Time elapsed: 1.929 sec
Tests run: 4, Failures: 0, Errors: 0, Skipped: 0, Time elapsed: 63.473 sec
Running org.apache.hadoop.hbase.mapred.TestTableInputFormat
Running org.apache.hadoop.hbase.snapshot.TestExportSnapshot
Tests run: 10, Failures: 0, Errors: 0, Skipped: 0, Time elapsed: 67.616 sec
Tests run: 2, Failures: 0, Errors: 0, Skipped: 0, Time elapsed: 72.047 sec
Running org.apache.hadoop.hbase.snapshot.TestFlushSnapshotFromClient
Tests run: 5, Failures: 0, Errors: 0, Skipped: 0, Time elapsed: 101.916 sec
Running org.apache.hadoop.hbase.master.TestAssignmentManager
Tests run: 15, Failures: 0, Errors: 0, Skipped: 0, Time elapsed: 31.787 sec
Running org.apache.hadoop.hbase.master.TestActiveMasterManager
Tests run: 2, Failures: 0, Errors: 0, Skipped: 0, Time elapsed: 15.653 sec
Running org.apache.hadoop.hbase.master.TestOpenedRegionHandler
Tests run: 2, Failures: 0, Errors: 0, Skipped: 0, Time elapsed: 63.674 sec
Running org.apache.hadoop.hbase.master.TestMasterRestartAfterDisablingTable
Tests run: 1, Failures: 0, Errors: 0, Skipped: 0, Time elapsed: 80.068 sec
Running org.apache.hadoop.hbase.mapred.TestTableMapReduce
Tests run: 1, Failures: 0, Errors: 0, Skipped: 0, Time elapsed: 266.08 sec
Running org.apache.hadoop.hbase.master.TestMasterFailoverBalancerPersistence
Tests run: 1, Failures: 0, Errors: 0, Skipped: 0, Time elapsed: 132.061 sec
Running org.apache.hadoop.hbase.master.TestMasterTransitions
Tests run: 3, Failures: 0, Errors: 0, Skipped: 3, Time elapsed: 36.698 sec
Running org.apache.hadoop.hbase.snapshot.TestRestoreFlushSnapshotFromClient
Running org.apache.hadoop.hbase.master.TestMasterFailover
Tests run: 4, Failures: 0, Errors: 0, Skipped: 0, Time elapsed: 264.553 sec
Running org.apache.hadoop.hbase.master.TestRollingRestart
Running org.apache.hadoop.hbase.master.TestTableLockManager
Tests run: 4, Failures: 0, Errors: 0, Skipped: 0, Time elapsed: 134.986 sec
Tests run: 5, Failures: 0, Errors: 0, Skipped: 0, Time elapsed: 368.447 sec
Running org.apache.hadoop.hbase.master.TestRestartCluster
Tests run: 2, Failures: 0, Errors: 0, Skipped: 0, Time elapsed: 96.169 sec
Running org.apache.hadoop.hbase.master.TestHMasterRPCException
Tests run: 1, Failures: 0, Errors: 0, Skipped: 0, Time elapsed: 5.327 sec
Running org.apache.hadoop.hbase.master.TestMasterStatusServlet
Tests run: 5, Failures: 0, Errors: 0, Skipped: 0, Time elapsed: 8.675 sec
Tests run: 1, Failures: 0, Errors: 0, Skipped: 0, Time elapsed: 172.775 sec
Running org.apache.hadoop.hbase.master.balancer.TestBaseLoadBalancer
Tests run: 3, Failures: 0, Errors: 0, Skipped: 0, Time elapsed: 1.658 sec
Running org.apache.hadoop.hbase.master.balancer.TestDefaultLoadBalancer
Tests run: 1, Failures: 0, Errors: 0, Skipped: 0, Time elapsed: 9.134 sec
Running org.apache.hadoop.hbase.master.TestMasterMetrics
Tests run: 2, Failures: 0, Errors: 0, Skipped: 0, Time elapsed: 70.128 sec
Running org.apache.hadoop.hbase.master.cleaner.TestHFileCleaner
Tests run: 3, Failures: 0, Errors: 0, Skipped: 0, Time elapsed: 23.142 sec
Running org.apache.hadoop.hbase.master.TestMaster
Tests run: 1, Failures: 0, Errors: 0, Skipped: 0, Time elapsed: 40.431 sec
Running org.apache.hadoop.hbase.master.TestAssignmentManagerOnCluster
Running org.apache.hadoop.hbase.master.cleaner.TestLogsCleaner
Tests run: 1, Failures: 0, Errors: 0, Skipped: 0, Time elapsed: 15.62 sec
Tests run: 3, Failures: 0, Errors: 0, Skipped: 0, Time elapsed: 104.305 sec
Running org.apache.hadoop.hbase.master.TestMasterFileSystem
Tests run: 1, Failures: 0, Errors: 0, Skipped: 0, Time elapsed: 29.82 sec
Running org.apache.hadoop.hbase.master.TestMasterShutdown
Tests run: 1, Failures: 0, Errors: 0, Skipped: 0, Time elapsed: 34.956 sec
Running org.apache.hadoop.hbase.master.balancer.TestStochasticLoadBalancer
Tests run: 4, Failures: 0, Errors: 0, Skipped: 0, Time elapsed: 167.762 sec
Running org.apache.hadoop.hbase.master.cleaner.TestSnapshotFromMaster
Tests run: 4, Failures: 0, Errors: 0, Skipped: 0, Time elapsed: 80.928 sec
Running org.apache.hadoop.hbase.master.snapshot.TestSnapshotFileCache
Tests run: 4, Failures: 0, Errors: 0, Skipped: 0, Time elapsed: 45.083 sec
Running org.apache.hadoop.hbase.master.handler.TestTableDescriptorModification
Tests run: 3, Failures: 0, Errors: 0, Skipped: 0, Time elapsed: 110.875 sec
Running org.apache.hadoop.hbase.master.handler.TestTableDeleteFamilyHandler
Tests run: 1, Failures: 0, Errors: 0, Skipped: 0, Time elapsed: 140.945 sec
Running org.apache.hadoop.hbase.master.TestSplitLogManager
Running org.apache.hadoop.hbase.master.TestDeadServer
Tests run: 3, Failures: 0, Errors: 0, Skipped: 0, Time elapsed: 0.679 sec
Tests run: 13, Failures: 0, Errors: 0, Skipped: 0, Time elapsed: 119.21 sec
Running org.apache.hadoop.hbase.master.TestMasterMetricsWrapper
Running org.apache.hadoop.hbase.master.TestMasterNoCluster
Tests run: 3, Failures: 0, Errors: 0, Skipped: 0, Time elapsed: 9.285 sec
Tests run: 1, Failures: 0, Errors: 0, Skipped: 0, Time elapsed: 39.07 sec
Running org.apache.hadoop.hbase.master.TestZKBasedOpenCloseRegion
Tests run: 4, Failures: 0, Errors: 0, Skipped: 0, Time elapsed: 30.99 sec

Results :

Failed tests:   testAddAndRemoveClusters(org.apache.hadoop.hbase.replication.TestReplicationSmallTests): Waited too much time for truncate

Tests in error: 
  testExceptionFromCoprocessorDuringPut(org.apache.hadoop.hbase.coprocessor.TestRegionServerCoprocessorExceptionWithRemove): test timed out after 30000 milliseconds
  queueFailover(org.apache.hadoop.hbase.replication.TestReplicationQueueFailover): test timed out after 300000 milliseconds
  testDisableEnable(org.apache.hadoop.hbase.replication.TestReplicationSmallTests): org.apache.hadoop.hbase.client.RetriesExhaustedException: Failed after attempts=10, exceptions:(..)
  testSimplePutDelete(org.apache.hadoop.hbase.replication.TestReplicationSmallTests): org.apache.hadoop.hbase.client.RetriesExhaustedException: Failed after attempts=10, exceptions:(..)

Tests run: 1457, Failures: 1, Errors: 4, Skipped: 13

[INFO]                                                                         
[INFO] ------------------------------------------------------------------------
[INFO] Skipping HBase
[INFO] This project has been banned from the build due to previous failures.
[INFO] ------------------------------------------------------------------------
[INFO]                                                                         
[INFO] ------------------------------------------------------------------------
[INFO] Skipping HBase
[INFO] This project has been banned from the build due to previous failures.
[INFO] ------------------------------------------------------------------------
[INFO] ------------------------------------------------------------------------
[INFO] Reactor Summary:
[INFO] 
[INFO] HBase ............................................. SUCCESS [6.775s]
[INFO] HBase - Common .................................... SUCCESS [18.698s]
[INFO] HBase - Protocol .................................. SUCCESS [7.714s]
[INFO] HBase - Client .................................... SUCCESS [7.862s]
[INFO] HBase - Prefix Tree ............................... SUCCESS [2.992s]
[INFO] HBase - Hadoop Compatibility ...................... SUCCESS [0.582s]
[INFO] HBase - Hadoop One Compatibility .................. SUCCESS [1.606s]
[INFO] HBase - Server .................................... FAILURE [1:23:03.308s]
[INFO] HBase - Integration Tests ......................... SKIPPED
[INFO] HBase - Examples .................................. SKIPPED
[INFO] ------------------------------------------------------------------------
[INFO] BUILD FAILURE
[INFO] ------------------------------------------------------------------------
[INFO] Total time: 1:23:51.203s
[INFO] Finished at: Thu Mar 07 12:35:00 UTC 2013
[INFO] Final Memory: 74M/1031M
[INFO] ------------------------------------------------------------------------
[ERROR] Failed to execute goal org.apache.maven.plugins:maven-surefire-plugin:2.12-TRUNK-HBASE-2:test (secondPartTestsExecution) on project hbase-server: Failure or timeout -> [Help 1]
[ERROR] 
[ERROR] To see the full stack trace of the errors, re-run Maven with the -e switch.
[ERROR] Re-run Maven using the -X switch to enable full debug logging.
[ERROR] 
[ERROR] For more information about the errors and possible solutions, please read the following articles:
[ERROR] [Help 1] http://cwiki.apache.org/confluence/display/MAVEN/MojoExecutionException
[ERROR] 
[ERROR] After correcting the problems, you can resume the build with the command
[ERROR]   mvn <goals> -rf :hbase-server
Build step 'Invoke top-level Maven targets' marked build as failure
Archiving artifacts
Recording test results
Updating HBASE-8002

Build failed in Jenkins: hbase-0.95 #34

Posted by Apache Jenkins Server <je...@builds.apache.org>.
See <https://builds.apache.org/job/hbase-0.95/34/changes>

Changes:

[stack] HBASE-7996 Clean up resource leak in MultiTableInputFormat

[stack] HBASE-8021 TestSplitTransactionOnCluster.testShouldThrowIOExceptionIfStoreFileSizeIsEmptyAndShouldSuccessfullyExecuteRollback() fails consistently

[stack] HBASE-7982 TestReplicationQueueFailover* runs for a minute, spews 3/4million lines complaining 'Filesystem closed', has an NPE, and still passes?

------------------------------------------
[...truncated 3948 lines...]
Tests run: 3, Failures: 0, Errors: 0, Skipped: 0, Time elapsed: 4.572 sec
Running org.apache.hadoop.hbase.master.TestMasterMetricsWrapper
Tests run: 1, Failures: 0, Errors: 0, Skipped: 0, Time elapsed: 13.678 sec
Running org.apache.hadoop.hbase.master.TestZKBasedOpenCloseRegion
Tests run: 4, Failures: 0, Errors: 0, Skipped: 0, Time elapsed: 16.341 sec
Running org.apache.hadoop.hbase.master.TestSplitLogManager
Tests run: 13, Failures: 0, Errors: 0, Skipped: 0, Time elapsed: 82.128 sec

Results :

Tests run: 1468, Failures: 0, Errors: 0, Skipped: 13

[INFO] 
[INFO] --- maven-jar-plugin:2.4:test-jar (default) @ hbase-server ---
[INFO] Building jar: <https://builds.apache.org/job/hbase-0.95/ws/0.95/hbase-server/target/hbase-server-0.95-SNAPSHOT-tests.jar>
[INFO] 
[INFO] --- maven-source-plugin:2.2.1:jar-no-fork (attach-sources) @ hbase-server ---
[INFO] Building jar: <https://builds.apache.org/job/hbase-0.95/ws/0.95/hbase-server/target/hbase-server-0.95-SNAPSHOT-sources.jar>
[INFO] 
[INFO] --- maven-jar-plugin:2.4:jar (default-jar) @ hbase-server ---
[INFO] Building jar: <https://builds.apache.org/job/hbase-0.95/ws/0.95/hbase-server/target/hbase-server-0.95-SNAPSHOT.jar>
[INFO] 
[INFO] --- apache-rat-plugin:0.8:check (default) @ hbase-server ---
[INFO] Exclude: **/*.log
[INFO] Exclude: **/.*
[INFO] Exclude: **/*.tgz
[INFO] Exclude: **/*.orig
[INFO] Exclude: **/test/**
[INFO] Exclude: **/8e8ab58dcf39412da19833fcd8f687ac
[INFO] Exclude: **/.git/**
[INFO] Exclude: **/.idea/**
[INFO] Exclude: **/*.iml
[INFO] Exclude: **/target/**
[INFO] Exclude: **/CHANGES.txt
[INFO] Exclude: **/generated/**
[INFO] Exclude: **/gen-*/**
[INFO] Exclude: **/conf/*
[INFO] Exclude: **/*.avpr
[INFO] Exclude: **/*.svg
[INFO] Exclude: **/META-INF/services/**
[INFO] Exclude: **/html5shiv.js
[INFO] Exclude: **/jquery.min.js
[INFO] Exclude: **/*.vm
[INFO] Exclude: **/control
[INFO] Exclude: **/conffile
[INFO] Exclude: docs/*
[INFO] Exclude: **/src/site/resources/css/freebsd_docbook.css
[INFO] Exclude: .git/**
[INFO] Exclude: .svn/**
[INFO]                                                                         
[INFO] ------------------------------------------------------------------------
[INFO] Building HBase - Integration Tests 0.95-SNAPSHOT
[INFO] ------------------------------------------------------------------------
[INFO] 
[INFO] --- maven-remote-resources-plugin:1.4:process (default) @ hbase-it ---
[INFO] 
[INFO] --- maven-resources-plugin:2.6:resources (default-resources) @ hbase-it ---
[INFO] Using 'UTF-8' encoding to copy filtered resources.
[INFO] skip non existing resourceDirectory <https://builds.apache.org/job/hbase-0.95/ws/0.95/hbase-it/src/main/resources>
[INFO] Copying 3 resources
[INFO] 
[INFO] --- maven-compiler-plugin:2.5.1:compile (default-compile) @ hbase-it ---
[INFO] No sources to compile
[INFO] 
[INFO] --- maven-resources-plugin:2.6:testResources (default-testResources) @ hbase-it ---
[INFO] Using 'UTF-8' encoding to copy filtered resources.
[INFO] Copying 6 resources
[INFO] Copying 3 resources
[INFO] 
[INFO] --- maven-compiler-plugin:2.5.1:testCompile (default-testCompile) @ hbase-it ---
[INFO] Compiling 12 source files to <https://builds.apache.org/job/hbase-0.95/ws/0.95/hbase-it/target/test-classes>
[INFO] 
[INFO] --- maven-surefire-plugin:2.12-TRUNK-HBASE-2:test (default-test) @ hbase-it ---
[INFO] Surefire report directory: <https://builds.apache.org/job/hbase-0.95/ws/0.95/hbase-it/target/surefire-reports>
[INFO] Using configured provider org.apache.maven.surefire.junitcore.JUnitCoreProvider

-------------------------------------------------------
 T E S T S
-------------------------------------------------------

Results :

Tests run: 0, Failures: 0, Errors: 0, Skipped: 0

[INFO] 
[INFO] --- maven-dependency-plugin:2.1:build-classpath (create-hbase-generated-classpath) @ hbase-it ---
[INFO] Wrote classpath file '<https://builds.apache.org/job/hbase-0.95/ws/0.95/hbase-it/target/../../target/cached_classpath.txt'.>
[INFO] 
[INFO] --- maven-surefire-plugin:2.12-TRUNK-HBASE-2:test (secondPartTestsExecution) @ hbase-it ---
[INFO] Surefire report directory: <https://builds.apache.org/job/hbase-0.95/ws/0.95/hbase-it/target/surefire-reports>
[INFO] Using configured provider org.apache.maven.surefire.junitcore.JUnitCoreProvider

-------------------------------------------------------
 T E S T S
-------------------------------------------------------

-------------------------------------------------------
 T E S T S
-------------------------------------------------------

Results :

Tests run: 0, Failures: 0, Errors: 0, Skipped: 0

[INFO] 
[INFO] --- maven-jar-plugin:2.4:test-jar (default) @ hbase-it ---
[INFO] Building jar: <https://builds.apache.org/job/hbase-0.95/ws/0.95/hbase-it/target/hbase-it-0.95-SNAPSHOT-tests.jar>
[INFO] 
[INFO] --- maven-jar-plugin:2.4:jar (default-jar) @ hbase-it ---
[INFO] Building jar: <https://builds.apache.org/job/hbase-0.95/ws/0.95/hbase-it/target/hbase-it-0.95-SNAPSHOT.jar>
[INFO] 
[INFO] --- apache-rat-plugin:0.8:check (default) @ hbase-it ---
[INFO] Exclude: **/*.log
[INFO] Exclude: **/.*
[INFO] Exclude: **/*.tgz
[INFO] Exclude: **/*.orig
[INFO] Exclude: **/test/**
[INFO] Exclude: **/8e8ab58dcf39412da19833fcd8f687ac
[INFO] Exclude: **/.git/**
[INFO] Exclude: **/.idea/**
[INFO] Exclude: **/*.iml
[INFO] Exclude: **/target/**
[INFO] Exclude: **/CHANGES.txt
[INFO] Exclude: **/generated/**
[INFO] Exclude: **/gen-*/**
[INFO] Exclude: **/conf/*
[INFO] Exclude: **/*.avpr
[INFO] Exclude: **/*.svg
[INFO] Exclude: **/META-INF/services/**
[INFO] Exclude: **/html5shiv.js
[INFO] Exclude: **/jquery.min.js
[INFO] Exclude: **/*.vm
[INFO] Exclude: **/control
[INFO] Exclude: **/conffile
[INFO] Exclude: docs/*
[INFO] Exclude: **/src/site/resources/css/freebsd_docbook.css
[INFO] Exclude: .git/**
[INFO] Exclude: .svn/**
[INFO]                                                                         
[INFO] ------------------------------------------------------------------------
[INFO] Building HBase - Examples 0.95-SNAPSHOT
[INFO] ------------------------------------------------------------------------
[INFO] 
[INFO] --- maven-remote-resources-plugin:1.4:process (default) @ hbase-examples ---
[INFO] 
[INFO] --- maven-resources-plugin:2.6:resources (default-resources) @ hbase-examples ---
[INFO] Using 'UTF-8' encoding to copy filtered resources.
[INFO] skip non existing resourceDirectory <https://builds.apache.org/job/hbase-0.95/ws/0.95/hbase-examples/src/main/resources>
[INFO] Copying 3 resources
[INFO] 
[INFO] --- maven-compiler-plugin:2.5.1:compile (default-compile) @ hbase-examples ---
[INFO] Compiling 20 source files to <https://builds.apache.org/job/hbase-0.95/ws/0.95/hbase-examples/target/classes>
[INFO] 
[INFO] --- maven-resources-plugin:2.6:testResources (default-testResources) @ hbase-examples ---
[INFO] Using 'UTF-8' encoding to copy filtered resources.
[INFO] skip non existing resourceDirectory <https://builds.apache.org/job/hbase-0.95/ws/0.95/hbase-examples/src/test/resources>
[INFO] Copying 3 resources
[INFO] 
[INFO] --- maven-compiler-plugin:2.5.1:testCompile (default-testCompile) @ hbase-examples ---
[INFO] Compiling 3 source files to <https://builds.apache.org/job/hbase-0.95/ws/0.95/hbase-examples/target/test-classes>
[INFO] 
[INFO] --- maven-surefire-plugin:2.12-TRUNK-HBASE-2:test (default-test) @ hbase-examples ---
[INFO] Surefire report directory: <https://builds.apache.org/job/hbase-0.95/ws/0.95/hbase-examples/target/surefire-reports>
[INFO] Using configured provider org.apache.maven.surefire.junitcore.JUnitCoreProvider

-------------------------------------------------------
 T E S T S
-------------------------------------------------------

Results :

Tests run: 0, Failures: 0, Errors: 0, Skipped: 0

[INFO] 
[INFO] --- maven-surefire-plugin:2.12-TRUNK-HBASE-2:test (secondPartTestsExecution) @ hbase-examples ---
[INFO] Surefire report directory: <https://builds.apache.org/job/hbase-0.95/ws/0.95/hbase-examples/target/surefire-reports>
[INFO] Using configured provider org.apache.maven.surefire.junitcore.JUnitCoreProvider

-------------------------------------------------------
 T E S T S
-------------------------------------------------------

-------------------------------------------------------
 T E S T S
-------------------------------------------------------
Running org.apache.hadoop.hbase.coprocessor.example.TestBulkDeleteProtocol
Tests run: 8, Failures: 0, Errors: 0, Skipped: 8, Time elapsed: 12.979 sec
Running org.apache.hadoop.hbase.coprocessor.example.TestZooKeeperScanPolicyObserver
Tests run: 1, Failures: 0, Errors: 1, Skipped: 0, Time elapsed: 218.469 sec <<< FAILURE!
Running org.apache.hadoop.hbase.coprocessor.example.TestRowCountEndpoint
Tests run: 1, Failures: 0, Errors: 1, Skipped: 0, Time elapsed: 218.903 sec <<< FAILURE!

Results :

Tests in error: 
  org.apache.hadoop.hbase.coprocessor.example.TestZooKeeperScanPolicyObserver: Shutting down
  org.apache.hadoop.hbase.coprocessor.example.TestRowCountEndpoint: Shutting down

Tests run: 10, Failures: 0, Errors: 2, Skipped: 8

[INFO]                                                                         
[INFO] ------------------------------------------------------------------------
[INFO] Skipping HBase
[INFO] This project has been banned from the build due to previous failures.
[INFO] ------------------------------------------------------------------------
[INFO]                                                                         
[INFO] ------------------------------------------------------------------------
[INFO] Skipping HBase
[INFO] This project has been banned from the build due to previous failures.
[INFO] ------------------------------------------------------------------------
[INFO] ------------------------------------------------------------------------
[INFO] Reactor Summary:
[INFO] 
[INFO] HBase ............................................. SUCCESS [7.012s]
[INFO] HBase - Common .................................... SUCCESS [20.599s]
[INFO] HBase - Protocol .................................. SUCCESS [7.779s]
[INFO] HBase - Client .................................... SUCCESS [8.058s]
[INFO] HBase - Prefix Tree ............................... SUCCESS [3.127s]
[INFO] HBase - Hadoop Compatibility ...................... SUCCESS [0.747s]
[INFO] HBase - Hadoop One Compatibility .................. SUCCESS [1.856s]
[INFO] HBase - Server .................................... SUCCESS [40:22.091s]
[INFO] HBase - Integration Tests ......................... SUCCESS [3.547s]
[INFO] HBase - Examples .................................. FAILURE [3:41.871s]
[INFO] ------------------------------------------------------------------------
[INFO] BUILD FAILURE
[INFO] ------------------------------------------------------------------------
[INFO] Total time: 44:57.862s
[INFO] Finished at: Thu Mar 07 08:44:39 UTC 2013
[INFO] Final Memory: 77M/684M
[INFO] ------------------------------------------------------------------------
[ERROR] Failed to execute goal org.apache.maven.plugins:maven-surefire-plugin:2.12-TRUNK-HBASE-2:test (secondPartTestsExecution) on project hbase-examples: There are test failures.
[ERROR] 
[ERROR] Please refer to <https://builds.apache.org/job/hbase-0.95/ws/0.95/hbase-examples/target/surefire-reports> for the individual test results.
[ERROR] -> [Help 1]
[ERROR] 
[ERROR] To see the full stack trace of the errors, re-run Maven with the -e switch.
[ERROR] Re-run Maven using the -X switch to enable full debug logging.
[ERROR] 
[ERROR] For more information about the errors and possible solutions, please read the following articles:
[ERROR] [Help 1] http://cwiki.apache.org/confluence/display/MAVEN/MojoFailureException
[ERROR] 
[ERROR] After correcting the problems, you can resume the build with the command
[ERROR]   mvn <goals> -rf :hbase-examples
Build step 'Invoke top-level Maven targets' marked build as failure
Archiving artifacts
Recording test results
Updating HBASE-7996
Updating HBASE-7982
Updating HBASE-8021

Re: Build failed in Jenkins: hbase-0.95 #33

Posted by Stack <st...@duboce.net>.
Any clues on the
'org.apache.hadoop.hbase.util.TestHBaseFsck.testQuarantineMissingFamdir'
failure here?

The others should be fixed on next runs.

Thanks,
St.Ack


On Wed, Mar 6, 2013 at 11:30 PM, Apache Jenkins Server <
jenkins@builds.apache.org> wrote:

> See <https://builds.apache.org/job/hbase-0.95/33/changes>
>
> Changes:
>
> [larsh] HBASE-7153 print gc option in hbase-env.sh affects hbase zkcli
> (Dave Latham and LarsH)
>
> ------------------------------------------
> [...truncated 3764 lines...]
> Tests run: 7, Failures: 0, Errors: 0, Skipped: 0, Time elapsed: 26.516 sec
> Running org.apache.hadoop.hbase.regionserver.TestHRegionOnCluster
> Tests run: 1, Failures: 0, Errors: 0, Skipped: 0, Time elapsed: 21.014 sec
> Running org.apache.hadoop.hbase.regionserver.TestHRegionBusyWait
> Tests run: 63, Failures: 0, Errors: 0, Skipped: 0, Time elapsed: 31.789 sec
> Running org.apache.hadoop.hbase.regionserver.TestParallelPut
> Tests run: 2, Failures: 0, Errors: 0, Skipped: 0, Time elapsed: 3.24 sec
> Running org.apache.hadoop.hbase.regionserver.TestPriorityRpc
> Tests run: 3, Failures: 0, Errors: 0, Skipped: 0, Time elapsed: 0.999 sec
> Running org.apache.hadoop.hbase.regionserver.TestSeekOptimizations
> Tests run: 6, Failures: 0, Errors: 0, Skipped: 0, Time elapsed: 2.129 sec
> Running org.apache.hadoop.hbase.regionserver.handler.TestCloseRegionHandler
> Tests run: 3, Failures: 0, Errors: 0, Skipped: 0, Time elapsed: 1.205 sec
> Running org.apache.hadoop.hbase.regionserver.handler.TestOpenRegionHandler
> Tests run: 5, Failures: 0, Errors: 0, Skipped: 0, Time elapsed: 0.998 sec
> Running org.apache.hadoop.hbase.regionserver.TestBlocksRead
> Tests run: 4, Failures: 0, Errors: 0, Skipped: 0, Time elapsed: 1.095 sec
> Running org.apache.hadoop.hbase.regionserver.TestCompoundBloomFilter
> Tests run: 3, Failures: 0, Errors: 0, Skipped: 0, Time elapsed: 13.303 sec
> Running org.apache.hadoop.hbase.regionserver.TestStoreScanner
> Tests run: 16, Failures: 0, Errors: 0, Skipped: 0, Time elapsed: 0.167 sec
> Running org.apache.hadoop.hbase.regionserver.TestSplitLogWorker
> Tests run: 5, Failures: 0, Errors: 0, Skipped: 0, Time elapsed: 2.594 sec
> Running org.apache.hadoop.hbase.regionserver.TestStoreFileBlockCacheSummary
> Tests run: 1, Failures: 0, Errors: 0, Skipped: 0, Time elapsed: 14.421 sec
> Running org.apache.hadoop.hbase.regionserver.wal.TestLogRolling
> Running org.apache.hadoop.hbase.regionserver.TestServerCustomProtocol
> Tests run: 7, Failures: 0, Errors: 0, Skipped: 0, Time elapsed: 44.105 sec
> Tests run: 2, Failures: 0, Errors: 0, Skipped: 0, Time elapsed: 260.764 sec
> Running org.apache.hadoop.hbase.regionserver.TestCompaction
> Tests run: 17, Failures: 0, Errors: 0, Skipped: 0, Time elapsed: 32.274 sec
> Running org.apache.hadoop.hbase.regionserver.TestMultiColumnScanner
> Tests run: 12, Failures: 0, Errors: 0, Skipped: 0, Time elapsed: 23.826 sec
> Running org.apache.hadoop.hbase.regionserver.TestMasterAddressManager
> Tests run: 1, Failures: 0, Errors: 0, Skipped: 0, Time elapsed: 0.595 sec
> Running org.apache.hadoop.hbase.regionserver.TestClusterId
> Tests run: 1, Failures: 0, Errors: 0, Skipped: 0, Time elapsed: 29.576 sec
> Running org.apache.hadoop.hbase.regionserver.TestHRegionServerBulkLoad
> Tests run: 1, Failures: 0, Errors: 0, Skipped: 0, Time elapsed: 44.907 sec
> Running
> org.apache.hadoop.hbase.backup.example.TestZooKeeperTableArchiveClient
> Tests run: 3, Failures: 0, Errors: 0, Skipped: 0, Time elapsed: 5.63 sec
> Running org.apache.hadoop.hbase.TestLocalHBaseCluster
> Tests run: 1, Failures: 0, Errors: 0, Skipped: 0, Time elapsed: 10.22 sec
> Running org.apache.hadoop.hbase.security.token.TestTokenAuthentication
> Tests run: 2, Failures: 0, Errors: 0, Skipped: 0, Time elapsed: 2.548 sec
> Running org.apache.hadoop.hbase.regionserver.TestHRegion
> Tests run: 62, Failures: 0, Errors: 0, Skipped: 0, Time elapsed: 29.044 sec
> Running org.apache.hadoop.hbase.regionserver.TestEndToEndSplitTransaction
> Tests run: 2, Failures: 0, Errors: 0, Skipped: 0, Time elapsed: 61.255 sec
> Running org.apache.hadoop.hbase.security.token.TestZKSecretWatcher
> Tests run: 1, Failures: 0, Errors: 0, Skipped: 0, Time elapsed: 15.494 sec
> Running org.apache.hadoop.hbase.security.access.TestZKPermissionsWatcher
> Tests run: 1, Failures: 0, Errors: 0, Skipped: 0, Time elapsed: 12.004 sec
> Running org.apache.hadoop.hbase.security.access.TestAccessControlFilter
> Tests run: 1, Failures: 0, Errors: 0, Skipped: 0, Time elapsed: 15.211 sec
> Running org.apache.hadoop.hbase.security.access.TestTablePermissions
> Tests run: 7, Failures: 0, Errors: 0, Skipped: 0, Time elapsed: 26.271 sec
> Running org.apache.hadoop.hbase.ipc.TestDelayedRpc
> Tests run: 4, Failures: 0, Errors: 0, Skipped: 0, Time elapsed: 2.749 sec
> Running org.apache.hadoop.hbase.ipc.TestHBaseClient
> Tests run: 1, Failures: 0, Errors: 0, Skipped: 0, Time elapsed: 0.2 sec
> Running org.apache.hadoop.hbase.ipc.TestProtoBufRpc
> Tests run: 1, Failures: 0, Errors: 0, Skipped: 0, Time elapsed: 0.791 sec
> Running org.apache.hadoop.hbase.TestGlobalMemStoreSize
> Tests run: 1, Failures: 0, Errors: 0, Skipped: 0, Time elapsed: 15.337 sec
> Running org.apache.hadoop.hbase.TestFullLogReconstruction
> Tests run: 1, Failures: 0, Errors: 0, Skipped: 0, Time elapsed: 42.121 sec
> Running org.apache.hadoop.hbase.security.access.TestAccessController
> Tests run: 35, Failures: 0, Errors: 0, Skipped: 0, Time elapsed: 55.354 sec
> Running org.apache.hadoop.hbase.rest.TestSchemaResource
> Tests run: 2, Failures: 0, Errors: 0, Skipped: 0, Time elapsed: 19.895 sec
> Running org.apache.hadoop.hbase.constraint.TestConstraint
> Tests run: 5, Failures: 0, Errors: 0, Skipped: 0, Time elapsed: 25.114 sec
> Running org.apache.hadoop.hbase.rest.client.TestRemoteAdmin
> Tests run: 1, Failures: 0, Errors: 0, Skipped: 0, Time elapsed: 13.78 sec
> Running org.apache.hadoop.hbase.rest.client.TestRemoteTable
> Tests run: 4, Failures: 0, Errors: 0, Skipped: 0, Time elapsed: 13.063 sec
> Running org.apache.hadoop.hbase.rest.TestMultiRowResource
> Tests run: 3, Failures: 0, Errors: 0, Skipped: 0, Time elapsed: 12.78 sec
> Running org.apache.hadoop.hbase.rest.TestTableResource
> Tests run: 8, Failures: 0, Errors: 0, Skipped: 0, Time elapsed: 22.833 sec
> Running org.apache.hadoop.hbase.rest.TestGzipFilter
> Tests run: 2, Failures: 0, Errors: 0, Skipped: 0, Time elapsed: 15.619 sec
> Running org.apache.hadoop.hbase.rest.TestRowResource
> Tests run: 12, Failures: 0, Errors: 0, Skipped: 0, Time elapsed: 16.49 sec
> Running org.apache.hadoop.hbase.rest.TestVersionResource
> Tests run: 7, Failures: 0, Errors: 0, Skipped: 0, Time elapsed: 13.37 sec
> Running org.apache.hadoop.hbase.rest.TestStatusResource
> Tests run: 2, Failures: 0, Errors: 0, Skipped: 0, Time elapsed: 11.632 sec
> Running org.apache.hadoop.hbase.rest.TestScannerResource
> Tests run: 5, Failures: 0, Errors: 0, Skipped: 0, Time elapsed: 24.116 sec
> Running org.apache.hadoop.hbase.io.hfile.TestHFileBlockIndex
> Tests run: 10, Failures: 0, Errors: 0, Skipped: 0, Time elapsed: 6.621 sec
> Running org.apache.hadoop.hbase.backup.TestHFileArchiving
> Tests run: 5, Failures: 0, Errors: 0, Skipped: 0, Time elapsed: 168.809 sec
> Running org.apache.hadoop.hbase.rest.TestScannersWithFilters
> Tests run: 10, Failures: 0, Errors: 0, Skipped: 0, Time elapsed: 15.758 sec
> Running org.apache.hadoop.hbase.trace.TestHTraceHooks
> Tests run: 1, Failures: 0, Errors: 0, Skipped: 0, Time elapsed: 12.976 sec
> Running org.apache.hadoop.hbase.io.hfile.TestHFileSeek
> Tests run: 1, Failures: 0, Errors: 0, Skipped: 0, Time elapsed: 4.033 sec
> Running org.apache.hadoop.hbase.io.hfile.TestHFilePerformance
> Tests run: 1, Failures: 0, Errors: 0, Skipped: 0, Time elapsed: 3.65 sec
> Running org.apache.hadoop.hbase.regionserver.TestJoinedScanners
> Tests run: 1, Failures: 0, Errors: 0, Skipped: 0, Time elapsed: 297.46 sec
> Running org.apache.hadoop.hbase.io.hfile.TestForceCacheImportantBlocks
> Tests run: 2, Failures: 0, Errors: 0, Skipped: 0, Time elapsed: 21.279 sec
> Running org.apache.hadoop.hbase.io.hfile.slab.TestSlabCache
> Tests run: 7, Failures: 0, Errors: 0, Skipped: 0, Time elapsed: 14.038 sec
> Running org.apache.hadoop.hbase.io.hfile.TestCacheOnWrite
> Tests run: 36, Failures: 0, Errors: 0, Skipped: 0, Time elapsed: 29.33 sec
> Running org.apache.hadoop.hbase.io.hfile.slab.TestSingleSizeCache
> Tests run: 5, Failures: 0, Errors: 0, Skipped: 0, Time elapsed: 20.056 sec
> Running org.apache.hadoop.hbase.io.hfile.TestHFileBlock
> Tests run: 14, Failures: 0, Errors: 0, Skipped: 0, Time elapsed: 47.779 sec
> Running org.apache.hadoop.hbase.io.hfile.TestScannerSelectionUsingTTL
> Tests run: 6, Failures: 0, Errors: 0, Skipped: 0, Time elapsed: 61.716 sec
> Running org.apache.hadoop.hbase.io.encoding.TestEncodedSeekers
> Tests run: 10, Failures: 0, Errors: 0, Skipped: 0, Time elapsed: 33.423 sec
> Running org.apache.hadoop.hbase.io.encoding.TestBufferedDataBlockEncoder
> Tests run: 1, Failures: 0, Errors: 0, Skipped: 0, Time elapsed: 12.87 sec
> Running org.apache.hadoop.hbase.io.encoding.TestLoadAndSwitchEncodeOnDisk
> Tests run: 1, Failures: 0, Errors: 0, Skipped: 0, Time elapsed: 23.256 sec
> Running org.apache.hadoop.hbase.io.TestFileLink
> Tests run: 3, Failures: 0, Errors: 0, Skipped: 0, Time elapsed: 73.582 sec
> Running org.apache.hadoop.hbase.TestRegionRebalancing
> Tests run: 2, Failures: 0, Errors: 0, Skipped: 0, Time elapsed: 31.273 sec
> Running org.apache.hadoop.hbase.mapred.TestTableInputFormat
> Tests run: 10, Failures: 0, Errors: 0, Skipped: 0, Time elapsed: 21.847 sec
> Running org.apache.hadoop.hbase.io.encoding.TestDataBlockEncoders
> Tests run: 12, Failures: 0, Errors: 0, Skipped: 0, Time elapsed: 80.925 sec
> Running
> org.apache.hadoop.hbase.replication.TestReplicationDisableInactivePeer
> Tests run: 1, Failures: 0, Errors: 0, Skipped: 0, Time elapsed: 46.696 sec
> Running org.apache.hadoop.hbase.replication.TestReplicationZookeeper
> Tests run: 4, Failures: 0, Errors: 0, Skipped: 0, Time elapsed: 0.754 sec
> Running
> org.apache.hadoop.hbase.replication.regionserver.TestReplicationSink
> Tests run: 5, Failures: 0, Errors: 0, Skipped: 0, Time elapsed: 16.655 sec
> Running
> org.apache.hadoop.hbase.replication.regionserver.TestReplicationSourceManager
> Tests run: 1, Failures: 0, Errors: 0, Skipped: 0, Time elapsed: 1.01 sec
> Running org.apache.hadoop.hbase.replication.TestReplicationSource
> Tests run: 1, Failures: 0, Errors: 0, Skipped: 0, Time elapsed: 2.144 sec
> Running
> org.apache.hadoop.hbase.replication.TestReplicationQueueFailoverCompressed
> Tests run: 1, Failures: 1, Errors: 0, Skipped: 0, Time elapsed: 71.391 sec
> <<< FAILURE!
> Running org.apache.hadoop.hbase.replication.TestReplicationQueueFailover
> Running org.apache.hadoop.hbase.io.encoding.TestChangingEncoding
> Tests run: 4, Failures: 0, Errors: 0, Skipped: 0, Time elapsed: 169.281 sec
> Tests run: 1, Failures: 0, Errors: 0, Skipped: 0, Time elapsed: 72.32 sec
> Running org.apache.hadoop.hbase.replication.TestMultiSlaveReplication
> Tests run: 1, Failures: 0, Errors: 0, Skipped: 0, Time elapsed: 37.271 sec
> Running org.apache.hadoop.hbase.util.TestFSTableDescriptors
> Tests run: 11, Failures: 0, Errors: 0, Skipped: 0, Time elapsed: 0.798 sec
> Running org.apache.hadoop.hbase.mapred.TestTableMapReduce
> Tests run: 1, Failures: 0, Errors: 0, Skipped: 0, Time elapsed: 117.218 sec
> Running org.apache.hadoop.hbase.util.TestIdLock
> Tests run: 1, Failures: 0, Errors: 0, Skipped: 0, Time elapsed: 15.261 sec
> Running org.apache.hadoop.hbase.util.TestMergeTool
> Tests run: 1, Failures: 0, Errors: 0, Skipped: 0, Time elapsed: 24.368 sec
> Running org.apache.hadoop.hbase.replication.TestReplicationSmallTests
> Tests run: 8, Failures: 0, Errors: 0, Skipped: 0, Time elapsed: 68.536 sec
> Running org.apache.hadoop.hbase.util.TestMergeTable
> Tests run: 1, Failures: 0, Errors: 0, Skipped: 0, Time elapsed: 26.274 sec
> Running org.apache.hadoop.hbase.replication.TestMasterReplication
> Tests run: 2, Failures: 0, Errors: 0, Skipped: 0, Time elapsed: 63.505 sec
> Running org.apache.hadoop.hbase.util.TestFSUtils
> Tests run: 5, Failures: 0, Errors: 0, Skipped: 0, Time elapsed: 19 sec
> Running org.apache.hadoop.hbase.util.TestProcessBasedCluster
> Tests run: 1, Failures: 0, Errors: 0, Skipped: 0, Time elapsed: 0.416 sec
> Running org.apache.hadoop.hbase.util.TestRegionSplitter
> Tests run: 5, Failures: 0, Errors: 0, Skipped: 0, Time elapsed: 16.095 sec
> Running org.apache.hadoop.hbase.util.TestMiniClusterLoadSequential
> Tests run: 4, Failures: 0, Errors: 0, Skipped: 0, Time elapsed: 77.224 sec
> Running org.apache.hadoop.hbase.util.TestFSVisitor
> Tests run: 3, Failures: 0, Errors: 0, Skipped: 0, Time elapsed: 1.437 sec
> Running org.apache.hadoop.hbase.util.TestCoprocessorScanPolicy
> Tests run: 4, Failures: 0, Errors: 0, Skipped: 0, Time elapsed: 21.575 sec
> Running org.apache.hadoop.hbase.util.TestMiniClusterLoadParallel
> Tests run: 4, Failures: 0, Errors: 0, Skipped: 0, Time elapsed: 76.749 sec
> Running org.apache.hadoop.hbase.util.hbck.TestOfflineMetaRebuildBase
> Tests run: 1, Failures: 0, Errors: 0, Skipped: 0, Time elapsed: 23.858 sec
> Running org.apache.hadoop.hbase.util.TestDefaultEnvironmentEdge
> Tests run: 1, Failures: 0, Errors: 0, Skipped: 0, Time elapsed: 0.189 sec
> Running org.apache.hadoop.hbase.TestInfoServers
> Tests run: 3, Failures: 0, Errors: 0, Skipped: 0, Time elapsed: 12.554 sec
> Running org.apache.hadoop.hbase.util.hbck.TestOfflineMetaRebuildOverlap
> Tests run: 1, Failures: 0, Errors: 0, Skipped: 0, Time elapsed: 22.875 sec
> Running org.apache.hadoop.hbase.util.hbck.TestOfflineMetaRebuildHole
> Tests run: 1, Failures: 0, Errors: 0, Skipped: 0, Time elapsed: 21.867 sec
> Running org.apache.hadoop.hbase.util.TestMiniClusterLoadEncoded
> Tests run: 5, Failures: 0, Errors: 0, Skipped: 0, Time elapsed: 61.114 sec
> Running org.apache.hadoop.hbase.util.TestHBaseFsck
> Tests run: 34, Failures: 0, Errors: 1, Skipped: 0, Time elapsed: 225 sec
> <<< FAILURE!
>
> Results :
>
> Failed tests:
> testShouldThrowIOExceptionIfStoreFileSizeIsEmptyAndShouldSuccessfullyExecuteRollback(org.apache.hadoop.hbase.regionserver.TestSplitTransactionOnCluster):
> not able to find a splittable region
>
> queueFailover(org.apache.hadoop.hbase.replication.TestReplicationQueueFailoverCompressed):
> Waited too much time for queueFailover replication. Waited 12056ms.
>
> Tests in error:
>   testQuarantineMissingFamdir(org.apache.hadoop.hbase.util.TestHBaseFsck):
> org.apache.hadoop.hbase.exceptions.TableNotEnabledException:
> testQuarantineMissingFamdir
>
> Tests run: 1467, Failures: 2, Errors: 1, Skipped: 13
>
> [INFO]
> [INFO]
> ------------------------------------------------------------------------
> [INFO] Skipping HBase
> [INFO] This project has been banned from the build due to previous
> failures.
> [INFO]
> ------------------------------------------------------------------------
> [INFO]
> [INFO]
> ------------------------------------------------------------------------
> [INFO] Skipping HBase
> [INFO] This project has been banned from the build due to previous
> failures.
> [INFO]
> ------------------------------------------------------------------------
> [INFO]
> ------------------------------------------------------------------------
> [INFO] Reactor Summary:
> [INFO]
> [INFO] HBase ............................................. SUCCESS
> [10.172s]
> [INFO] HBase - Common .................................... SUCCESS
> [16.358s]
> [INFO] HBase - Protocol .................................. SUCCESS [5.247s]
> [INFO] HBase - Client .................................... SUCCESS [6.689s]
> [INFO] HBase - Prefix Tree ............................... SUCCESS [2.148s]
> [INFO] HBase - Hadoop Compatibility ...................... SUCCESS [0.423s]
> [INFO] HBase - Hadoop One Compatibility .................. SUCCESS [1.283s]
> [INFO] HBase - Server .................................... FAILURE
> [36:25.409s]
> [INFO] HBase - Integration Tests ......................... SKIPPED
> [INFO] HBase - Examples .................................. SKIPPED
> [INFO]
> ------------------------------------------------------------------------
> [INFO] BUILD FAILURE
> [INFO]
> ------------------------------------------------------------------------
> [INFO] Total time: 37:08.455s
> [INFO] Finished at: Thu Mar 07 07:29:21 UTC 2013
> [INFO] Final Memory: 61M/2070M
> [INFO]
> ------------------------------------------------------------------------
> [ERROR] Failed to execute goal
> org.apache.maven.plugins:maven-surefire-plugin:2.12-TRUNK-HBASE-2:test
> (secondPartTestsExecution) on project hbase-server: There are test failures.
> [ERROR]
> [ERROR] Please refer to
> /x1/jenkins/jenkins-slave/workspace/hbase-0.95/0.95/hbase-server/target/surefire-reports
> for the individual test results.
> [ERROR] -> [Help 1]
> [ERROR]
> [ERROR] To see the full stack trace of the errors, re-run Maven with the
> -e switch.
> [ERROR] Re-run Maven using the -X switch to enable full debug logging.
> [ERROR]
> [ERROR] For more information about the errors and possible solutions,
> please read the following articles:
> [ERROR] [Help 1]
> http://cwiki.apache.org/confluence/display/MAVEN/MojoFailureException
> [ERROR]
> [ERROR] After correcting the problems, you can resume the build with the
> command
> [ERROR]   mvn <goals> -rf :hbase-server
> Build step 'Invoke top-level Maven targets' marked build as failure
> Archiving artifacts
> Recording test results
> Updating HBASE-7153
>

Build failed in Jenkins: hbase-0.95 #33

Posted by Apache Jenkins Server <je...@builds.apache.org>.
See <https://builds.apache.org/job/hbase-0.95/33/changes>

Changes:

[larsh] HBASE-7153 print gc option in hbase-env.sh affects hbase zkcli (Dave Latham and LarsH)

------------------------------------------
[...truncated 3764 lines...]
Tests run: 7, Failures: 0, Errors: 0, Skipped: 0, Time elapsed: 26.516 sec
Running org.apache.hadoop.hbase.regionserver.TestHRegionOnCluster
Tests run: 1, Failures: 0, Errors: 0, Skipped: 0, Time elapsed: 21.014 sec
Running org.apache.hadoop.hbase.regionserver.TestHRegionBusyWait
Tests run: 63, Failures: 0, Errors: 0, Skipped: 0, Time elapsed: 31.789 sec
Running org.apache.hadoop.hbase.regionserver.TestParallelPut
Tests run: 2, Failures: 0, Errors: 0, Skipped: 0, Time elapsed: 3.24 sec
Running org.apache.hadoop.hbase.regionserver.TestPriorityRpc
Tests run: 3, Failures: 0, Errors: 0, Skipped: 0, Time elapsed: 0.999 sec
Running org.apache.hadoop.hbase.regionserver.TestSeekOptimizations
Tests run: 6, Failures: 0, Errors: 0, Skipped: 0, Time elapsed: 2.129 sec
Running org.apache.hadoop.hbase.regionserver.handler.TestCloseRegionHandler
Tests run: 3, Failures: 0, Errors: 0, Skipped: 0, Time elapsed: 1.205 sec
Running org.apache.hadoop.hbase.regionserver.handler.TestOpenRegionHandler
Tests run: 5, Failures: 0, Errors: 0, Skipped: 0, Time elapsed: 0.998 sec
Running org.apache.hadoop.hbase.regionserver.TestBlocksRead
Tests run: 4, Failures: 0, Errors: 0, Skipped: 0, Time elapsed: 1.095 sec
Running org.apache.hadoop.hbase.regionserver.TestCompoundBloomFilter
Tests run: 3, Failures: 0, Errors: 0, Skipped: 0, Time elapsed: 13.303 sec
Running org.apache.hadoop.hbase.regionserver.TestStoreScanner
Tests run: 16, Failures: 0, Errors: 0, Skipped: 0, Time elapsed: 0.167 sec
Running org.apache.hadoop.hbase.regionserver.TestSplitLogWorker
Tests run: 5, Failures: 0, Errors: 0, Skipped: 0, Time elapsed: 2.594 sec
Running org.apache.hadoop.hbase.regionserver.TestStoreFileBlockCacheSummary
Tests run: 1, Failures: 0, Errors: 0, Skipped: 0, Time elapsed: 14.421 sec
Running org.apache.hadoop.hbase.regionserver.wal.TestLogRolling
Running org.apache.hadoop.hbase.regionserver.TestServerCustomProtocol
Tests run: 7, Failures: 0, Errors: 0, Skipped: 0, Time elapsed: 44.105 sec
Tests run: 2, Failures: 0, Errors: 0, Skipped: 0, Time elapsed: 260.764 sec
Running org.apache.hadoop.hbase.regionserver.TestCompaction
Tests run: 17, Failures: 0, Errors: 0, Skipped: 0, Time elapsed: 32.274 sec
Running org.apache.hadoop.hbase.regionserver.TestMultiColumnScanner
Tests run: 12, Failures: 0, Errors: 0, Skipped: 0, Time elapsed: 23.826 sec
Running org.apache.hadoop.hbase.regionserver.TestMasterAddressManager
Tests run: 1, Failures: 0, Errors: 0, Skipped: 0, Time elapsed: 0.595 sec
Running org.apache.hadoop.hbase.regionserver.TestClusterId
Tests run: 1, Failures: 0, Errors: 0, Skipped: 0, Time elapsed: 29.576 sec
Running org.apache.hadoop.hbase.regionserver.TestHRegionServerBulkLoad
Tests run: 1, Failures: 0, Errors: 0, Skipped: 0, Time elapsed: 44.907 sec
Running org.apache.hadoop.hbase.backup.example.TestZooKeeperTableArchiveClient
Tests run: 3, Failures: 0, Errors: 0, Skipped: 0, Time elapsed: 5.63 sec
Running org.apache.hadoop.hbase.TestLocalHBaseCluster
Tests run: 1, Failures: 0, Errors: 0, Skipped: 0, Time elapsed: 10.22 sec
Running org.apache.hadoop.hbase.security.token.TestTokenAuthentication
Tests run: 2, Failures: 0, Errors: 0, Skipped: 0, Time elapsed: 2.548 sec
Running org.apache.hadoop.hbase.regionserver.TestHRegion
Tests run: 62, Failures: 0, Errors: 0, Skipped: 0, Time elapsed: 29.044 sec
Running org.apache.hadoop.hbase.regionserver.TestEndToEndSplitTransaction
Tests run: 2, Failures: 0, Errors: 0, Skipped: 0, Time elapsed: 61.255 sec
Running org.apache.hadoop.hbase.security.token.TestZKSecretWatcher
Tests run: 1, Failures: 0, Errors: 0, Skipped: 0, Time elapsed: 15.494 sec
Running org.apache.hadoop.hbase.security.access.TestZKPermissionsWatcher
Tests run: 1, Failures: 0, Errors: 0, Skipped: 0, Time elapsed: 12.004 sec
Running org.apache.hadoop.hbase.security.access.TestAccessControlFilter
Tests run: 1, Failures: 0, Errors: 0, Skipped: 0, Time elapsed: 15.211 sec
Running org.apache.hadoop.hbase.security.access.TestTablePermissions
Tests run: 7, Failures: 0, Errors: 0, Skipped: 0, Time elapsed: 26.271 sec
Running org.apache.hadoop.hbase.ipc.TestDelayedRpc
Tests run: 4, Failures: 0, Errors: 0, Skipped: 0, Time elapsed: 2.749 sec
Running org.apache.hadoop.hbase.ipc.TestHBaseClient
Tests run: 1, Failures: 0, Errors: 0, Skipped: 0, Time elapsed: 0.2 sec
Running org.apache.hadoop.hbase.ipc.TestProtoBufRpc
Tests run: 1, Failures: 0, Errors: 0, Skipped: 0, Time elapsed: 0.791 sec
Running org.apache.hadoop.hbase.TestGlobalMemStoreSize
Tests run: 1, Failures: 0, Errors: 0, Skipped: 0, Time elapsed: 15.337 sec
Running org.apache.hadoop.hbase.TestFullLogReconstruction
Tests run: 1, Failures: 0, Errors: 0, Skipped: 0, Time elapsed: 42.121 sec
Running org.apache.hadoop.hbase.security.access.TestAccessController
Tests run: 35, Failures: 0, Errors: 0, Skipped: 0, Time elapsed: 55.354 sec
Running org.apache.hadoop.hbase.rest.TestSchemaResource
Tests run: 2, Failures: 0, Errors: 0, Skipped: 0, Time elapsed: 19.895 sec
Running org.apache.hadoop.hbase.constraint.TestConstraint
Tests run: 5, Failures: 0, Errors: 0, Skipped: 0, Time elapsed: 25.114 sec
Running org.apache.hadoop.hbase.rest.client.TestRemoteAdmin
Tests run: 1, Failures: 0, Errors: 0, Skipped: 0, Time elapsed: 13.78 sec
Running org.apache.hadoop.hbase.rest.client.TestRemoteTable
Tests run: 4, Failures: 0, Errors: 0, Skipped: 0, Time elapsed: 13.063 sec
Running org.apache.hadoop.hbase.rest.TestMultiRowResource
Tests run: 3, Failures: 0, Errors: 0, Skipped: 0, Time elapsed: 12.78 sec
Running org.apache.hadoop.hbase.rest.TestTableResource
Tests run: 8, Failures: 0, Errors: 0, Skipped: 0, Time elapsed: 22.833 sec
Running org.apache.hadoop.hbase.rest.TestGzipFilter
Tests run: 2, Failures: 0, Errors: 0, Skipped: 0, Time elapsed: 15.619 sec
Running org.apache.hadoop.hbase.rest.TestRowResource
Tests run: 12, Failures: 0, Errors: 0, Skipped: 0, Time elapsed: 16.49 sec
Running org.apache.hadoop.hbase.rest.TestVersionResource
Tests run: 7, Failures: 0, Errors: 0, Skipped: 0, Time elapsed: 13.37 sec
Running org.apache.hadoop.hbase.rest.TestStatusResource
Tests run: 2, Failures: 0, Errors: 0, Skipped: 0, Time elapsed: 11.632 sec
Running org.apache.hadoop.hbase.rest.TestScannerResource
Tests run: 5, Failures: 0, Errors: 0, Skipped: 0, Time elapsed: 24.116 sec
Running org.apache.hadoop.hbase.io.hfile.TestHFileBlockIndex
Tests run: 10, Failures: 0, Errors: 0, Skipped: 0, Time elapsed: 6.621 sec
Running org.apache.hadoop.hbase.backup.TestHFileArchiving
Tests run: 5, Failures: 0, Errors: 0, Skipped: 0, Time elapsed: 168.809 sec
Running org.apache.hadoop.hbase.rest.TestScannersWithFilters
Tests run: 10, Failures: 0, Errors: 0, Skipped: 0, Time elapsed: 15.758 sec
Running org.apache.hadoop.hbase.trace.TestHTraceHooks
Tests run: 1, Failures: 0, Errors: 0, Skipped: 0, Time elapsed: 12.976 sec
Running org.apache.hadoop.hbase.io.hfile.TestHFileSeek
Tests run: 1, Failures: 0, Errors: 0, Skipped: 0, Time elapsed: 4.033 sec
Running org.apache.hadoop.hbase.io.hfile.TestHFilePerformance
Tests run: 1, Failures: 0, Errors: 0, Skipped: 0, Time elapsed: 3.65 sec
Running org.apache.hadoop.hbase.regionserver.TestJoinedScanners
Tests run: 1, Failures: 0, Errors: 0, Skipped: 0, Time elapsed: 297.46 sec
Running org.apache.hadoop.hbase.io.hfile.TestForceCacheImportantBlocks
Tests run: 2, Failures: 0, Errors: 0, Skipped: 0, Time elapsed: 21.279 sec
Running org.apache.hadoop.hbase.io.hfile.slab.TestSlabCache
Tests run: 7, Failures: 0, Errors: 0, Skipped: 0, Time elapsed: 14.038 sec
Running org.apache.hadoop.hbase.io.hfile.TestCacheOnWrite
Tests run: 36, Failures: 0, Errors: 0, Skipped: 0, Time elapsed: 29.33 sec
Running org.apache.hadoop.hbase.io.hfile.slab.TestSingleSizeCache
Tests run: 5, Failures: 0, Errors: 0, Skipped: 0, Time elapsed: 20.056 sec
Running org.apache.hadoop.hbase.io.hfile.TestHFileBlock
Tests run: 14, Failures: 0, Errors: 0, Skipped: 0, Time elapsed: 47.779 sec
Running org.apache.hadoop.hbase.io.hfile.TestScannerSelectionUsingTTL
Tests run: 6, Failures: 0, Errors: 0, Skipped: 0, Time elapsed: 61.716 sec
Running org.apache.hadoop.hbase.io.encoding.TestEncodedSeekers
Tests run: 10, Failures: 0, Errors: 0, Skipped: 0, Time elapsed: 33.423 sec
Running org.apache.hadoop.hbase.io.encoding.TestBufferedDataBlockEncoder
Tests run: 1, Failures: 0, Errors: 0, Skipped: 0, Time elapsed: 12.87 sec
Running org.apache.hadoop.hbase.io.encoding.TestLoadAndSwitchEncodeOnDisk
Tests run: 1, Failures: 0, Errors: 0, Skipped: 0, Time elapsed: 23.256 sec
Running org.apache.hadoop.hbase.io.TestFileLink
Tests run: 3, Failures: 0, Errors: 0, Skipped: 0, Time elapsed: 73.582 sec
Running org.apache.hadoop.hbase.TestRegionRebalancing
Tests run: 2, Failures: 0, Errors: 0, Skipped: 0, Time elapsed: 31.273 sec
Running org.apache.hadoop.hbase.mapred.TestTableInputFormat
Tests run: 10, Failures: 0, Errors: 0, Skipped: 0, Time elapsed: 21.847 sec
Running org.apache.hadoop.hbase.io.encoding.TestDataBlockEncoders
Tests run: 12, Failures: 0, Errors: 0, Skipped: 0, Time elapsed: 80.925 sec
Running org.apache.hadoop.hbase.replication.TestReplicationDisableInactivePeer
Tests run: 1, Failures: 0, Errors: 0, Skipped: 0, Time elapsed: 46.696 sec
Running org.apache.hadoop.hbase.replication.TestReplicationZookeeper
Tests run: 4, Failures: 0, Errors: 0, Skipped: 0, Time elapsed: 0.754 sec
Running org.apache.hadoop.hbase.replication.regionserver.TestReplicationSink
Tests run: 5, Failures: 0, Errors: 0, Skipped: 0, Time elapsed: 16.655 sec
Running org.apache.hadoop.hbase.replication.regionserver.TestReplicationSourceManager
Tests run: 1, Failures: 0, Errors: 0, Skipped: 0, Time elapsed: 1.01 sec
Running org.apache.hadoop.hbase.replication.TestReplicationSource
Tests run: 1, Failures: 0, Errors: 0, Skipped: 0, Time elapsed: 2.144 sec
Running org.apache.hadoop.hbase.replication.TestReplicationQueueFailoverCompressed
Tests run: 1, Failures: 1, Errors: 0, Skipped: 0, Time elapsed: 71.391 sec <<< FAILURE!
Running org.apache.hadoop.hbase.replication.TestReplicationQueueFailover
Running org.apache.hadoop.hbase.io.encoding.TestChangingEncoding
Tests run: 4, Failures: 0, Errors: 0, Skipped: 0, Time elapsed: 169.281 sec
Tests run: 1, Failures: 0, Errors: 0, Skipped: 0, Time elapsed: 72.32 sec
Running org.apache.hadoop.hbase.replication.TestMultiSlaveReplication
Tests run: 1, Failures: 0, Errors: 0, Skipped: 0, Time elapsed: 37.271 sec
Running org.apache.hadoop.hbase.util.TestFSTableDescriptors
Tests run: 11, Failures: 0, Errors: 0, Skipped: 0, Time elapsed: 0.798 sec
Running org.apache.hadoop.hbase.mapred.TestTableMapReduce
Tests run: 1, Failures: 0, Errors: 0, Skipped: 0, Time elapsed: 117.218 sec
Running org.apache.hadoop.hbase.util.TestIdLock
Tests run: 1, Failures: 0, Errors: 0, Skipped: 0, Time elapsed: 15.261 sec
Running org.apache.hadoop.hbase.util.TestMergeTool
Tests run: 1, Failures: 0, Errors: 0, Skipped: 0, Time elapsed: 24.368 sec
Running org.apache.hadoop.hbase.replication.TestReplicationSmallTests
Tests run: 8, Failures: 0, Errors: 0, Skipped: 0, Time elapsed: 68.536 sec
Running org.apache.hadoop.hbase.util.TestMergeTable
Tests run: 1, Failures: 0, Errors: 0, Skipped: 0, Time elapsed: 26.274 sec
Running org.apache.hadoop.hbase.replication.TestMasterReplication
Tests run: 2, Failures: 0, Errors: 0, Skipped: 0, Time elapsed: 63.505 sec
Running org.apache.hadoop.hbase.util.TestFSUtils
Tests run: 5, Failures: 0, Errors: 0, Skipped: 0, Time elapsed: 19 sec
Running org.apache.hadoop.hbase.util.TestProcessBasedCluster
Tests run: 1, Failures: 0, Errors: 0, Skipped: 0, Time elapsed: 0.416 sec
Running org.apache.hadoop.hbase.util.TestRegionSplitter
Tests run: 5, Failures: 0, Errors: 0, Skipped: 0, Time elapsed: 16.095 sec
Running org.apache.hadoop.hbase.util.TestMiniClusterLoadSequential
Tests run: 4, Failures: 0, Errors: 0, Skipped: 0, Time elapsed: 77.224 sec
Running org.apache.hadoop.hbase.util.TestFSVisitor
Tests run: 3, Failures: 0, Errors: 0, Skipped: 0, Time elapsed: 1.437 sec
Running org.apache.hadoop.hbase.util.TestCoprocessorScanPolicy
Tests run: 4, Failures: 0, Errors: 0, Skipped: 0, Time elapsed: 21.575 sec
Running org.apache.hadoop.hbase.util.TestMiniClusterLoadParallel
Tests run: 4, Failures: 0, Errors: 0, Skipped: 0, Time elapsed: 76.749 sec
Running org.apache.hadoop.hbase.util.hbck.TestOfflineMetaRebuildBase
Tests run: 1, Failures: 0, Errors: 0, Skipped: 0, Time elapsed: 23.858 sec
Running org.apache.hadoop.hbase.util.TestDefaultEnvironmentEdge
Tests run: 1, Failures: 0, Errors: 0, Skipped: 0, Time elapsed: 0.189 sec
Running org.apache.hadoop.hbase.TestInfoServers
Tests run: 3, Failures: 0, Errors: 0, Skipped: 0, Time elapsed: 12.554 sec
Running org.apache.hadoop.hbase.util.hbck.TestOfflineMetaRebuildOverlap
Tests run: 1, Failures: 0, Errors: 0, Skipped: 0, Time elapsed: 22.875 sec
Running org.apache.hadoop.hbase.util.hbck.TestOfflineMetaRebuildHole
Tests run: 1, Failures: 0, Errors: 0, Skipped: 0, Time elapsed: 21.867 sec
Running org.apache.hadoop.hbase.util.TestMiniClusterLoadEncoded
Tests run: 5, Failures: 0, Errors: 0, Skipped: 0, Time elapsed: 61.114 sec
Running org.apache.hadoop.hbase.util.TestHBaseFsck
Tests run: 34, Failures: 0, Errors: 1, Skipped: 0, Time elapsed: 225 sec <<< FAILURE!

Results :

Failed tests:   testShouldThrowIOExceptionIfStoreFileSizeIsEmptyAndShouldSuccessfullyExecuteRollback(org.apache.hadoop.hbase.regionserver.TestSplitTransactionOnCluster): not able to find a splittable region
  queueFailover(org.apache.hadoop.hbase.replication.TestReplicationQueueFailoverCompressed): Waited too much time for queueFailover replication. Waited 12056ms.

Tests in error: 
  testQuarantineMissingFamdir(org.apache.hadoop.hbase.util.TestHBaseFsck): org.apache.hadoop.hbase.exceptions.TableNotEnabledException: testQuarantineMissingFamdir

Tests run: 1467, Failures: 2, Errors: 1, Skipped: 13

[INFO]                                                                         
[INFO] ------------------------------------------------------------------------
[INFO] Skipping HBase
[INFO] This project has been banned from the build due to previous failures.
[INFO] ------------------------------------------------------------------------
[INFO]                                                                         
[INFO] ------------------------------------------------------------------------
[INFO] Skipping HBase
[INFO] This project has been banned from the build due to previous failures.
[INFO] ------------------------------------------------------------------------
[INFO] ------------------------------------------------------------------------
[INFO] Reactor Summary:
[INFO] 
[INFO] HBase ............................................. SUCCESS [10.172s]
[INFO] HBase - Common .................................... SUCCESS [16.358s]
[INFO] HBase - Protocol .................................. SUCCESS [5.247s]
[INFO] HBase - Client .................................... SUCCESS [6.689s]
[INFO] HBase - Prefix Tree ............................... SUCCESS [2.148s]
[INFO] HBase - Hadoop Compatibility ...................... SUCCESS [0.423s]
[INFO] HBase - Hadoop One Compatibility .................. SUCCESS [1.283s]
[INFO] HBase - Server .................................... FAILURE [36:25.409s]
[INFO] HBase - Integration Tests ......................... SKIPPED
[INFO] HBase - Examples .................................. SKIPPED
[INFO] ------------------------------------------------------------------------
[INFO] BUILD FAILURE
[INFO] ------------------------------------------------------------------------
[INFO] Total time: 37:08.455s
[INFO] Finished at: Thu Mar 07 07:29:21 UTC 2013
[INFO] Final Memory: 61M/2070M
[INFO] ------------------------------------------------------------------------
[ERROR] Failed to execute goal org.apache.maven.plugins:maven-surefire-plugin:2.12-TRUNK-HBASE-2:test (secondPartTestsExecution) on project hbase-server: There are test failures.
[ERROR] 
[ERROR] Please refer to /x1/jenkins/jenkins-slave/workspace/hbase-0.95/0.95/hbase-server/target/surefire-reports for the individual test results.
[ERROR] -> [Help 1]
[ERROR] 
[ERROR] To see the full stack trace of the errors, re-run Maven with the -e switch.
[ERROR] Re-run Maven using the -X switch to enable full debug logging.
[ERROR] 
[ERROR] For more information about the errors and possible solutions, please read the following articles:
[ERROR] [Help 1] http://cwiki.apache.org/confluence/display/MAVEN/MojoFailureException
[ERROR] 
[ERROR] After correcting the problems, you can resume the build with the command
[ERROR]   mvn <goals> -rf :hbase-server
Build step 'Invoke top-level Maven targets' marked build as failure
Archiving artifacts
Recording test results
Updating HBASE-7153

Build failed in Jenkins: hbase-0.95 #32

Posted by Apache Jenkins Server <je...@builds.apache.org>.
See <https://builds.apache.org/job/hbase-0.95/32/changes>

Changes:

[sershe] HBASE-7935 make policy and compactor in default store engine separately pluggable (for things like tier-based, and default policy experiments with permutations)

------------------------------------------
[...truncated 3723 lines...]
Running org.apache.hadoop.hbase.regionserver.TestHRegionBusyWait
Tests run: 63, Failures: 0, Errors: 0, Skipped: 0, Time elapsed: 32.127 sec
Running org.apache.hadoop.hbase.regionserver.TestRegionServerNoMaster
Tests run: 7, Failures: 0, Errors: 0, Skipped: 0, Time elapsed: 26.639 sec
Running org.apache.hadoop.hbase.regionserver.TestParallelPut
Tests run: 2, Failures: 0, Errors: 0, Skipped: 0, Time elapsed: 3.409 sec
Running org.apache.hadoop.hbase.regionserver.TestHRegionOnCluster
Tests run: 1, Failures: 0, Errors: 0, Skipped: 0, Time elapsed: 21.681 sec
Running org.apache.hadoop.hbase.regionserver.wal.TestLogRolling
Tests run: 2, Failures: 0, Errors: 0, Skipped: 0, Time elapsed: 261.618 sec
Running org.apache.hadoop.hbase.regionserver.TestPriorityRpc
Tests run: 3, Failures: 0, Errors: 0, Skipped: 0, Time elapsed: 1.115 sec
Running org.apache.hadoop.hbase.regionserver.handler.TestCloseRegionHandler
Tests run: 3, Failures: 0, Errors: 0, Skipped: 0, Time elapsed: 1.323 sec
Running org.apache.hadoop.hbase.regionserver.TestSeekOptimizations
Tests run: 6, Failures: 0, Errors: 0, Skipped: 0, Time elapsed: 2.468 sec
Running org.apache.hadoop.hbase.regionserver.handler.TestOpenRegionHandler
Tests run: 5, Failures: 0, Errors: 0, Skipped: 0, Time elapsed: 1.005 sec
Running org.apache.hadoop.hbase.regionserver.TestBlocksRead
Tests run: 4, Failures: 0, Errors: 0, Skipped: 0, Time elapsed: 1.132 sec
Running org.apache.hadoop.hbase.regionserver.TestStoreScanner
Tests run: 16, Failures: 0, Errors: 0, Skipped: 0, Time elapsed: 0.184 sec
Running org.apache.hadoop.hbase.regionserver.TestSplitLogWorker
Tests run: 5, Failures: 0, Errors: 0, Skipped: 0, Time elapsed: 2.667 sec
Running org.apache.hadoop.hbase.regionserver.TestCompoundBloomFilter
Tests run: 3, Failures: 0, Errors: 0, Skipped: 0, Time elapsed: 14.002 sec
Running org.apache.hadoop.hbase.regionserver.TestStoreFileBlockCacheSummary
Tests run: 1, Failures: 0, Errors: 0, Skipped: 0, Time elapsed: 14.391 sec
Running org.apache.hadoop.hbase.regionserver.TestServerCustomProtocol
Tests run: 7, Failures: 0, Errors: 0, Skipped: 0, Time elapsed: 42.118 sec
Running org.apache.hadoop.hbase.regionserver.TestCompaction
Tests run: 17, Failures: 0, Errors: 0, Skipped: 0, Time elapsed: 30.319 sec
Running org.apache.hadoop.hbase.regionserver.TestClusterId
Tests run: 1, Failures: 0, Errors: 0, Skipped: 0, Time elapsed: 28.572 sec
Running org.apache.hadoop.hbase.regionserver.TestMasterAddressManager
Tests run: 1, Failures: 0, Errors: 0, Skipped: 0, Time elapsed: 0.678 sec
Running org.apache.hadoop.hbase.regionserver.TestHRegionServerBulkLoad
Tests run: 1, Failures: 0, Errors: 0, Skipped: 0, Time elapsed: 44.797 sec
Running org.apache.hadoop.hbase.regionserver.TestMultiColumnScanner
Tests run: 12, Failures: 0, Errors: 0, Skipped: 0, Time elapsed: 22.821 sec
Running org.apache.hadoop.hbase.backup.example.TestZooKeeperTableArchiveClient
Tests run: 3, Failures: 0, Errors: 0, Skipped: 0, Time elapsed: 5.679 sec
Running org.apache.hadoop.hbase.TestLocalHBaseCluster
Tests run: 1, Failures: 0, Errors: 0, Skipped: 0, Time elapsed: 14.25 sec
Running org.apache.hadoop.hbase.regionserver.TestHRegion
Tests run: 62, Failures: 0, Errors: 0, Skipped: 0, Time elapsed: 29.725 sec
Running org.apache.hadoop.hbase.security.token.TestTokenAuthentication
Tests run: 2, Failures: 0, Errors: 0, Skipped: 0, Time elapsed: 2.759 sec
Running org.apache.hadoop.hbase.regionserver.TestEndToEndSplitTransaction
Tests run: 2, Failures: 0, Errors: 0, Skipped: 0, Time elapsed: 60.392 sec
Running org.apache.hadoop.hbase.security.access.TestAccessControlFilter
Tests run: 1, Failures: 0, Errors: 0, Skipped: 0, Time elapsed: 14.04 sec
Running org.apache.hadoop.hbase.security.token.TestZKSecretWatcher
Tests run: 1, Failures: 0, Errors: 0, Skipped: 0, Time elapsed: 15.786 sec
Running org.apache.hadoop.hbase.security.access.TestZKPermissionsWatcher
Tests run: 1, Failures: 0, Errors: 0, Skipped: 0, Time elapsed: 12.025 sec
Running org.apache.hadoop.hbase.security.access.TestTablePermissions
Tests run: 7, Failures: 0, Errors: 0, Skipped: 0, Time elapsed: 27.38 sec
Running org.apache.hadoop.hbase.ipc.TestDelayedRpc
Tests run: 4, Failures: 0, Errors: 0, Skipped: 0, Time elapsed: 2.807 sec
Running org.apache.hadoop.hbase.ipc.TestHBaseClient
Tests run: 1, Failures: 0, Errors: 0, Skipped: 0, Time elapsed: 0.198 sec
Running org.apache.hadoop.hbase.ipc.TestProtoBufRpc
Tests run: 1, Failures: 0, Errors: 0, Skipped: 0, Time elapsed: 0.865 sec
Running org.apache.hadoop.hbase.TestFullLogReconstruction
Tests run: 1, Failures: 0, Errors: 0, Skipped: 0, Time elapsed: 41.842 sec
Running org.apache.hadoop.hbase.TestGlobalMemStoreSize
Tests run: 1, Failures: 0, Errors: 0, Skipped: 0, Time elapsed: 15.999 sec
Running org.apache.hadoop.hbase.security.access.TestAccessController
Tests run: 35, Failures: 0, Errors: 0, Skipped: 0, Time elapsed: 55.171 sec
Running org.apache.hadoop.hbase.rest.TestSchemaResource
Tests run: 2, Failures: 0, Errors: 0, Skipped: 0, Time elapsed: 19.077 sec
Running org.apache.hadoop.hbase.rest.client.TestRemoteAdmin
Tests run: 1, Failures: 0, Errors: 0, Skipped: 0, Time elapsed: 15.872 sec
Running org.apache.hadoop.hbase.constraint.TestConstraint
Tests run: 5, Failures: 0, Errors: 0, Skipped: 0, Time elapsed: 25.917 sec
Running org.apache.hadoop.hbase.rest.client.TestRemoteTable
Tests run: 4, Failures: 0, Errors: 0, Skipped: 0, Time elapsed: 11.895 sec
Running org.apache.hadoop.hbase.rest.TestMultiRowResource
Tests run: 3, Failures: 0, Errors: 0, Skipped: 0, Time elapsed: 14.067 sec
Running org.apache.hadoop.hbase.rest.TestTableResource
Tests run: 8, Failures: 0, Errors: 0, Skipped: 0, Time elapsed: 22.243 sec
Running org.apache.hadoop.hbase.regionserver.TestJoinedScanners
Tests run: 1, Failures: 0, Errors: 0, Skipped: 0, Time elapsed: 265.037 sec
Running org.apache.hadoop.hbase.rest.TestGzipFilter
Tests run: 2, Failures: 0, Errors: 0, Skipped: 0, Time elapsed: 13.876 sec
Running org.apache.hadoop.hbase.rest.TestRowResource
Tests run: 12, Failures: 0, Errors: 0, Skipped: 0, Time elapsed: 15.104 sec
Running org.apache.hadoop.hbase.rest.TestStatusResource
Tests run: 2, Failures: 0, Errors: 0, Skipped: 0, Time elapsed: 11.386 sec
Running org.apache.hadoop.hbase.rest.TestVersionResource
Tests run: 7, Failures: 0, Errors: 0, Skipped: 0, Time elapsed: 12.185 sec
Running org.apache.hadoop.hbase.io.hfile.TestHFileBlockIndex
Tests run: 10, Failures: 0, Errors: 0, Skipped: 0, Time elapsed: 6.491 sec
Running org.apache.hadoop.hbase.rest.TestScannerResource
Tests run: 5, Failures: 0, Errors: 0, Skipped: 0, Time elapsed: 23.277 sec
Running org.apache.hadoop.hbase.rest.TestScannersWithFilters
Tests run: 10, Failures: 0, Errors: 0, Skipped: 0, Time elapsed: 16.335 sec
Running org.apache.hadoop.hbase.io.hfile.TestHFileSeek
Tests run: 1, Failures: 0, Errors: 0, Skipped: 0, Time elapsed: 3.677 sec
Running org.apache.hadoop.hbase.trace.TestHTraceHooks
Tests run: 1, Failures: 0, Errors: 0, Skipped: 0, Time elapsed: 11.922 sec
Running org.apache.hadoop.hbase.io.hfile.TestHFilePerformance
Tests run: 1, Failures: 0, Errors: 0, Skipped: 0, Time elapsed: 3.683 sec
Running org.apache.hadoop.hbase.backup.TestHFileArchiving
Tests run: 5, Failures: 0, Errors: 0, Skipped: 0, Time elapsed: 170.547 sec
Running org.apache.hadoop.hbase.io.hfile.slab.TestSlabCache
Tests run: 7, Failures: 0, Errors: 0, Skipped: 0, Time elapsed: 11.233 sec
Running org.apache.hadoop.hbase.io.hfile.TestForceCacheImportantBlocks
Tests run: 2, Failures: 0, Errors: 0, Skipped: 0, Time elapsed: 20.615 sec
Running org.apache.hadoop.hbase.io.hfile.TestCacheOnWrite
Tests run: 36, Failures: 0, Errors: 0, Skipped: 0, Time elapsed: 27.997 sec
Running org.apache.hadoop.hbase.io.TestFileLink
Tests run: 3, Failures: 0, Errors: 0, Skipped: 0, Time elapsed: 12.623 sec
Running org.apache.hadoop.hbase.io.hfile.slab.TestSingleSizeCache
Tests run: 5, Failures: 0, Errors: 0, Skipped: 0, Time elapsed: 19.199 sec
Running org.apache.hadoop.hbase.io.hfile.TestHFileBlock
Tests run: 14, Failures: 0, Errors: 0, Skipped: 0, Time elapsed: 48.17 sec
Running org.apache.hadoop.hbase.io.hfile.TestScannerSelectionUsingTTL
Tests run: 6, Failures: 0, Errors: 0, Skipped: 0, Time elapsed: 61.554 sec
Running org.apache.hadoop.hbase.io.encoding.TestEncodedSeekers
Tests run: 10, Failures: 0, Errors: 0, Skipped: 0, Time elapsed: 34.056 sec
Running org.apache.hadoop.hbase.io.encoding.TestBufferedDataBlockEncoder
Tests run: 1, Failures: 0, Errors: 0, Skipped: 0, Time elapsed: 12.354 sec
Running org.apache.hadoop.hbase.io.encoding.TestLoadAndSwitchEncodeOnDisk
Tests run: 1, Failures: 0, Errors: 0, Skipped: 0, Time elapsed: 23.702 sec
Running org.apache.hadoop.hbase.mapred.TestTableInputFormat
Tests run: 10, Failures: 0, Errors: 0, Skipped: 0, Time elapsed: 22.688 sec
Running org.apache.hadoop.hbase.TestRegionRebalancing
Tests run: 2, Failures: 0, Errors: 0, Skipped: 0, Time elapsed: 43.424 sec
Running org.apache.hadoop.hbase.io.encoding.TestDataBlockEncoders
Tests run: 12, Failures: 0, Errors: 0, Skipped: 0, Time elapsed: 85.189 sec
Running org.apache.hadoop.hbase.replication.TestReplicationDisableInactivePeer
Tests run: 1, Failures: 0, Errors: 0, Skipped: 0, Time elapsed: 45.033 sec
Running org.apache.hadoop.hbase.replication.TestReplicationZookeeper
Tests run: 4, Failures: 0, Errors: 0, Skipped: 0, Time elapsed: 0.55 sec
Running org.apache.hadoop.hbase.replication.regionserver.TestReplicationSink
Tests run: 5, Failures: 0, Errors: 0, Skipped: 0, Time elapsed: 14.596 sec
Running org.apache.hadoop.hbase.replication.regionserver.TestReplicationSourceManager
Tests run: 1, Failures: 0, Errors: 0, Skipped: 0, Time elapsed: 0.941 sec
Running org.apache.hadoop.hbase.replication.TestReplicationSource
Tests run: 1, Failures: 0, Errors: 0, Skipped: 0, Time elapsed: 2.109 sec
Running org.apache.hadoop.hbase.replication.TestReplicationQueueFailoverCompressed
Tests run: 1, Failures: 1, Errors: 0, Skipped: 0, Time elapsed: 75.373 sec <<< FAILURE!
Running org.apache.hadoop.hbase.replication.TestMultiSlaveReplication
Tests run: 1, Failures: 0, Errors: 0, Skipped: 0, Time elapsed: 38.613 sec
Running org.apache.hadoop.hbase.mapred.TestTableMapReduce
Tests run: 1, Failures: 0, Errors: 0, Skipped: 0, Time elapsed: 115.079 sec
Running org.apache.hadoop.hbase.io.encoding.TestChangingEncoding
Tests run: 4, Failures: 0, Errors: 0, Skipped: 0, Time elapsed: 169.558 sec
Running org.apache.hadoop.hbase.replication.TestReplicationQueueFailover
Tests run: 1, Failures: 1, Errors: 0, Skipped: 0, Time elapsed: 79.472 sec <<< FAILURE!
Running org.apache.hadoop.hbase.util.TestFSTableDescriptors
Tests run: 11, Failures: 0, Errors: 0, Skipped: 0, Time elapsed: 0.895 sec
Running org.apache.hadoop.hbase.util.TestIdLock
Tests run: 1, Failures: 0, Errors: 0, Skipped: 0, Time elapsed: 15.263 sec
Running org.apache.hadoop.hbase.util.TestMergeTool
Tests run: 1, Failures: 0, Errors: 0, Skipped: 0, Time elapsed: 26.152 sec
Running org.apache.hadoop.hbase.util.TestMergeTable
Tests run: 1, Failures: 0, Errors: 0, Skipped: 0, Time elapsed: 23.103 sec
Running org.apache.hadoop.hbase.replication.TestReplicationSmallTests
Tests run: 8, Failures: 0, Errors: 0, Skipped: 0, Time elapsed: 66.61 sec
Running org.apache.hadoop.hbase.replication.TestMasterReplication
Tests run: 2, Failures: 0, Errors: 0, Skipped: 0, Time elapsed: 62.884 sec
Running org.apache.hadoop.hbase.util.TestFSUtils
Tests run: 5, Failures: 0, Errors: 0, Skipped: 0, Time elapsed: 19.076 sec
Running org.apache.hadoop.hbase.util.TestProcessBasedCluster
Tests run: 1, Failures: 0, Errors: 0, Skipped: 0, Time elapsed: 0.457 sec
Running org.apache.hadoop.hbase.util.TestRegionSplitter
Tests run: 5, Failures: 0, Errors: 0, Skipped: 0, Time elapsed: 15.672 sec
Running org.apache.hadoop.hbase.util.TestMiniClusterLoadSequential
Tests run: 4, Failures: 0, Errors: 0, Skipped: 0, Time elapsed: 74.458 sec
Running org.apache.hadoop.hbase.util.TestFSVisitor
Tests run: 3, Failures: 0, Errors: 0, Skipped: 0, Time elapsed: 1.571 sec
Running org.apache.hadoop.hbase.util.TestCoprocessorScanPolicy
Tests run: 4, Failures: 0, Errors: 0, Skipped: 0, Time elapsed: 20.342 sec
Running org.apache.hadoop.hbase.util.TestMiniClusterLoadParallel
Tests run: 4, Failures: 0, Errors: 0, Skipped: 0, Time elapsed: 72.207 sec
Running org.apache.hadoop.hbase.util.hbck.TestOfflineMetaRebuildBase
Tests run: 1, Failures: 0, Errors: 0, Skipped: 0, Time elapsed: 23.075 sec
Running org.apache.hadoop.hbase.util.TestDefaultEnvironmentEdge
Tests run: 1, Failures: 0, Errors: 0, Skipped: 0, Time elapsed: 0.19 sec
Running org.apache.hadoop.hbase.util.hbck.TestOfflineMetaRebuildOverlap
Tests run: 1, Failures: 0, Errors: 0, Skipped: 0, Time elapsed: 23.549 sec
Running org.apache.hadoop.hbase.TestInfoServers
Tests run: 3, Failures: 0, Errors: 0, Skipped: 0, Time elapsed: 12.992 sec
Running org.apache.hadoop.hbase.util.hbck.TestOfflineMetaRebuildHole
Tests run: 1, Failures: 0, Errors: 0, Skipped: 0, Time elapsed: 21.505 sec
Running org.apache.hadoop.hbase.util.TestMiniClusterLoadEncoded
Tests run: 5, Failures: 0, Errors: 0, Skipped: 0, Time elapsed: 79.069 sec
Running org.apache.hadoop.hbase.util.TestHBaseFsck
Tests run: 34, Failures: 0, Errors: 0, Skipped: 0, Time elapsed: 240.359 sec

Results :

Failed tests:   testMasterFailoverWithMockedRITOnDeadRS(org.apache.hadoop.hbase.master.TestMasterFailover): region=enabledTable,fff,1362612988876.1a2236e4dc5cae90f183e5ea2e948f9a., [{NAME => '-ROOT-,,0', STARTKEY => '', ENDKEY => '', ENCODED => 70236052,}, {NAME => '.META.,,1', STARTKEY => '', ENDKEY => '', ENCODED => 1028785192,}, {NAME => 'disabledTable,,1362612989745.79a37df9f26986b375f718efe4c4fb66.', STARTKEY => '', ENDKEY => 'aaa', ENCODED => 79a37df9f26986b375f718efe4c4fb66,}, {NAME => 'disabledTable,aaa,1362612989748.a91ed3b5975c374e820313e7dc62f04c.', STARTKEY => 'aaa', ENDKEY => 'bbb', ENCODED => a91ed3b5975c374e820313e7dc62f04c,}, {NAME => 'enabledTable,,1362612988852.ce48daef458a66586fe7b712d55e3e35.', STARTKEY => '', ENDKEY => 'aaa', ENCODED => ce48daef458a66586fe7b712d55e3e35,}, {NAME => 'enabledTable,aaa,1362612988863.ef2e88ce04aa3d0ac7ff2e8d48618650.', STARTKEY => 'aaa', ENDKEY => 'bbb', ENCODED => ef2e88ce04aa3d0ac7ff2e8d48618650,}, {NAME => 'enabledTable,bbb,1362612988867.8028171798858a92cacc0de8f03db7dc.', STARTKEY => 'bbb', ENDKEY => 'ccc', ENCODED => 8028171798858a92cacc0de8f03db7dc,}, {NAME => 'enabledTable,ccc,1362612988869.cf76ebb5eaa1fe7b9260f16647e80ce6.', STARTKEY => 'ccc', ENDKEY => 'ddd', ENCODED => cf76ebb5eaa1fe7b9260f16647e80ce6,}, {NAME => 'enabledTable,ddd,1362612988871.a51321031fc356080841746989405ffb.', STARTKEY => 'ddd', ENDKEY => 'eee', ENCODED => a51321031fc356080841746989405ffb,}, {NAME => 'enabledTable,eee,1362612988874.b984d4a538a34d2a355ea745258a407d.', STARTKEY => 'eee', ENDKEY => 'fff', ENCODED => b984d4a538a34d2a355ea745258a407d,}]
  testShouldThrowIOExceptionIfStoreFileSizeIsEmptyAndShouldSuccessfullyExecuteRollback(org.apache.hadoop.hbase.regionserver.TestSplitTransactionOnCluster): not able to find a splittable region
  queueFailover(org.apache.hadoop.hbase.replication.TestReplicationQueueFailoverCompressed): Waited too much time for queueFailover replication. Waited 12128ms.
  queueFailover(org.apache.hadoop.hbase.replication.TestReplicationQueueFailover): Waited too much time for queueFailover replication. Waited 12083ms.

Tests run: 1467, Failures: 4, Errors: 0, Skipped: 13

[INFO]                                                                         
[INFO] ------------------------------------------------------------------------
[INFO] Skipping HBase
[INFO] This project has been banned from the build due to previous failures.
[INFO] ------------------------------------------------------------------------
[INFO]                                                                         
[INFO] ------------------------------------------------------------------------
[INFO] Skipping HBase
[INFO] This project has been banned from the build due to previous failures.
[INFO] ------------------------------------------------------------------------
[INFO] ------------------------------------------------------------------------
[INFO] Reactor Summary:
[INFO] 
[INFO] HBase ............................................. SUCCESS [4.335s]
[INFO] HBase - Common .................................... SUCCESS [15.101s]
[INFO] HBase - Protocol .................................. SUCCESS [5.092s]
[INFO] HBase - Client .................................... SUCCESS [7.026s]
[INFO] HBase - Prefix Tree ............................... SUCCESS [2.129s]
[INFO] HBase - Hadoop Compatibility ...................... SUCCESS [0.420s]
[INFO] HBase - Hadoop One Compatibility .................. SUCCESS [1.158s]
[INFO] HBase - Server .................................... FAILURE [36:34.016s]
[INFO] HBase - Integration Tests ......................... SKIPPED
[INFO] HBase - Examples .................................. SKIPPED
[INFO] ------------------------------------------------------------------------
[INFO] BUILD FAILURE
[INFO] ------------------------------------------------------------------------
[INFO] Total time: 37:09.913s
[INFO] Finished at: Thu Mar 07 00:03:13 UTC 2013
[INFO] Final Memory: 60M/945M
[INFO] ------------------------------------------------------------------------
[ERROR] Failed to execute goal org.apache.maven.plugins:maven-surefire-plugin:2.12-TRUNK-HBASE-2:test (secondPartTestsExecution) on project hbase-server: There are test failures.
[ERROR] 
[ERROR] Please refer to /x1/jenkins/jenkins-slave/workspace/hbase-0.95/0.95/hbase-server/target/surefire-reports for the individual test results.
[ERROR] -> [Help 1]
[ERROR] 
[ERROR] To see the full stack trace of the errors, re-run Maven with the -e switch.
[ERROR] Re-run Maven using the -X switch to enable full debug logging.
[ERROR] 
[ERROR] For more information about the errors and possible solutions, please read the following articles:
[ERROR] [Help 1] http://cwiki.apache.org/confluence/display/MAVEN/MojoFailureException
[ERROR] 
[ERROR] After correcting the problems, you can resume the build with the command
[ERROR]   mvn <goals> -rf :hbase-server
Build step 'Invoke top-level Maven targets' marked build as failure
Archiving artifacts
Recording test results
Updating HBASE-7935