You are viewing a plain text version of this content. The canonical link for it is here.
Posted to dev@poi.apache.org by Apache Jenkins Server <je...@builds.apache.org> on 2021/10/10 10:13:35 UTC
Build failed in Jenkins: POI » POI-DSL-Windows-1.16 #266
See <https://ci-builds.apache.org/job/POI/job/POI-DSL-Windows-1.16/266/display/redirect?page=changes>
Changes:
[PJ Fanning] imports
[PJ Fanning] [bug-65452] fix issue where WorkbookFactory.create(File, ...) returns null if file type not recognised
------------------------------------------
Started by an SCM change
Running as SYSTEM
[EnvInject] - Loading node environment variables.
[EnvInject] - Preparing an environment for the build.
[EnvInject] - Keeping Jenkins system variables.
[EnvInject] - Keeping Jenkins build variables.
[EnvInject] - Injecting as environment variables the properties content
LANG=en_US.UTF-8
FORREST_HOME=f:\jenkins\tools\forrest\latest
[EnvInject] - Variables injected successfully.
[EnvInject] - Injecting contributions.
Building remotely on jenkins-win-azr-5 (Windows) in workspace <https://ci-builds.apache.org/job/POI/job/POI-DSL-Windows-1.16/ws/>
[WS-CLEANUP] Deleting project workspace...
[WS-CLEANUP] Done
Updating https://svn.apache.org/repos/asf/poi/trunk at revision '2021-10-10T10:08:54.521 +0000'
U poi-ooxml\src\test\java\org\apache\poi\xssf\usermodel\TestXSSFBugs.java
U poi\src\main\java\org\apache\poi\ss\usermodel\WorkbookFactory.java
AU test-data\spreadsheet\workbook.xml
<-- Got one external: documentation, svn url: https://svn.apache.org/repos/asf/poi/site/src/documentation -->
Fetching 'https://svn.apache.org/repos/asf/poi/site/src/documentation' at -1 into 'F:\jenkins\jenkins-home\712657a4\workspace\POI\POI-DSL-Windows-1.16\src\documentation'
At revision 1894101
<-- Got one external: forrest.properties, svn url: https://svn.apache.org/repos/asf/poi/site/forrest.properties -->
Fetching 'https://svn.apache.org/repos/asf/poi/site/forrest.properties' at -1 into 'F:\jenkins\jenkins-home\712657a4\workspace\POI\POI-DSL-Windows-1.16\forrest.properties'
At revision 1894101
At revision 1894100
No changes for https://svn.apache.org/repos/asf/poi/site/src/documentation since the previous build
No changes for https://svn.apache.org/repos/asf/poi/site/forrest.properties since the previous build
[POI-DSL-Windows-1.16] $ cmd /c call F:\jenkins\jenkins-home\temp\jenkins4384692308885331951.bat
X forrest.properties
C poi\src\main\java9\module-info.class
? poi\src\main\java9\module-info.class.r1892945
? poi\src\main\java9\module-info.class.r1893854
C poi\src\test\java9\module-info.class
? poi\src\test\java9\module-info.class.r1892945
? poi\src\test\java9\module-info.class.r1893854
C poi-examples\src\main\java9\module-info.class
? poi-examples\src\main\java9\module-info.class.r1892945
? poi-examples\src\main\java9\module-info.class.r1893854
C poi-excelant\src\main\java9\module-info.class
? poi-excelant\src\main\java9\module-info.class.r1892680
? poi-excelant\src\main\java9\module-info.class.r1892931
C poi-excelant\src\test\java9\module-info.class
? poi-excelant\src\test\java9\module-info.class.r1892680
? poi-excelant\src\test\java9\module-info.class.r1892931
C poi-integration\src\test\java9\module-info.class
? poi-integration\src\test\java9\module-info.class.r1892945
? poi-integration\src\test\java9\module-info.class.r1893854
? poi-ooxml\abc.xlsx
C poi-ooxml\src\main\java9\module-info.class
? poi-ooxml\src\main\java9\module-info.class.r1892680
? poi-ooxml\src\main\java9\module-info.class.r1892931
C poi-ooxml\src\test\java9\module-info.class
? poi-ooxml\src\test\java9\module-info.class.r1892680
? poi-ooxml\src\test\java9\module-info.class.r1892931
C poi-ooxml-full\src\main\java9\module-info.class
? poi-ooxml-full\src\main\java9\module-info.class.r1892680
? poi-ooxml-full\src\main\java9\module-info.class.r1892931
C poi-ooxml-lite\src\main\java9\module-info.class
? poi-ooxml-lite\src\main\java9\module-info.class.r1892680
? poi-ooxml-lite\src\main\java9\module-info.class.r1892931
C poi-ooxml-lite-agent\src\main\java9\module-info.class
? poi-ooxml-lite-agent\src\main\java9\module-info.class.r1892680
? poi-ooxml-lite-agent\src\main\java9\module-info.class.r1892931
C poi-scratchpad\src\main\java9\module-info.class
? poi-scratchpad\src\main\java9\module-info.class.r1892680
? poi-scratchpad\src\main\java9\module-info.class.r1892931
C poi-scratchpad\src\test\java9\module-info.class
? poi-scratchpad\src\test\java9\module-info.class.r1892680
? poi-scratchpad\src\test\java9\module-info.class.r1892931
X src\documentation
Performing status on external item at 'src\documentation':
Summary of conflicts:
Text conflicts: 13
svn: E155010: The node 'F:\jenkins\jenkins-home\712657a4\workspace\POI\POI-DSL-Windows-1.16\poi*\src\*' was not found.
Java-Home: f:\\jenkins\\tools\\java\\latest16
Volume in drive F is Data
Volume Serial Number is 56F7-1E0B
Directory of f:\jenkins\tools\java\latest16
08/03/2021 04:38 PM <DIR> .
08/03/2021 04:38 PM <DIR> ..
08/03/2021 04:38 PM <DIR> bin
08/03/2021 04:38 PM <DIR> conf
08/03/2021 04:38 PM <DIR> include
08/03/2021 04:38 PM <DIR> jmods
08/03/2021 04:38 PM <DIR> legal
08/03/2021 04:38 PM <DIR> lib
11/11/2020 08:41 PM 1,165 release
1 File(s) 1,165 bytes
8 Dir(s) 1,018,703,499,264 bytes free
openjdk version "16-ea" 2021-03-16
OpenJDK Runtime Environment (build 16-ea+24-1553)
OpenJDK 64-Bit Server VM (build 16-ea+24-1553, mixed mode, sharing)
[Gradle] - Launching build.
[POI-DSL-Windows-1.16] $ cmd.exe /C "<https://ci-builds.apache.org/job/POI/job/POI-DSL-Windows-1.16/ws/gradlew.bat> clean jenkins && exit %%ERRORLEVEL%%"
Starting a Gradle Daemon, 2 busy and 1 stopped Daemons could not be reused, use --status for details
> Configure project :
Trying to override old definition of datatype junit
> Task :clean
> Task :poi:clean FAILED
FAILURE: Build failed with an exception.
* What went wrong:
Execution failed for task ':poi:clean'.
> java.io.IOException: Unable to delete file 'F:\jenkins\jenkins-home\712657a4\workspace\POI\POI-DSL-Windows-1.16\poi\build'
* Try:
Run with --stacktrace option to get the stack trace. Run with --info or --debug option to get more log output. Run with --scan to get full insights.
* Get more help at https://help.gradle.org
BUILD FAILED in 41s
2 actionable tasks: 2 executed
Build step 'Invoke Gradle script' changed build result to FAILURE
Build step 'Invoke Gradle script' marked build as failure
[SpotBugs] Skipping execution of recorder since overall result is 'FAILURE'
Archiving artifacts
Recording test results
[Checks API] No suitable checks publisher found.
---------------------------------------------------------------------
To unsubscribe, e-mail: dev-unsubscribe@poi.apache.org
For additional commands, e-mail: dev-help@poi.apache.org
Jenkins build is back to normal : POI » POI-DSL-Windows-1.16 #267
Posted by Apache Jenkins Server <je...@builds.apache.org>.
See <https://ci-builds.apache.org/job/POI/job/POI-DSL-Windows-1.16/267/display/redirect?page=changes>
---------------------------------------------------------------------
To unsubscribe, e-mail: dev-unsubscribe@poi.apache.org
For additional commands, e-mail: dev-help@poi.apache.org