You are viewing a plain text version of this content. The canonical link for it is here.
Posted to notifications@zookeeper.apache.org by Apache Jenkins Server <je...@builds.apache.org> on 2020/05/21 10:18:20 UTC

Build failed in Jenkins: zookeeper-master-maven #813

See <https://builds.apache.org/job/zookeeper-master-maven/813/display/redirect?page=changes>

Changes:

[nkalmar] ZOOKEEPER-3792: fix apidocs path


------------------------------------------
[...truncated 41.97 KB...]
[INFO] Tests run: 16, Failures: 0, Errors: 0, Skipped: 0, Time elapsed: 58.567 s - in org.apache.zookeeper.test.ClientSkipACLTest
[INFO] Running org.apache.zookeeper.test.CreateTest
[INFO] Tests run: 3, Failures: 0, Errors: 0, Skipped: 0, Time elapsed: 2.349 s - in org.apache.zookeeper.test.CreateTest
[INFO] Running org.apache.zookeeper.test.NonRecoverableErrorTest
[INFO] Tests run: 1, Failures: 0, Errors: 0, Skipped: 0, Time elapsed: 7.16 s - in org.apache.zookeeper.test.NonRecoverableErrorTest
[INFO] Running org.apache.zookeeper.test.StringUtilTest
[INFO] Tests run: 1, Failures: 0, Errors: 0, Skipped: 0, Time elapsed: 0.157 s - in org.apache.zookeeper.test.StringUtilTest
[INFO] Running org.apache.zookeeper.test.ClientRetryTest
[INFO] Tests run: 1, Failures: 0, Errors: 0, Skipped: 0, Time elapsed: 2.638 s - in org.apache.zookeeper.test.ClientRetryTest
[INFO] Running org.apache.zookeeper.test.FourLetterWordsWhiteListTest
[INFO] Tests run: 16, Failures: 0, Errors: 0, Skipped: 0, Time elapsed: 64.868 s - in org.apache.zookeeper.test.ClientTest
[INFO] Tests run: 6, Failures: 0, Errors: 0, Skipped: 0, Time elapsed: 5.669 s - in org.apache.zookeeper.test.FourLetterWordsWhiteListTest
[INFO] Running org.apache.zookeeper.test.SaslSuperUserTest
[INFO] Running org.apache.zookeeper.test.ObserverMasterTest
[INFO] Tests run: 1, Failures: 0, Errors: 0, Skipped: 0, Time elapsed: 1.418 s - in org.apache.zookeeper.test.SaslSuperUserTest
[INFO] Running org.apache.zookeeper.test.MaxCnxnsTest
[INFO] Tests run: 1, Failures: 0, Errors: 0, Skipped: 0, Time elapsed: 0.84 s - in org.apache.zookeeper.test.MaxCnxnsTest
[INFO] Tests run: 46, Failures: 0, Errors: 0, Skipped: 0, Time elapsed: 91.629 s - in org.apache.zookeeper.RemoveWatchesTest
[INFO] Running org.apache.zookeeper.test.ThrottledOpStandaloneTest
[INFO] Running org.apache.zookeeper.test.WatchedEventTest
[INFO] Tests run: 4, Failures: 0, Errors: 0, Skipped: 0, Time elapsed: 0.179 s - in org.apache.zookeeper.test.WatchedEventTest
[INFO] Running org.apache.zookeeper.test.ChrootTest
[INFO] Tests run: 1, Failures: 0, Errors: 0, Skipped: 0, Time elapsed: 2.035 s - in org.apache.zookeeper.test.ChrootTest
[INFO] Running org.apache.zookeeper.test.RepeatStartupTest
[INFO] Tests run: 1, Failures: 0, Errors: 0, Skipped: 0, Time elapsed: 3.292 s - in org.apache.zookeeper.test.RepeatStartupTest
[INFO] Tests run: 5, Failures: 0, Errors: 0, Skipped: 0, Time elapsed: 44.414 s - in org.apache.zookeeper.test.ThrottledOpQuorumTest
[INFO] Running org.apache.zookeeper.test.UnsupportedAddWatcherTest
[INFO] Running org.apache.zookeeper.test.FLERestartTest
[INFO] Tests run: 1, Failures: 0, Errors: 0, Skipped: 0, Time elapsed: 1.309 s - in org.apache.zookeeper.test.UnsupportedAddWatcherTest
[INFO] Tests run: 1, Failures: 0, Errors: 0, Skipped: 0, Time elapsed: 1.804 s - in org.apache.zookeeper.test.FLERestartTest
[INFO] Running org.apache.zookeeper.test.ReadOnlyModeTest
[INFO] Running org.apache.zookeeper.test.FourLetterWordsTest
[INFO] Tests run: 2, Failures: 0, Errors: 0, Skipped: 0, Time elapsed: 13.317 s - in org.apache.zookeeper.test.ThrottledOpStandaloneTest
[INFO] Running org.apache.zookeeper.test.SessionInvalidationTest
[INFO] Tests run: 5, Failures: 0, Errors: 0, Skipped: 0, Time elapsed: 2.458 s - in org.apache.zookeeper.test.FourLetterWordsTest
[INFO] Tests run: 1, Failures: 0, Errors: 0, Skipped: 0, Time elapsed: 1.613 s - in org.apache.zookeeper.test.SessionInvalidationTest
[INFO] Running org.apache.zookeeper.test.DuplicateLocalSessionUpgradeTest
[INFO] Running org.apache.zookeeper.test.ReconfigExceptionTest
[INFO] Tests run: 2, Failures: 0, Errors: 0, Skipped: 0, Time elapsed: 5.47 s - in org.apache.zookeeper.test.DuplicateLocalSessionUpgradeTest
[INFO] Running org.apache.zookeeper.test.ZkDatabaseCorruptionTest
[INFO] Tests run: 6, Failures: 0, Errors: 0, Skipped: 0, Time elapsed: 14.38 s - in org.apache.zookeeper.test.ReconfigExceptionTest
[INFO] Running org.apache.zookeeper.test.NioNettySuiteTest
[INFO] Tests run: 1, Failures: 0, Errors: 0, Skipped: 0, Time elapsed: 84.665 s - in org.apache.zookeeper.test.GetProposalFromTxnTest
[INFO] Running org.apache.zookeeper.test.WatcherTest
[INFO] Tests run: 2, Failures: 0, Errors: 0, Skipped: 0, Time elapsed: 19.922 s - in org.apache.zookeeper.test.ZkDatabaseCorruptionTest
[INFO] Running org.apache.zookeeper.test.ACLCountTest
[INFO] Tests run: 1, Failures: 0, Errors: 0, Skipped: 0, Time elapsed: 0.83 s - in org.apache.zookeeper.test.ACLCountTest
[INFO] Running org.apache.zookeeper.test.NIOConnectionFactoryFdLeakTest
[INFO] Tests run: 1, Failures: 0, Errors: 0, Skipped: 0, Time elapsed: 5.399 s - in org.apache.zookeeper.test.NIOConnectionFactoryFdLeakTest
[INFO] Running org.apache.zookeeper.test.FLEZeroWeightTest
[INFO] Tests run: 5, Failures: 0, Errors: 0, Skipped: 0, Time elapsed: 42.315 s - in org.apache.zookeeper.test.ReadOnlyModeTest
[INFO] Tests run: 1, Failures: 0, Errors: 0, Skipped: 0, Time elapsed: 2.186 s - in org.apache.zookeeper.test.FLEZeroWeightTest
[INFO] Running org.apache.zookeeper.test.MultiAsyncTransactionTest
[INFO] Running org.apache.zookeeper.test.FLETest
[INFO] Tests run: 1, Failures: 0, Errors: 0, Skipped: 0, Time elapsed: 1.707 s - in org.apache.zookeeper.test.MultiAsyncTransactionTest
[INFO] Running org.apache.zookeeper.test.QuorumQuotaTest
[INFO] Tests run: 6, Failures: 0, Errors: 0, Skipped: 0, Time elapsed: 10.519 s - in org.apache.zookeeper.test.FLETest
[INFO] Running org.apache.zookeeper.test.SaslDigestAuthOverSSLTest
[INFO] Tests run: 1, Failures: 0, Errors: 0, Skipped: 0, Time elapsed: 3.675 s - in org.apache.zookeeper.test.SaslDigestAuthOverSSLTest
[INFO] Running org.apache.zookeeper.test.BufferSizeTest
[INFO] Tests run: 8, Failures: 0, Errors: 0, Skipped: 0, Time elapsed: 36.38 s - in org.apache.zookeeper.test.WatcherTest
[INFO] Running org.apache.zookeeper.test.QuorumUtilTest
[INFO] Tests run: 8, Failures: 0, Errors: 0, Skipped: 0, Time elapsed: 77.44 s - in org.apache.zookeeper.test.ObserverMasterTest
[INFO] Running org.apache.zookeeper.test.EnsembleAuthTest
[INFO] Tests run: 1, Failures: 0, Errors: 0, Skipped: 0, Time elapsed: 164.166 s - in org.apache.zookeeper.test.ObserverQuorumHammerTest
[INFO] Running org.apache.zookeeper.test.EmptiedSnapshotRecoveryTest
[INFO] Tests run: 1, Failures: 0, Errors: 0, Skipped: 0, Time elapsed: 6.294 s - in org.apache.zookeeper.test.QuorumUtilTest
[INFO] Tests run: 2, Failures: 0, Errors: 0, Skipped: 0, Time elapsed: 21.236 s - in org.apache.zookeeper.test.QuorumQuotaTest
[INFO] Running org.apache.zookeeper.test.SaslAuthRequiredTest
[INFO] Running org.apache.zookeeper.test.SessionUpgradeTest
[INFO] Tests run: 7, Failures: 0, Errors: 0, Skipped: 0, Time elapsed: 6.201 s - in org.apache.zookeeper.test.EnsembleAuthTest
[INFO] Tests run: 1, Failures: 0, Errors: 0, Skipped: 0, Time elapsed: 1.01 s - in org.apache.zookeeper.test.SaslAuthRequiredTest
[INFO] Running org.apache.zookeeper.test.FollowerResyncConcurrencyTest
[INFO] Tests run: 6, Failures: 0, Errors: 0, Skipped: 0, Time elapsed: 10.251 s - in org.apache.zookeeper.test.BufferSizeTest
[INFO] Running org.apache.zookeeper.test.ChrootClientTest
[INFO] Running org.apache.zookeeper.test.StatTest
[INFO] Tests run: 4, Failures: 0, Errors: 0, Skipped: 0, Time elapsed: 2.782 s - in org.apache.zookeeper.test.StatTest
[INFO] Running org.apache.zookeeper.test.StandaloneTest
[INFO] Tests run: 4, Failures: 0, Errors: 0, Skipped: 0, Time elapsed: 3.636 s - in org.apache.zookeeper.test.StandaloneTest
[INFO] Running org.apache.zookeeper.test.QuorumZxidSyncTest
[INFO] Tests run: 3, Failures: 0, Errors: 0, Skipped: 0, Time elapsed: 15.718 s - in org.apache.zookeeper.test.EmptiedSnapshotRecoveryTest
[INFO] Running org.apache.zookeeper.test.MultiOperationTest
[INFO] Tests run: 4, Failures: 0, Errors: 0, Skipped: 0, Time elapsed: 13.719 s - in org.apache.zookeeper.test.SessionUpgradeTest
[INFO] Running org.apache.zookeeper.test.ConnectStringParserTest
[INFO] Tests run: 4, Failures: 0, Errors: 0, Skipped: 0, Time elapsed: 0.215 s - in org.apache.zookeeper.test.ConnectStringParserTest
[INFO] Tests run: 35, Failures: 0, Errors: 0, Skipped: 0, Time elapsed: 188.342 s - in org.apache.zookeeper.ZooKeeperTest
[INFO] Running org.apache.zookeeper.test.AsyncOpsTest
[INFO] Running org.apache.zookeeper.test.ClientPortBindTest
[INFO] Tests run: 1, Failures: 0, Errors: 0, Skipped: 0, Time elapsed: 0.747 s - in org.apache.zookeeper.test.ClientPortBindTest
[INFO] Running org.apache.zookeeper.test.AsyncHammerTest
[INFO] Tests run: 38, Failures: 0, Errors: 0, Skipped: 0, Time elapsed: 15.933 s - in org.apache.zookeeper.test.AsyncOpsTest
[INFO] Running org.apache.zookeeper.test.QuorumTest
[INFO] Tests run: 2, Failures: 0, Errors: 0, Skipped: 0, Time elapsed: 31.007 s - in org.apache.zookeeper.test.QuorumZxidSyncTest
[INFO] Running org.apache.zookeeper.test.NioNettySuiteHammerTest
[INFO] Tests run: 16, Failures: 0, Errors: 0, Skipped: 0, Time elapsed: 42.763 s - in org.apache.zookeeper.test.ChrootClientTest
[INFO] Tests run: 56, Failures: 0, Errors: 0, Skipped: 0, Time elapsed: 31.621 s - in org.apache.zookeeper.test.MultiOperationTest
[INFO] Running org.apache.zookeeper.test.RestoreCommittedLogTest
[INFO] Running org.apache.zookeeper.test.GetChildren2Test
[INFO] Tests run: 2, Failures: 0, Errors: 0, Skipped: 0, Time elapsed: 1.972 s - in org.apache.zookeeper.test.GetChildren2Test
[INFO] Running org.apache.zookeeper.test.ClientSSLTest
[INFO] Tests run: 3, Failures: 0, Errors: 0, Skipped: 0, Time elapsed: 7.045 s - in org.apache.zookeeper.test.ClientSSLTest
[INFO] Running org.apache.zookeeper.test.SaslAuthFailTest
[INFO] Tests run: 2, Failures: 0, Errors: 0, Skipped: 0, Time elapsed: 0.967 s - in org.apache.zookeeper.test.SaslAuthFailTest
[INFO] Running org.apache.zookeeper.test.EventTypeTest
[INFO] Tests run: 2, Failures: 0, Errors: 0, Skipped: 0, Time elapsed: 0.175 s - in org.apache.zookeeper.test.EventTypeTest
[INFO] Running org.apache.zookeeper.test.SaslAuthFailDesignatedClientTest
[INFO] Tests run: 1, Failures: 0, Errors: 0, Skipped: 0, Time elapsed: 0.973 s - in org.apache.zookeeper.test.SaslAuthFailDesignatedClientTest
[INFO] Running org.apache.zookeeper.test.WatchEventWhenAutoResetTest
[INFO] Tests run: 4, Failures: 0, Errors: 0, Skipped: 0, Time elapsed: 22.407 s - in org.apache.zookeeper.test.WatchEventWhenAutoResetTest
[INFO] Running org.apache.zookeeper.test.HierarchicalQuorumTest
[INFO] Tests run: 2, Failures: 0, Errors: 0, Skipped: 0, Time elapsed: 73.956 s - in org.apache.zookeeper.test.AsyncHammerTest
[INFO] Running org.apache.zookeeper.test.SaslAuthDesignatedServerTest
[INFO] Tests run: 1, Failures: 0, Errors: 0, Skipped: 0, Time elapsed: 1.052 s - in org.apache.zookeeper.test.SaslAuthDesignatedServerTest
[INFO] Running org.apache.zookeeper.test.PersistentRecursiveWatcherTest
[INFO] Tests run: 1, Failures: 0, Errors: 0, Skipped: 0, Time elapsed: 16.193 s - in org.apache.zookeeper.test.HierarchicalQuorumTest
[INFO] Running org.apache.zookeeper.test.FLEPredicateTest
[INFO] Tests run: 1, Failures: 0, Errors: 0, Skipped: 0, Time elapsed: 0.318 s - in org.apache.zookeeper.test.FLEPredicateTest
[INFO] Tests run: 6, Failures: 0, Errors: 0, Skipped: 0, Time elapsed: 9.496 s - in org.apache.zookeeper.test.PersistentRecursiveWatcherTest
[INFO] Running org.apache.zookeeper.test.QuorumRestartTest
[INFO] Running org.apache.zookeeper.test.ClientHammerTest
[WARNING] Tests run: 15, Failures: 0, Errors: 0, Skipped: 1, Time elapsed: 82.032 s - in org.apache.zookeeper.test.QuorumTest
[INFO] Running org.apache.zookeeper.test.WatcherFuncTest
[INFO] Tests run: 2, Failures: 0, Errors: 0, Skipped: 0, Time elapsed: 72.59 s - in org.apache.zookeeper.test.NioNettySuiteHammerTest
[INFO] Tests run: 3, Failures: 0, Errors: 0, Skipped: 0, Time elapsed: 10.841 s - in org.apache.zookeeper.test.QuorumRestartTest
[INFO] Running org.apache.zookeeper.test.RecoveryTest
[INFO] Running org.apache.zookeeper.test.SaslAuthRequiredFailWrongSASLTest
[INFO] Tests run: 1, Failures: 0, Errors: 0, Skipped: 0, Time elapsed: 1.326 s - in org.apache.zookeeper.test.SaslAuthRequiredFailWrongSASLTest
[INFO] Running org.apache.zookeeper.test.NettyNettySuiteHammerTest
[INFO] Tests run: 6, Failures: 0, Errors: 0, Skipped: 0, Time elapsed: 4.231 s - in org.apache.zookeeper.test.WatcherFuncTest
[INFO] Running org.apache.zookeeper.test.KeyAuthClientTest
[INFO] Tests run: 1, Failures: 0, Errors: 0, Skipped: 0, Time elapsed: 2.881 s - in org.apache.zookeeper.test.KeyAuthClientTest
[INFO] Running org.apache.zookeeper.test.ChrootAsyncTest
[INFO] Tests run: 6, Failures: 0, Errors: 0, Skipped: 0, Time elapsed: 137.021 s - in org.apache.zookeeper.test.FollowerResyncConcurrencyTest
[INFO] Running org.apache.zookeeper.test.QuorumMajorityTest
[INFO] Tests run: 2, Failures: 0, Errors: 0, Skipped: 0, Time elapsed: 6.809 s - in org.apache.zookeeper.test.QuorumMajorityTest
[INFO] Running org.apache.zookeeper.test.NullDataTest
[INFO] Tests run: 1, Failures: 0, Errors: 0, Skipped: 0, Time elapsed: 0.936 s - in org.apache.zookeeper.test.NullDataTest
[INFO] Tests run: 38, Failures: 0, Errors: 0, Skipped: 0, Time elapsed: 23.136 s - in org.apache.zookeeper.test.ChrootAsyncTest
[INFO] Running org.apache.zookeeper.test.LoadFromLogTest
[INFO] Running org.apache.zookeeper.test.CreateModeTest
[INFO] Tests run: 3, Failures: 0, Errors: 0, Skipped: 0, Time elapsed: 0.174 s - in org.apache.zookeeper.test.CreateModeTest
[INFO] Running org.apache.zookeeper.test.ThrottledOpObserverTest
[INFO] Tests run: 2, Failures: 0, Errors: 0, Skipped: 0, Time elapsed: 52.048 s - in org.apache.zookeeper.test.NettyNettySuiteHammerTest
[INFO] Running org.apache.zookeeper.test.ServerCnxnTest
[INFO] Tests run: 3, Failures: 0, Errors: 0, Skipped: 0, Time elapsed: 22.318 s - in org.apache.zookeeper.test.ThrottledOpObserverTest
[INFO] Running org.apache.zookeeper.test.FLENewEpochTest
[INFO] Tests run: 1, Failures: 0, Errors: 0, Skipped: 0, Time elapsed: 1.153 s - in org.apache.zookeeper.test.FLENewEpochTest
[INFO] Tests run: 1, Failures: 0, Errors: 0, Skipped: 0, Time elapsed: 3.551 s - in org.apache.zookeeper.test.ServerCnxnTest
[INFO] Running org.apache.zookeeper.test.SSLAuthTest
[INFO] Running org.apache.zookeeper.test.SessionTest
[INFO] Tests run: 2, Failures: 0, Errors: 0, Skipped: 0, Time elapsed: 3.592 s - in org.apache.zookeeper.test.SSLAuthTest
[INFO] Running org.apache.zookeeper.test.SaslAuthMissingClientConfigTest
[INFO] Tests run: 1, Failures: 0, Errors: 0, Skipped: 0, Time elapsed: 1.015 s - in org.apache.zookeeper.test.SaslAuthMissingClientConfigTest
[INFO] Running org.apache.zookeeper.test.OSMXBeanTest
[INFO] Tests run: 3, Failures: 0, Errors: 0, Skipped: 0, Time elapsed: 0.17 s - in org.apache.zookeeper.test.OSMXBeanTest
[INFO] Running org.apache.zookeeper.test.ACLRootTest
[INFO] Tests run: 1, Failures: 0, Errors: 0, Skipped: 0, Time elapsed: 2.03 s - in org.apache.zookeeper.test.ACLRootTest
[INFO] Running org.apache.zookeeper.test.SessionTrackerCheckTest
[INFO] Tests run: 2, Failures: 0, Errors: 0, Skipped: 0, Time elapsed: 0.188 s - in org.apache.zookeeper.test.SessionTrackerCheckTest
[INFO] Running org.apache.zookeeper.test.KeeperStateTest
[INFO] Tests run: 4, Failures: 0, Errors: 0, Skipped: 0, Time elapsed: 0.17 s - in org.apache.zookeeper.test.KeeperStateTest
[INFO] Running org.apache.zookeeper.test.LogChopperTest
[INFO] Tests run: 1, Failures: 0, Errors: 0, Skipped: 0, Time elapsed: 72.908 s - in org.apache.zookeeper.test.RecoveryTest
[INFO] Tests run: 1, Failures: 0, Errors: 0, Skipped: 0, Time elapsed: 0.744 s - in org.apache.zookeeper.test.LogChopperTest
[INFO] Running org.apache.zookeeper.test.LocalSessionsOnlyTest
[INFO] Running org.apache.zookeeper.test.LoadFromLogNoServerTest
[INFO] Tests run: 2, Failures: 0, Errors: 0, Skipped: 0, Time elapsed: 0.295 s - in org.apache.zookeeper.test.LoadFromLogNoServerTest
[INFO] Tests run: 6, Failures: 0, Errors: 0, Skipped: 0, Time elapsed: 43.113 s - in org.apache.zookeeper.test.LoadFromLogTest
[INFO] Running org.apache.zookeeper.test.AtomicFileOutputStreamTest
[INFO] Running org.apache.zookeeper.test.DisconnectedWatcherTest
[INFO] Tests run: 7, Failures: 0, Errors: 0, Skipped: 0, Time elapsed: 0.425 s - in org.apache.zookeeper.test.AtomicFileOutputStreamTest
[INFO] Running org.apache.zookeeper.test.ACLTest
[INFO] Tests run: 6, Failures: 0, Errors: 0, Skipped: 0, Time elapsed: 16.417 s - in org.apache.zookeeper.test.SessionTest
[INFO] Running org.apache.zookeeper.test.ReconfigMisconfigTest
[INFO] Tests run: 2, Failures: 0, Errors: 0, Skipped: 0, Time elapsed: 5.234 s - in org.apache.zookeeper.test.LocalSessionsOnlyTest
[INFO] Running org.apache.zookeeper.test.ZooKeeperQuotaTest
[INFO] Tests run: 1, Failures: 0, Errors: 0, Skipped: 0, Time elapsed: 2.087 s - in org.apache.zookeeper.test.ReconfigMisconfigTest
[INFO] Running org.apache.zookeeper.test.ObserverLETest
[INFO] Tests run: 3, Failures: 0, Errors: 0, Skipped: 0, Time elapsed: 3.13 s - in org.apache.zookeeper.test.ZooKeeperQuotaTest
[INFO] Running org.apache.zookeeper.test.ReconfigTest
[INFO] Tests run: 6, Failures: 0, Errors: 0, Skipped: 0, Time elapsed: 8.843 s - in org.apache.zookeeper.test.ACLTest
[INFO] Tests run: 1, Failures: 0, Errors: 0, Skipped: 0, Time elapsed: 3.894 s - in org.apache.zookeeper.test.ObserverLETest
[INFO] Running org.apache.zookeeper.test.AsyncTest
[INFO] Running org.apache.zookeeper.test.SyncCallTest
[INFO] Tests run: 1, Failures: 0, Errors: 0, Skipped: 0, Time elapsed: 1.113 s - in org.apache.zookeeper.test.SyncCallTest
[INFO] Running org.apache.zookeeper.test.AuthTest
[INFO] Tests run: 1, Failures: 0, Errors: 0, Skipped: 0, Time elapsed: 2.871 s - in org.apache.zookeeper.test.AsyncTest
[INFO] Running org.apache.zookeeper.test.QuorumHammerTest
[INFO] Tests run: 4, Failures: 0, Errors: 0, Skipped: 0, Time elapsed: 2.83 s - in org.apache.zookeeper.test.AuthTest
[INFO] Running org.apache.zookeeper.test.X509AuthTest
[INFO] Tests run: 3, Failures: 0, Errors: 0, Skipped: 0, Time elapsed: 0.194 s - in org.apache.zookeeper.test.X509AuthTest
[INFO] Running org.apache.zookeeper.cli.CommandFactoryTest
[INFO] Tests run: 1, Failures: 0, Errors: 0, Skipped: 0, Time elapsed: 0.104 s - in org.apache.zookeeper.cli.CommandFactoryTest
[INFO] Running org.apache.zookeeper.server.NettyServerCnxnTest
[INFO] Tests run: 2, Failures: 0, Errors: 0, Skipped: 0, Time elapsed: 175.808 s - in org.apache.zookeeper.test.RestoreCommittedLogTest
[INFO] Tests run: 2, Failures: 0, Errors: 0, Skipped: 0, Time elapsed: 114.915 s - in org.apache.zookeeper.test.ClientHammerTest
[INFO] Running org.apache.zookeeper.server.BlueThrottleTest
[INFO] Running org.apache.zookeeper.server.ZooKeeperServerTest
[INFO] Tests run: 6, Failures: 0, Errors: 0, Skipped: 0, Time elapsed: 0.237 s - in org.apache.zookeeper.server.ZooKeeperServerTest
[INFO] Running org.apache.zookeeper.server.metric.AvgMinMaxCounterSetTest
[INFO] Tests run: 2, Failures: 0, Errors: 0, Skipped: 0, Time elapsed: 0.184 s - in org.apache.zookeeper.server.metric.AvgMinMaxCounterSetTest
[INFO] Running org.apache.zookeeper.server.metric.AvgMinMaxPercentileCounterSetTest
[INFO] Tests run: 2, Failures: 0, Errors: 0, Skipped: 0, Time elapsed: 0.195 s - in org.apache.zookeeper.server.metric.AvgMinMaxPercentileCounterSetTest
[INFO] Running org.apache.zookeeper.server.metric.AvgMinMaxPercentileCounterTest
[INFO] Tests run: 2, Failures: 0, Errors: 0, Skipped: 0, Time elapsed: 0.192 s - in org.apache.zookeeper.server.metric.AvgMinMaxPercentileCounterTest
[INFO] Running org.apache.zookeeper.server.InvalidSnapshotTest
ERROR: Failed to parse POMs
java.io.IOException: Backing channel 'H5' is disconnected.
	at hudson.remoting.RemoteInvocationHandler.channelOrFail(RemoteInvocationHandler.java:214)
	at hudson.remoting.RemoteInvocationHandler.invoke(RemoteInvocationHandler.java:283)
	at com.sun.proxy.$Proxy141.isAlive(Unknown Source)
	at hudson.Launcher$RemoteLauncher$ProcImpl.isAlive(Launcher.java:1150)
	at hudson.maven.ProcessCache$MavenProcess.call(ProcessCache.java:166)
	at hudson.maven.MavenModuleSetBuild$MavenModuleSetBuildExecution.doRun(MavenModuleSetBuild.java:879)
	at hudson.model.AbstractBuild$AbstractBuildExecution.run(AbstractBuild.java:504)
	at hudson.model.Run.execute(Run.java:1815)
	at hudson.maven.MavenModuleSetBuild.run(MavenModuleSetBuild.java:543)
	at hudson.model.ResourceController.execute(ResourceController.java:97)
	at hudson.model.Executor.run(Executor.java:429)
Caused by: java.io.IOException: Unexpected termination of the channel
	at hudson.remoting.SynchronousCommandTransport$ReaderThread.run(SynchronousCommandTransport.java:77)
Caused by: java.io.EOFException
	at java.io.ObjectInputStream$PeekInputStream.readFully(ObjectInputStream.java:2681)
	at java.io.ObjectInputStream$BlockDataInputStream.readShort(ObjectInputStream.java:3156)
	at java.io.ObjectInputStream.readStreamHeader(ObjectInputStream.java:862)
	at java.io.ObjectInputStream.<init>(ObjectInputStream.java:358)
	at hudson.remoting.ObjectInputStreamEx.<init>(ObjectInputStreamEx.java:49)
	at hudson.remoting.Command.readFrom(Command.java:140)
	at hudson.remoting.Command.readFrom(Command.java:126)
	at hudson.remoting.AbstractSynchronousByteArrayCommandTransport.read(AbstractSynchronousByteArrayCommandTransport.java:36)
	at hudson.remoting.SynchronousCommandTransport$ReaderThread.run(SynchronousCommandTransport.java:63)
ERROR: Step ?Record compiler warnings and static analysis results? aborted due to exception: 
java.io.IOException: No workspace found for zookeeper-master-maven #813
	at io.jenkins.plugins.analysis.core.steps.IssuesRecorder.perform(IssuesRecorder.java:524)
	at hudson.tasks.BuildStepMonitor$1.perform(BuildStepMonitor.java:20)
	at hudson.model.AbstractBuild$AbstractBuildExecution.perform(AbstractBuild.java:741)
	at hudson.model.AbstractBuild$AbstractBuildExecution.performAllBuildSteps(AbstractBuild.java:690)
	at hudson.maven.MavenModuleSetBuild$MavenModuleSetBuildExecution.post2(MavenModuleSetBuild.java:1074)
	at hudson.model.AbstractBuild$AbstractBuildExecution.post(AbstractBuild.java:635)
	at hudson.model.Run.execute(Run.java:1840)
	at hudson.maven.MavenModuleSetBuild.run(MavenModuleSetBuild.java:543)
	at hudson.model.ResourceController.execute(ResourceController.java:97)
	at hudson.model.Executor.run(Executor.java:429)
ERROR: H5 is offline; cannot locate JDK 1.8 (latest)
ERROR: H5 is offline; cannot locate Maven 3 (latest)
ERROR: H5 is offline; cannot locate JDK 1.8 (latest)
ERROR: H5 is offline; cannot locate Maven 3 (latest)
ERROR: H5 is offline; cannot locate JDK 1.8 (latest)
ERROR: H5 is offline; cannot locate Maven 3 (latest)

Jenkins build is back to normal : zookeeper-master-maven #815

Posted by Apache Jenkins Server <je...@builds.apache.org>.
See <https://builds.apache.org/job/zookeeper-master-maven/815/display/redirect>


Build failed in Jenkins: zookeeper-master-maven #814

Posted by Apache Jenkins Server <je...@builds.apache.org>.
See <https://builds.apache.org/job/zookeeper-master-maven/814/display/redirect?page=changes>

Changes:

[eolivelli] ZOOKEEPER-3832: ZKHostnameVerifier rejects valid certificates with


------------------------------------------
[...truncated 318.88 KB...]
     [exec] ZooKeeper JMX enabled by default
     [exec] Using config: <https://builds.apache.org/job/zookeeper-master-maven/ws/zookeeper-client/zookeeper-client-c/../../build/test/test-cppunit/conf/2.conf>
     [exec] Stopping zookeeper ... STOPPED
     [exec]  : elapsed 10895 : OK
     [exec] ZooKeeper JMX enabled by default
     [exec] Using config: <https://builds.apache.org/job/zookeeper-master-maven/ws/zookeeper-client/zookeeper-client-c/../../build/test/test-cppunit/conf/0.conf>
     [exec] TestReconfigServer::testReconfigFailureWithoutServerSuperuserPasswordConfiguredStarting zookeeper ... STARTED
     [exec] ZooKeeper JMX enabled by default
     [exec] Using config: <https://builds.apache.org/job/zookeeper-master-maven/ws/zookeeper-client/zookeeper-client-c/../../build/test/test-cppunit/conf/1.conf>
     [exec] Starting zookeeper ... STARTED
     [exec] ZooKeeper JMX enabled by default
     [exec] Using config: <https://builds.apache.org/job/zookeeper-master-maven/ws/zookeeper-client/zookeeper-client-c/../../build/test/test-cppunit/conf/2.conf>
     [exec] Starting zookeeper ... STARTED
     [exec] ZooKeeper JMX enabled by default
     [exec] Using config: <https://builds.apache.org/job/zookeeper-master-maven/ws/zookeeper-client/zookeeper-client-c/../../build/test/test-cppunit/conf/0.conf>
     [exec] ZooKeeper JMX enabled by default
     [exec] Using config: <https://builds.apache.org/job/zookeeper-master-maven/ws/zookeeper-client/zookeeper-client-c/../../build/test/test-cppunit/conf/1.conf>
     [exec] ZooKeeper JMX enabled by default
     [exec] Using config: <https://builds.apache.org/job/zookeeper-master-maven/ws/zookeeper-client/zookeeper-client-c/../../build/test/test-cppunit/conf/2.conf>
     [exec] ZooKeeper JMX enabled by default
     [exec] Using config: <https://builds.apache.org/job/zookeeper-master-maven/ws/zookeeper-client/zookeeper-client-c/../../build/test/test-cppunit/conf/0.conf>
     [exec] Stopping zookeeper ... STOPPED
     [exec] ZooKeeper JMX enabled by default
     [exec] Using config: <https://builds.apache.org/job/zookeeper-master-maven/ws/zookeeper-client/zookeeper-client-c/../../build/test/test-cppunit/conf/1.conf>
     [exec] Stopping zookeeper ... STOPPED
     [exec] ZooKeeper JMX enabled by default
     [exec] Using config: <https://builds.apache.org/job/zookeeper-master-maven/ws/zookeeper-client/zookeeper-client-c/../../build/test/test-cppunit/conf/2.conf>
     [exec] Stopping zookeeper ... STOPPED
     [exec] ZooKeeper JMX enabled by default
     [exec] Using config: <https://builds.apache.org/job/zookeeper-master-maven/ws/zookeeper-client/zookeeper-client-c/../../build/test/test-cppunit/conf/0.conf>
     [exec] Starting zookeeper ... STARTED
     [exec] ZooKeeper JMX enabled by default
     [exec] Using config: <https://builds.apache.org/job/zookeeper-master-maven/ws/zookeeper-client/zookeeper-client-c/../../build/test/test-cppunit/conf/1.conf>
     [exec] Starting zookeeper ... STARTED
     [exec] ZooKeeper JMX enabled by default
     [exec] Using config: <https://builds.apache.org/job/zookeeper-master-maven/ws/zookeeper-client/zookeeper-client-c/../../build/test/test-cppunit/conf/2.conf>
     [exec] ZooKeeper JMX enabled by default
     [exec] Starting zookeeper ... STARTED
     [exec] Using config: <https://builds.apache.org/job/zookeeper-master-maven/ws/zookeeper-client/zookeeper-client-c/../../build/test/test-cppunit/conf/0.conf>
     [exec] ZooKeeper JMX enabled by default
     [exec] Using config: <https://builds.apache.org/job/zookeeper-master-maven/ws/zookeeper-client/zookeeper-client-c/../../build/test/test-cppunit/conf/1.conf>
     [exec] ZooKeeper JMX enabled by default
     [exec] Using config: <https://builds.apache.org/job/zookeeper-master-maven/ws/zookeeper-client/zookeeper-client-c/../../build/test/test-cppunit/conf/2.conf>
     [exec] ZooKeeper JMX enabled by default
     [exec] Using config: <https://builds.apache.org/job/zookeeper-master-maven/ws/zookeeper-client/zookeeper-client-c/../../build/test/test-cppunit/conf/0.conf>
     [exec] ZooKeeper JMX enabled by default
     [exec] Using config: <https://builds.apache.org/job/zookeeper-master-maven/ws/zookeeper-client/zookeeper-client-c/../../build/test/test-cppunit/conf/1.conf>
     [exec] ZooKeeper JMX enabled by default
     [exec] Using config: <https://builds.apache.org/job/zookeeper-master-maven/ws/zookeeper-client/zookeeper-client-c/../../build/test/test-cppunit/conf/2.conf>
     [exec] ZooKeeper JMX enabled by default
     [exec] Using config: <https://builds.apache.org/job/zookeeper-master-maven/ws/zookeeper-client/zookeeper-client-c/../../build/test/test-cppunit/conf/0.conf>
     [exec] ZooKeeper JMX enabled by default
     [exec] Using config: <https://builds.apache.org/job/zookeeper-master-maven/ws/zookeeper-client/zookeeper-client-c/../../build/test/test-cppunit/conf/1.conf>
     [exec] ZooKeeper JMX enabled by default
     [exec] Using config: <https://builds.apache.org/job/zookeeper-master-maven/ws/zookeeper-client/zookeeper-client-c/../../build/test/test-cppunit/conf/0.conf>
     [exec] Stopping zookeeper ... STOPPED
     [exec] ZooKeeper JMX enabled by default
     [exec] Using config: <https://builds.apache.org/job/zookeeper-master-maven/ws/zookeeper-client/zookeeper-client-c/../../build/test/test-cppunit/conf/1.conf>
     [exec] Stopping zookeeper ... STOPPED
     [exec] ZooKeeper JMX enabled by default
     [exec] Using config: <https://builds.apache.org/job/zookeeper-master-maven/ws/zookeeper-client/zookeeper-client-c/../../build/test/test-cppunit/conf/2.conf>
     [exec] Stopping zookeeper ... STOPPED
     [exec]  : elapsed 18203 : OK
     [exec] Zookeeper_clientretry::testRetry ZooKeeper server started ZooKeeper server started : elapsed 14402 : OK
     [exec] Zookeeper_operations::testAsyncWatcher1 : elapsed 55 : OK
     [exec] Zookeeper_operations::testAsyncGetOperation : elapsed 55 : OK
     [exec] Zookeeper_operations::testOperationsAndDisconnectConcurrently1 : elapsed 366 : OK
     [exec] Zookeeper_operations::testOperationsAndDisconnectConcurrently2 : elapsed 0 : OK
     [exec] Zookeeper_operations::testConcurrentOperations1 : elapsed 15261 : OK
     [exec] Zookeeper_multi::testCreate : elapsed 1058 : OK
     [exec] Zookeeper_multi::testCreateDelete : elapsed 1033 : OK
     [exec] Zookeeper_multi::testInvalidVersion : elapsed 1024 : OK
     [exec] Zookeeper_multi::testNestedCreate : elapsed 1074 : OK
     [exec] Zookeeper_multi::testSetData : elapsed 6047 : OK
     [exec] Zookeeper_multi::testUpdateConflict : elapsed 1035 : OK
     [exec] Zookeeper_multi::testDeleteUpdateConflict : elapsed 1033 : OK
     [exec] Zookeeper_multi::testAsyncMulti : elapsed 2017 : OK
     [exec] Zookeeper_multi::testMultiFail : assertion : elapsed 10001
     [exec] Zookeeper_multi::testCheck : elapsed 1085 : OK
     [exec] Zookeeper_multi::testWatch : elapsed 2041 : OK
     [exec] Zookeeper_multi::testSequentialNodeCreateInAsyncMulti : elapsed 9008 : OK
     [exec] Zookeeper_multi::testBigAsyncMulti : elapsed 3008 : OK
     [exec] Zookeeper_watchers::testDefaultSessionWatcher1 : elapsed 51 : OK
     [exec] Zookeeper_watchers::testDefaultSessionWatcher2 : elapsed 4 : OK
     [exec] Zookeeper_watchers::testObjectSessionWatcher1 : elapsed 53 : OK
     [exec] Zookeeper_watchers::testObjectSessionWatcher2 : elapsed 55 : OK
     [exec] Zookeeper_watchers::testNodeWatcher1 : elapsed 106 : OK
     [exec] Zookeeper_watchers::testChildWatcher1 : elapsed 54 : OK
     [exec] Zookeeper_watchers::testChildWatcher2 : elapsed 105 : OK
     [exec] Zookeeper_simpleSystem::testLogCallbackSetLog Message Received: [2020-05-21 13:40:37,161:9656(0x7f08e6fefb80):ZOO_INFO@testLogCallbackSet@1122: testLogCallbackSet #0]
     [exec] Log Message Received: [2020-05-21 13:40:37,162:9656(0x7f08e6fefb80):ZOO_INFO@testLogCallbackSet@1122: testLogCallbackSet #1]
     [exec] Log Message Received: [2020-05-21 13:40:37,162:9656(0x7f08e6fefb80):ZOO_INFO@testLogCallbackSet@1122: testLogCallbackSet #2]
     [exec] Log Message Received: [2020-05-21 13:40:37,162:9656(0x7f08e6fefb80):ZOO_INFO@testLogCallbackSet@1122: testLogCallbackSet #3]
     [exec] Log Message Received: [2020-05-21 13:40:37,162:9656(0x7f08e6fefb80):ZOO_INFO@testLogCallbackSet@1122: testLogCallbackSet #4]
     [exec] Log Message Received: [2020-05-21 13:40:37,162:9656(0x7f08e6fefb80):ZOO_INFO@testLogCallbackSet@1122: testLogCallbackSet #5]
     [exec] Log Message Received: [2020-05-21 13:40:37,162:9656(0x7f08e6fefb80):ZOO_INFO@testLogCallbackSet@1122: testLogCallbackSet #6]
     [exec] Log Message Received: [2020-05-21 13:40:37,162:9656(0x7f08e6fefb80):ZOO_INFO@testLogCallbackSet@1122: testLogCallbackSet #7]
     [exec] Log Message Received: [2020-05-21 13:40:37,162:9656(0x7f08e6fefb80):ZOO_INFO@testLogCallbackSet@1122: testLogCallbackSet #8]
     [exec] Log Message Received: [2020-05-21 13:40:37,162:9656(0x7f08e6fefb80):ZOO_INFO@testLogCallbackSet@1122: testLogCallbackSet #9]
     [exec] Log Message Received: [2020-05-21 13:40:37,162:9656(0x7f08e6fefb80):ZOO_INFO@zookeeper_close@3775: Closing zookeeper sessionId=0x100025a557d0003 to 127.0.0.1:22181
     [exec] ]
     [exec] Log Message Received: [2020-05-21 13:40:37,180:9656(0x7f08e6fefb80):ZOO_INFO@zookeeper_close@3797: Freeing zookeeper resources for sessionId=0x100025a557d0003
     [exec] ]
     [exec]  : elapsed 1018 : OK
     [exec] Zookeeper_simpleSystem::testLogCallbackInitLog Message Received: [2020-05-21 13:40:37,180:9656(0x7f08e6fefb80):ZOO_INFO@log_env@1205: Client environment:zookeeper.version=zookeeper C client 3.7.0]
     [exec] Log Message Received: [2020-05-21 13:40:37,180:9656(0x7f08e6fefb80):ZOO_INFO@log_env@1209: Client environment:host.name=asf904.gq1.ygridcore.net]
     [exec] Log Message Received: [2020-05-21 13:40:37,180:9656(0x7f08e6fefb80):ZOO_INFO@log_env@1216: Client environment:os.name=Linux]
     [exec] Log Message Received: [2020-05-21 13:40:37,180:9656(0x7f08e6fefb80):ZOO_INFO@log_env@1217: Client environment:os.arch=4.15.0-101-generic]
     [exec] Log Message Received: [2020-05-21 13:40:37,180:9656(0x7f08e6fefb80):ZOO_INFO@log_env@1218: Client environment:os.version=#102-Ubuntu SMP Mon May 11 10:07:26 UTC 2020]
     [exec] Log Message Received: [2020-05-21 13:40:37,180:9656(0x7f08e6fefb80):ZOO_INFO@log_env@1226: Client environment:user.name=jenkins]
     [exec] Log Message Received: [2020-05-21 13:40:37,180:9656(0x7f08e6fefb80):ZOO_INFO@log_env@1234: Client environment:user.home=/home/jenkins]
     [exec] Log Message Received: [2020-05-21 13:40:37,180:9656(0x7f08e6fefb80):ZOO_INFO@log_env@1246: Client environment:user.dir=<https://builds.apache.org/job/zookeeper-master-maven/ws/zookeeper-client/zookeeper-client-c/target/c]>
     [exec] Log Message Received: [2020-05-21 13:40:37,180:9656(0x7f08e6fefb80):ZOO_INFO@zookeeper_init_internal@1299: Initiating client connection, host=127.0.0.1:22181 sessionTimeout=10000 watcher=0x5590f9a02ca0 sessionId=0 sessionPasswd=<null> context=0x7ffc9e826980 flags=0]
     [exec] Log Message Received: [2020-05-21 13:40:37,180:9656(0x7f08e4830700):ZOO_INFO@check_events@2919: initiated connection to server 127.0.0.1:22181]
     [exec] Log Message Received: [2020-05-21 13:40:37,205:9656(0x7f08e4830700):ZOO_INFO@finalize_session_establishment@2804: session establishment complete on server 127.0.0.1:22181, sessionId=0x100025a557d0004, negotiated timeout=10000 ]
     [exec] Log Message Received: [2020-05-21 13:40:38,180:9656(0x7f08e6fefb80):ZOO_INFO@testLogCallbackInit@1144: testLogCallbackInit #0]
     [exec] Log Message Received: [2020-05-21 13:40:38,180:9656(0x7f08e6fefb80):ZOO_INFO@testLogCallbackInit@1144: testLogCallbackInit #1]
     [exec] Log Message Received: [2020-05-21 13:40:38,180:9656(0x7f08e6fefb80):ZOO_INFO@testLogCallbackInit@1144: testLogCallbackInit #2]
     [exec] Log Message Received: [2020-05-21 13:40:38,180:9656(0x7f08e6fefb80):ZOO_INFO@testLogCallbackInit@1144: testLogCallbackInit #3]
     [exec] Log Message Received: [2020-05-21 13:40:38,180:9656(0x7f08e6fefb80):ZOO_INFO@testLogCallbackInit@1144: testLogCallbackInit #4]
     [exec] Log Message Received: [2020-05-21 13:40:38,180:9656(0x7f08e6fefb80):ZOO_INFO@testLogCallbackInit@1144: testLogCallbackInit #5]
     [exec] Log Message Received: [2020-05-21 13:40:38,180:9656(0x7f08e6fefb80):ZOO_INFO@testLogCallbackInit@1144: testLogCallbackInit #6]
     [exec] Log Message Received: [2020-05-21 13:40:38,180:9656(0x7f08e6fefb80):ZOO_INFO@testLogCallbackInit@1144: testLogCallbackInit #7]
     [exec] Log Message Received: [2020-05-21 13:40:38,180:9656(0x7f08e6fefb80):ZOO_INFO@testLogCallbackInit@1144: testLogCallbackInit #8]
     [exec] Log Message Received: [2020-05-21 13:40:38,180:9656(0x7f08e6fefb80):ZOO_INFO@testLogCallbackInit@1144: testLogCallbackInit #9]
     [exec] Log Message Received: [2020-05-21 13:40:38,181:9656(0x7f08e6fefb80):ZOO_INFO@zookeeper_close@3775: Closing zookeeper sessionId=0x100025a557d0004 to 127.0.0.1:22181
     [exec] ]
     [exec] Log Message Received: [2020-05-21 13:40:38,196:9656(0x7f08e6fefb80):ZOO_INFO@zookeeper_close@3797: Freeing zookeeper resources for sessionId=0x100025a557d0004
     [exec] ]
     [exec]  : elapsed 1016 : OK
     [exec] Zookeeper_simpleSystem::testLogCallbackClearLog Message Received: [2020-05-21 13:40:38,197:9656(0x7f08e6fefb80):ZOO_INFO@log_env@1205: Client environment:zookeeper.version=zookeeper C client 3.7.0]
     [exec] Log Message Received: [2020-05-21 13:40:38,197:9656(0x7f08e6fefb80):ZOO_INFO@log_env@1209: Client environment:host.name=asf904.gq1.ygridcore.net]
     [exec] Log Message Received: [2020-05-21 13:40:38,197:9656(0x7f08e6fefb80):ZOO_INFO@log_env@1216: Client environment:os.name=Linux]
     [exec] Log Message Received: [2020-05-21 13:40:38,197:9656(0x7f08e6fefb80):ZOO_INFO@log_env@1217: Client environment:os.arch=4.15.0-101-generic]
     [exec] Log Message Received: [2020-05-21 13:40:38,197:9656(0x7f08e6fefb80):ZOO_INFO@log_env@1218: Client environment:os.version=#102-Ubuntu SMP Mon May 11 10:07:26 UTC 2020]
     [exec] Log Message Received: [2020-05-21 13:40:38,197:9656(0x7f08e6fefb80):ZOO_INFO@log_env@1226: Client environment:user.name=jenkins]
     [exec] Log Message Received: [2020-05-21 13:40:38,197:9656(0x7f08e6fefb80):ZOO_INFO@log_env@1234: Client environment:user.home=/home/jenkins]
     [exec] Log Message Received: [2020-05-21 13:40:38,197:9656(0x7f08e6fefb80):ZOO_INFO@log_env@1246: Client environment:user.dir=<https://builds.apache.org/job/zookeeper-master-maven/ws/zookeeper-client/zookeeper-client-c/target/c]>
     [exec] Log Message Received: [2020-05-21 13:40:38,197:9656(0x7f08e6fefb80):ZOO_INFO@zookeeper_init_internal@1299: Initiating client connection, host=127.0.0.1:22181 sessionTimeout=10000 watcher=0x5590f9a02ca0 sessionId=0 sessionPasswd=<null> context=0x7ffc9e826980 flags=0]
     [exec] Log Message Received: [2020-05-21 13:40:38,197:9656(0x7f08dffff700):ZOO_INFO@check_events@2919: initiated connection to server 127.0.0.1:22181]
     [exec] Log Message Received: [2020-05-21 13:40:38,222:9656(0x7f08dffff700):ZOO_INFO@finalize_session_establishment@2804: session establishment complete on server 127.0.0.1:22181, sessionId=0x100025a557d0005, negotiated timeout=10000 ]
     [exec]  : elapsed 1017 : OK
     [exec] Zookeeper_simpleSystem::testAsyncWatcherAutoReset ZooKeeper server started : assertion : elapsed 20887
     [exec] Zookeeper_simpleSystem::testDeserializeString : elapsed 0 : OK
     [exec] Zookeeper_simpleSystem::testFirstServerDown : elapsed 1022 : OK
     [exec] Zookeeper_simpleSystem::testNonexistentHost : elapsed 1283 : OK
     [exec] Zookeeper_simpleSystem::testNullData : elapsed 1057 : OK
     [exec] Zookeeper_simpleSystem::testIPV6 : elapsed 1024 : OK
     [exec] Zookeeper_simpleSystem::testCreate : elapsed 1033 : OK
     [exec] Zookeeper_simpleSystem::testCreateContainer : elapsed 1024 : OK
     [exec] Zookeeper_simpleSystem::testCreateTtl : elapsed 2071 : OK
     [exec] Zookeeper_simpleSystem::testPath : elapsed 1266 : OK
     [exec] Zookeeper_simpleSystem::testPathValidation : elapsed 1263 : OK
     [exec] Zookeeper_simpleSystem::testPing : elapsed 17961 : OK
     [exec] Zookeeper_simpleSystem::testAcl : elapsed 1045 : OK
     [exec] Zookeeper_simpleSystem::testChroot : elapsed 4158 : OK
     [exec] Zookeeper_simpleSystem::testAuthFAIL: zktest-mt
     [exec] ==========================================
     [exec] 1 of 2 tests failed
     [exec] Please report to user@zookeeper.apache.org
     [exec] ==========================================
     [exec] Makefile:1850: recipe for target 'check-TESTS' failed
     [exec] make[1]: Leaving directory '<https://builds.apache.org/job/zookeeper-master-maven/ws/zookeeper-client/zookeeper-client-c/target/c'>
     [exec] Makefile:2106: recipe for target 'check-am' failed
     [exec] terminate called after throwing an instance of 'CppUnit::Exception'
     [exec]   what():  equality assertion failed
     [exec] - Expected: 0
     [exec] - Actual  : -4
     [exec] 
     [exec] /bin/bash: line 5:  9656 Aborted                 ZKROOT=<https://builds.apache.org/job/zookeeper-master-maven/ws/zookeeper-client/zookeeper-client-c/../..> CLASSPATH=$CLASSPATH:$CLOVER_HOME/lib/clover*.jar ${dir}$tst
     [exec] make[1]: *** [check-TESTS] Error 1
     [exec] make: *** [check-am] Error 2
[INFO] ------------------------------------------------------------------------
[INFO] Reactor Summary for Apache ZooKeeper 3.7.0-SNAPSHOT:
[INFO] 
[INFO] Apache ZooKeeper ................................... SUCCESS [ 13.368 s]
[INFO] Apache ZooKeeper - Documentation ................... SUCCESS [  5.466 s]
[INFO] Apache ZooKeeper - Jute ............................ SUCCESS [01:31 min]
[INFO] Apache ZooKeeper - Server .......................... SUCCESS [25:04 min]
[INFO] Apache ZooKeeper - Metrics Providers ............... SUCCESS [  4.196 s]
[INFO] Apache ZooKeeper - Prometheus.io Metrics Provider .. SUCCESS [ 13.663 s]
[INFO] Apache ZooKeeper - Client .......................... SUCCESS [  4.079 s]
[INFO] Apache ZooKeeper - Client - C ...................... FAILURE [05:51 min]
[INFO] Apache ZooKeeper - Recipes ......................... SKIPPED
[INFO] Apache ZooKeeper - Recipes - Election .............. SKIPPED
[INFO] Apache ZooKeeper - Recipes - Lock .................. SKIPPED
[INFO] Apache ZooKeeper - Recipes - Queue ................. SKIPPED
[INFO] Apache ZooKeeper - Assembly ........................ SKIPPED
[INFO] Apache ZooKeeper - Tests ........................... SKIPPED
[INFO] Apache ZooKeeper - Contrib ......................... SKIPPED
[INFO] Apache ZooKeeper - Contrib - Fatjar ................ SKIPPED
[INFO] Apache ZooKeeper - Contrib - Loggraph .............. SKIPPED
[INFO] Apache ZooKeeper - Contrib - Rest .................. SKIPPED
[INFO] Apache ZooKeeper - Contrib - ZooInspector .......... SKIPPED
[INFO] ------------------------------------------------------------------------
[INFO] BUILD FAILURE
[INFO] ------------------------------------------------------------------------
[INFO] Total time:  33:55 min
[INFO] Finished at: 2020-05-21T13:42:02Z
[INFO] ------------------------------------------------------------------------
Waiting for Jenkins to finish collecting data
[ERROR] Failed to execute goal org.apache.maven.plugins:maven-antrun-plugin:1.8:run (test-cppunit) on project zookeeper-client-c: An Ant BuildException has occured: exec returned: 2
[ERROR] around Ant part ...<exec failonerror="true" dir="<https://builds.apache.org/job/zookeeper-master-maven/ws/zookeeper-client/zookeeper-client-c/target/c"> executable="make">... @ 4:158 in <https://builds.apache.org/job/zookeeper-master-maven/ws/zookeeper-client/zookeeper-client-c/target/antrun/build-main.xml>
[ERROR] -> [Help 1]
[ERROR] 
[ERROR] To see the full stack trace of the errors, re-run Maven with the -e switch.
[ERROR] Re-run Maven using the -X switch to enable full debug logging.
[ERROR] 
[ERROR] For more information about the errors and possible solutions, please read the following articles:
[ERROR] [Help 1] http://cwiki.apache.org/confluence/display/MAVEN/MojoExecutionException
[ERROR] 
[ERROR] After correcting the problems, you can resume the build with the command
[ERROR]   mvn <goals> -rf :zookeeper-client-c
[JENKINS] Archiving <https://builds.apache.org/job/zookeeper-master-maven/ws/zookeeper-server/pom.xml> to org.apache.zookeeper/zookeeper/3.7.0-SNAPSHOT/zookeeper-3.7.0-SNAPSHOT.pom
[JENKINS] Archiving <https://builds.apache.org/job/zookeeper-master-maven/ws/zookeeper-server/target/zookeeper-3.7.0-SNAPSHOT.jar> to org.apache.zookeeper/zookeeper/3.7.0-SNAPSHOT/zookeeper-3.7.0-SNAPSHOT.jar
[JENKINS] Archiving <https://builds.apache.org/job/zookeeper-master-maven/ws/zookeeper-server/target/zookeeper-3.7.0-SNAPSHOT-tests.jar> to org.apache.zookeeper/zookeeper/3.7.0-SNAPSHOT/zookeeper-3.7.0-SNAPSHOT-tests.jar
[JENKINS] Archiving <https://builds.apache.org/job/zookeeper-master-maven/ws/zookeeper-server/target/zookeeper-3.7.0-SNAPSHOT-sources.jar> to org.apache.zookeeper/zookeeper/3.7.0-SNAPSHOT/zookeeper-3.7.0-SNAPSHOT-sources.jar
[JENKINS] Archiving <https://builds.apache.org/job/zookeeper-master-maven/ws/zookeeper-server/target/zookeeper-3.7.0-SNAPSHOT-javadoc.jar> to org.apache.zookeeper/zookeeper/3.7.0-SNAPSHOT/zookeeper-3.7.0-SNAPSHOT-javadoc.jar
[JENKINS] Archiving <https://builds.apache.org/job/zookeeper-master-maven/ws/zookeeper-contrib/zookeeper-contrib-loggraph/pom.xml> to org.apache.zookeeper/zookeeper-contrib-loggraph/3.7.0-SNAPSHOT/zookeeper-contrib-loggraph-3.7.0-SNAPSHOT.pom
[JENKINS] Archiving <https://builds.apache.org/job/zookeeper-master-maven/ws/zookeeper-metrics-providers/pom.xml> to org.apache.zookeeper/zookeeper-metrics-providers/3.7.0-SNAPSHOT/zookeeper-metrics-providers-3.7.0-SNAPSHOT.pom
[JENKINS] Archiving <https://builds.apache.org/job/zookeeper-master-maven/ws/zookeeper-metrics-providers/zookeeper-prometheus-metrics/pom.xml> to org.apache.zookeeper/zookeeper-prometheus-metrics/3.7.0-SNAPSHOT/zookeeper-prometheus-metrics-3.7.0-SNAPSHOT.pom
[JENKINS] Archiving <https://builds.apache.org/job/zookeeper-master-maven/ws/zookeeper-metrics-providers/zookeeper-prometheus-metrics/target/zookeeper-prometheus-metrics-3.7.0-SNAPSHOT.jar> to org.apache.zookeeper/zookeeper-prometheus-metrics/3.7.0-SNAPSHOT/zookeeper-prometheus-metrics-3.7.0-SNAPSHOT.jar
[JENKINS] Archiving <https://builds.apache.org/job/zookeeper-master-maven/ws/zookeeper-metrics-providers/zookeeper-prometheus-metrics/target/zookeeper-prometheus-metrics-3.7.0-SNAPSHOT-tests.jar> to org.apache.zookeeper/zookeeper-prometheus-metrics/3.7.0-SNAPSHOT/zookeeper-prometheus-metrics-3.7.0-SNAPSHOT-tests.jar
[JENKINS] Archiving <https://builds.apache.org/job/zookeeper-master-maven/ws/zookeeper-metrics-providers/zookeeper-prometheus-metrics/target/zookeeper-prometheus-metrics-3.7.0-SNAPSHOT-sources.jar> to org.apache.zookeeper/zookeeper-prometheus-metrics/3.7.0-SNAPSHOT/zookeeper-prometheus-metrics-3.7.0-SNAPSHOT-sources.jar
[JENKINS] Archiving <https://builds.apache.org/job/zookeeper-master-maven/ws/zookeeper-metrics-providers/zookeeper-prometheus-metrics/target/zookeeper-prometheus-metrics-3.7.0-SNAPSHOT-javadoc.jar> to org.apache.zookeeper/zookeeper-prometheus-metrics/3.7.0-SNAPSHOT/zookeeper-prometheus-metrics-3.7.0-SNAPSHOT-javadoc.jar
[JENKINS] Archiving <https://builds.apache.org/job/zookeeper-master-maven/ws/zookeeper-recipes/zookeeper-recipes-election/pom.xml> to org.apache.zookeeper/zookeeper-recipes-election/3.7.0-SNAPSHOT/zookeeper-recipes-election-3.7.0-SNAPSHOT.pom
[JENKINS] Archiving <https://builds.apache.org/job/zookeeper-master-maven/ws/pom.xml> to org.apache.zookeeper/parent/3.7.0-SNAPSHOT/parent-3.7.0-SNAPSHOT.pom
[Fast Archiver] No artifacts from zookeeper-master-maven » Apache ZooKeeper #813 to compare, so performing full copy of artifacts
[JENKINS] Archiving <https://builds.apache.org/job/zookeeper-master-maven/ws/zookeeper-recipes/zookeeper-recipes-lock/pom.xml> to org.apache.zookeeper/zookeeper-recipes-lock/3.7.0-SNAPSHOT/zookeeper-recipes-lock-3.7.0-SNAPSHOT.pom
[JENKINS] Archiving <https://builds.apache.org/job/zookeeper-master-maven/ws/zookeeper-contrib/pom.xml> to org.apache.zookeeper/zookeeper-contrib/3.7.0-SNAPSHOT/zookeeper-contrib-3.7.0-SNAPSHOT.pom
[JENKINS] Archiving <https://builds.apache.org/job/zookeeper-master-maven/ws/zookeeper-client/pom.xml> to org.apache.zookeeper/zookeeper-client/3.7.0-SNAPSHOT/zookeeper-client-3.7.0-SNAPSHOT.pom
[JENKINS] Archiving <https://builds.apache.org/job/zookeeper-master-maven/ws/zookeeper-jute/pom.xml> to org.apache.zookeeper/zookeeper-jute/3.7.0-SNAPSHOT/zookeeper-jute-3.7.0-SNAPSHOT.pom
[JENKINS] Archiving <https://builds.apache.org/job/zookeeper-master-maven/ws/zookeeper-jute/target/zookeeper-jute-3.7.0-SNAPSHOT.jar> to org.apache.zookeeper/zookeeper-jute/3.7.0-SNAPSHOT/zookeeper-jute-3.7.0-SNAPSHOT.jar
[JENKINS] Archiving <https://builds.apache.org/job/zookeeper-master-maven/ws/zookeeper-jute/target/zookeeper-jute-3.7.0-SNAPSHOT-tests.jar> to org.apache.zookeeper/zookeeper-jute/3.7.0-SNAPSHOT/zookeeper-jute-3.7.0-SNAPSHOT-tests.jar
[JENKINS] Archiving <https://builds.apache.org/job/zookeeper-master-maven/ws/zookeeper-jute/target/zookeeper-jute-3.7.0-SNAPSHOT-sources.jar> to org.apache.zookeeper/zookeeper-jute/3.7.0-SNAPSHOT/zookeeper-jute-3.7.0-SNAPSHOT-sources.jar
[JENKINS] Archiving <https://builds.apache.org/job/zookeeper-master-maven/ws/zookeeper-jute/target/zookeeper-jute-3.7.0-SNAPSHOT-javadoc.jar> to org.apache.zookeeper/zookeeper-jute/3.7.0-SNAPSHOT/zookeeper-jute-3.7.0-SNAPSHOT-javadoc.jar
[Fast Archiver] No artifacts from zookeeper-master-maven » Apache ZooKeeper - Jute #813 to compare, so performing full copy of artifacts
[JENKINS] Archiving <https://builds.apache.org/job/zookeeper-master-maven/ws/zookeeper-recipes/zookeeper-recipes-queue/pom.xml> to org.apache.zookeeper/zookeeper-recipes-queue/3.7.0-SNAPSHOT/zookeeper-recipes-queue-3.7.0-SNAPSHOT.pom
[JENKINS] Archiving <https://builds.apache.org/job/zookeeper-master-maven/ws/zookeeper-docs/pom.xml> to org.apache.zookeeper/zookeeper-docs/3.7.0-SNAPSHOT/zookeeper-docs-3.7.0-SNAPSHOT.pom
[Fast Archiver] No artifacts from zookeeper-master-maven » Apache ZooKeeper - Documentation #813 to compare, so performing full copy of artifacts
[JENKINS] Archiving <https://builds.apache.org/job/zookeeper-master-maven/ws/zookeeper-recipes/pom.xml> to org.apache.zookeeper/zookeeper-recipes/3.7.0-SNAPSHOT/zookeeper-recipes-3.7.0-SNAPSHOT.pom
[JENKINS] Archiving <https://builds.apache.org/job/zookeeper-master-maven/ws/zookeeper-it/pom.xml> to org.apache.zookeeper/zookeeper-it/3.7.0-SNAPSHOT/zookeeper-it-3.7.0-SNAPSHOT.pom
[JENKINS] Archiving <https://builds.apache.org/job/zookeeper-master-maven/ws/zookeeper-client/zookeeper-client-c/pom.xml> to org.apache.zookeeper/zookeeper-client-c/3.7.0-SNAPSHOT/zookeeper-client-c-3.7.0-SNAPSHOT.pom
[JENKINS] Archiving <https://builds.apache.org/job/zookeeper-master-maven/ws/zookeeper-contrib/zookeeper-contrib-rest/pom.xml> to org.apache.zookeeper/zookeeper-contrib-rest/3.7.0-SNAPSHOT/zookeeper-contrib-rest-3.7.0-SNAPSHOT.pom
[JENKINS] Archiving <https://builds.apache.org/job/zookeeper-master-maven/ws/zookeeper-contrib/zookeeper-contrib-fatjar/pom.xml> to org.apache.zookeeper/zookeeper-contrib-fatjar/3.7.0-SNAPSHOT/zookeeper-contrib-fatjar-3.7.0-SNAPSHOT.pom
[JENKINS] Archiving <https://builds.apache.org/job/zookeeper-master-maven/ws/zookeeper-assembly/pom.xml> to org.apache.zookeeper/zookeeper-assembly/3.7.0-SNAPSHOT/zookeeper-assembly-3.7.0-SNAPSHOT.pom
[JENKINS] Archiving <https://builds.apache.org/job/zookeeper-master-maven/ws/zookeeper-contrib/zookeeper-contrib-zooinspector/pom.xml> to org.apache.zookeeper/zookeeper-contrib-zooinspector/3.7.0-SNAPSHOT/zookeeper-contrib-zooinspector-3.7.0-SNAPSHOT.pom
channel stopped
[SpotBugs] Skipping execution of recorder since overall result is 'FAILURE'