You are viewing a plain text version of this content. The canonical link for it is here.
Posted to builds@beam.apache.org by Apache Jenkins Server <je...@builds.apache.org> on 2023/01/31 10:36:11 UTC

Build failed in Jenkins: beam_PreCommit_Python_Runners_Cron #107

See <https://ci-beam.apache.org/job/beam_PreCommit_Python_Runners_Cron/107/display/redirect?page=changes>

Changes:

[noreply] Standardizing naming and URN for Pubsub Read Schema Transform (#25170)


------------------------------------------
[...truncated 1.33 MB...]
    File "<https://ci-beam.apache.org/job/beam_PreCommit_Python_Runners_Cron/ws/src/sdks/python/test-suites/tox/py310/build/srcs/sdks/python/apache_beam/transforms/core.py",> line -1, in <lambda>
    File "<https://ci-beam.apache.org/job/beam_PreCommit_Python_Runners_Cron/ws/src/sdks/python/test-suites/tox/py310/build/srcs/sdks/python/apache_beam/runners/portability/fn_api_runner/fn_runner_test.py",> line -1, in first
    File "<https://ci-beam.apache.org/job/beam_PreCommit_Python_Runners_Cron/ws/src/sdks/python/test-suites/tox/py310/build/srcs/sdks/python/apache_beam/runners/portability/fn_api_runner/fn_runner_test.py",> line 1160, in second
      self.assertIn('StageC', message)
    File "<https://ci-beam.apache.org/job/beam_PreCommit_Python_Runners_Cron/ws/src/sdks/python/test-suites/tox/py310/build/srcs/sdks/python/apache_beam/runners/portability/fn_api_runner/fn_runner_test.py",> line -1, in third
  ValueError: This error is expected and does not indicate a test failure. [while running 'Map(first)']
  
    warnings.warn(pytest.PytestUnhandledThreadExceptionWarning(msg))

apache_beam/runners/portability/fn_api_runner/fn_runner_test.py::FnApiRunnerTestWithGrpcAndMultiWorkers::test_flatten
  <https://ci-beam.apache.org/job/beam_PreCommit_Python_Runners_Cron/ws/src/sdks/python/test-suites/tox/py310/build/srcs/sdks/python/target/.tox-py310-cython/py310-cython/lib/python3.10/site-packages/_pytest/threadexception.py>:73: PytestUnhandledThreadExceptionWarning: Exception in thread read_grpc_client_inputs
  
  Traceback (most recent call last):
    File "/usr/lib/python3.10/threading.py", line 1009, in _bootstrap_inner
      self.run()
    File "/usr/lib/python3.10/threading.py", line 946, in run
      self._target(*self._args, **self._kwargs)
    File "<https://ci-beam.apache.org/job/beam_PreCommit_Python_Runners_Cron/ws/src/sdks/python/test-suites/tox/py310/build/srcs/sdks/python/apache_beam/runners/worker/data_plane.py",> line 671, in <lambda>
      target=lambda: self._read_inputs(elements_iterator),
    File "<https://ci-beam.apache.org/job/beam_PreCommit_Python_Runners_Cron/ws/src/sdks/python/test-suites/tox/py310/build/srcs/sdks/python/apache_beam/runners/worker/data_plane.py",> line 654, in _read_inputs
      for elements in elements_iterator:
    File "<https://ci-beam.apache.org/job/beam_PreCommit_Python_Runners_Cron/ws/src/sdks/python/test-suites/tox/py310/build/srcs/sdks/python/target/.tox-py310-cython/py310-cython/lib/python3.10/site-packages/grpc/_channel.py",> line 426, in __next__
      return self._next()
    File "<https://ci-beam.apache.org/job/beam_PreCommit_Python_Runners_Cron/ws/src/sdks/python/test-suites/tox/py310/build/srcs/sdks/python/target/.tox-py310-cython/py310-cython/lib/python3.10/site-packages/grpc/_channel.py",> line 826, in _next
      raise self
  grpc._channel._MultiThreadedRendezvous: <_MultiThreadedRendezvous of RPC that terminated with:
  	status = StatusCode.UNAVAILABLE
  	details = "failed to connect to all addresses; last error: UNKNOWN: ipv4:127.0.0.1:37397: Failed to connect to remote host: Connection refused"
  	debug_error_string = "UNKNOWN:failed to connect to all addresses; last error: UNKNOWN: ipv4:127.0.0.1:37397: Failed to connect to remote host: Connection refused {created_time:"2023-01-31T10:35:06.942364066+00:00", grpc_status:14}"
  >
  
    warnings.warn(pytest.PytestUnhandledThreadExceptionWarning(msg))

apache_beam/runners/worker/worker_status_test.py::FnApiWorkerStatusHandlerTest::test_generate_error
apache_beam/runners/portability/portable_runner_test.py::PortableRunnerTest::test_sdf_with_watermark_tracking
apache_beam/runners/worker/worker_status_test.py::FnApiWorkerStatusHandlerTest::test_send_status_response
  <https://ci-beam.apache.org/job/beam_PreCommit_Python_Runners_Cron/ws/src/sdks/python/test-suites/tox/py310/build/srcs/sdks/python/apache_beam/runners/worker/worker_status_test.py>:48: DeprecationWarning: notifyAll() is deprecated, use notify_all() instead
    self.finished.notifyAll()

apache_beam/runners/portability/portable_runner_test.py::PortableRunnerTestWithLocalDocker::test_metrics
  <https://ci-beam.apache.org/job/beam_PreCommit_Python_Runners_Cron/ws/src/sdks/python/test-suites/tox/py310/build/srcs/sdks/python/target/.tox-py310-cython/py310-cython/lib/python3.10/site-packages/_pytest/threadexception.py>:73: PytestUnhandledThreadExceptionWarning: Exception in thread fn_api_status_handler
  
  Traceback (most recent call last):
    File "/usr/lib/python3.10/threading.py", line 1009, in _bootstrap_inner
      self.run()
    File "/usr/lib/python3.10/threading.py", line 946, in run
      self._target(*self._args, **self._kwargs)
    File "<https://ci-beam.apache.org/job/beam_PreCommit_Python_Runners_Cron/ws/src/sdks/python/test-suites/tox/py310/build/srcs/sdks/python/apache_beam/runners/worker/worker_status.py",> line 177, in <lambda>
      target=lambda: self._serve(), name='fn_api_status_handler')
    File "<https://ci-beam.apache.org/job/beam_PreCommit_Python_Runners_Cron/ws/src/sdks/python/test-suites/tox/py310/build/srcs/sdks/python/apache_beam/runners/worker/worker_status.py",> line 198, in _serve
      for request in self._status_stub.WorkerStatus(self._get_responses()):
    File "<https://ci-beam.apache.org/job/beam_PreCommit_Python_Runners_Cron/ws/src/sdks/python/test-suites/tox/py310/build/srcs/sdks/python/target/.tox-py310-cython/py310-cython/lib/python3.10/site-packages/grpc/_channel.py",> line 426, in __next__
      return self._next()
    File "<https://ci-beam.apache.org/job/beam_PreCommit_Python_Runners_Cron/ws/src/sdks/python/test-suites/tox/py310/build/srcs/sdks/python/target/.tox-py310-cython/py310-cython/lib/python3.10/site-packages/grpc/_channel.py",> line 826, in _next
      raise self
  grpc._channel._MultiThreadedRendezvous: <_MultiThreadedRendezvous of RPC that terminated with:
  	status = StatusCode.UNAVAILABLE
  	details = "Cancelling all calls"
  	debug_error_string = "UNKNOWN:Error received from peer ipv6:%5B::1%5D:41529 {created_time:"2023-01-31T10:35:50.783299186+00:00", grpc_status:14, grpc_message:"Cancelling all calls"}"
  >
  
    warnings.warn(pytest.PytestUnhandledThreadExceptionWarning(msg))

apache_beam/runners/portability/portable_runner_test.py::PortableRunnerTestWithLocalDocker::test_sdf_with_check_done_failed
  <https://ci-beam.apache.org/job/beam_PreCommit_Python_Runners_Cron/ws/src/sdks/python/test-suites/tox/py310/build/srcs/sdks/python/target/.tox-py310-cython/py310-cython/lib/python3.10/site-packages/_pytest/threadexception.py>:73: PytestUnhandledThreadExceptionWarning: Exception in thread Thread-2363 (_run_job)
  
  Traceback (most recent call last):
    File "/usr/lib/python3.10/threading.py", line 1009, in _bootstrap_inner
      self.run()
    File "/usr/lib/python3.10/threading.py", line 946, in run
      self._target(*self._args, **self._kwargs)
    File "<https://ci-beam.apache.org/job/beam_PreCommit_Python_Runners_Cron/ws/src/sdks/python/test-suites/tox/py310/build/srcs/sdks/python/apache_beam/runners/portability/local_job_service.py",> line 296, in _run_job
      self.result = self._invoke_runner()
    File "<https://ci-beam.apache.org/job/beam_PreCommit_Python_Runners_Cron/ws/src/sdks/python/test-suites/tox/py310/build/srcs/sdks/python/apache_beam/runners/portability/local_job_service.py",> line 319, in _invoke_runner
      provision_info=self._provision_info).run_via_runner_api(
    File "<https://ci-beam.apache.org/job/beam_PreCommit_Python_Runners_Cron/ws/src/sdks/python/test-suites/tox/py310/build/srcs/sdks/python/apache_beam/runners/portability/fn_api_runner/fn_runner.py",> line 222, in run_via_runner_api
      return self.run_stages(stage_context, stages)
    File "<https://ci-beam.apache.org/job/beam_PreCommit_Python_Runners_Cron/ws/src/sdks/python/test-suites/tox/py310/build/srcs/sdks/python/apache_beam/runners/portability/fn_api_runner/fn_runner.py",> line 453, in run_stages
      bundle_results = self._execute_bundle(
    File "<https://ci-beam.apache.org/job/beam_PreCommit_Python_Runners_Cron/ws/src/sdks/python/test-suites/tox/py310/build/srcs/sdks/python/apache_beam/runners/portability/fn_api_runner/fn_runner.py",> line 781, in _execute_bundle
      self._run_bundle(
    File "<https://ci-beam.apache.org/job/beam_PreCommit_Python_Runners_Cron/ws/src/sdks/python/test-suites/tox/py310/build/srcs/sdks/python/apache_beam/runners/portability/fn_api_runner/fn_runner.py",> line 1010, in _run_bundle
      result, splits = bundle_manager.process_bundle(
    File "<https://ci-beam.apache.org/job/beam_PreCommit_Python_Runners_Cron/ws/src/sdks/python/test-suites/tox/py310/build/srcs/sdks/python/apache_beam/runners/portability/fn_api_runner/fn_runner.py",> line 1346, in process_bundle
      result_future = self._worker_handler.control_conn.push(process_bundle_req)
    File "<https://ci-beam.apache.org/job/beam_PreCommit_Python_Runners_Cron/ws/src/sdks/python/test-suites/tox/py310/build/srcs/sdks/python/apache_beam/runners/portability/fn_api_runner/worker_handlers.py",> line 379, in push
      response = self.worker.do_instruction(request)
    File "<https://ci-beam.apache.org/job/beam_PreCommit_Python_Runners_Cron/ws/src/sdks/python/test-suites/tox/py310/build/srcs/sdks/python/apache_beam/runners/worker/sdk_worker.py",> line 596, in do_instruction
      return getattr(self, request_type)(
    File "<https://ci-beam.apache.org/job/beam_PreCommit_Python_Runners_Cron/ws/src/sdks/python/test-suites/tox/py310/build/srcs/sdks/python/apache_beam/runners/worker/sdk_worker.py",> line 634, in process_bundle
      bundle_processor.process_bundle(instruction_id))
    File "<https://ci-beam.apache.org/job/beam_PreCommit_Python_Runners_Cron/ws/src/sdks/python/test-suites/tox/py310/build/srcs/sdks/python/apache_beam/runners/worker/bundle_processor.py",> line 1003, in process_bundle
      input_op_by_transform_id[element.transform_id].process_encoded(
    File "<https://ci-beam.apache.org/job/beam_PreCommit_Python_Runners_Cron/ws/src/sdks/python/test-suites/tox/py310/build/srcs/sdks/python/apache_beam/runners/worker/bundle_processor.py",> line 227, in process_encoded
      self.output(decoded_value)
    File "apache_beam/runners/worker/operations.py", line 526, in apache_beam.runners.worker.operations.Operation.output
      def output(self, windowed_value, output_index=0):
    File "apache_beam/runners/worker/operations.py", line 528, in apache_beam.runners.worker.operations.Operation.output
      _cast_to_receiver(self.receivers[output_index]).receive(windowed_value)
    File "apache_beam/runners/worker/operations.py", line 237, in apache_beam.runners.worker.operations.SingletonElementConsumerSet.receive
      def receive(self, windowed_value):
    File "apache_beam/runners/worker/operations.py", line 240, in apache_beam.runners.worker.operations.SingletonElementConsumerSet.receive
      self.consumer.process(windowed_value)
    File "apache_beam/runners/worker/operations.py", line 1021, in apache_beam.runners.worker.operations.SdfProcessSizedElements.process
      with self.scoped_process_state:
    File "apache_beam/runners/worker/operations.py", line 1030, in apache_beam.runners.worker.operations.SdfProcessSizedElements.process
      delayed_applications = self.dofn_runner.process_with_sized_restriction(
    File "apache_beam/runners/common.py", line 1432, in apache_beam.runners.common.DoFnRunner.process_with_sized_restriction
      return self.do_fn_invoker.invoke_process(
    File "apache_beam/runners/common.py", line 817, in apache_beam.runners.common.PerWindowInvoker.invoke_process
      residual = self._invoke_process_per_window(
    File "apache_beam/runners/common.py", line 988, in apache_beam.runners.common.PerWindowInvoker._invoke_process_per_window
      self.threadsafe_restriction_tracker.check_done()
    File "<https://ci-beam.apache.org/job/beam_PreCommit_Python_Runners_Cron/ws/src/sdks/python/test-suites/tox/py310/build/srcs/sdks/python/apache_beam/runners/sdf_utils.py",> line 111, in check_done
      return self._restriction_tracker.check_done()
    File "<https://ci-beam.apache.org/job/beam_PreCommit_Python_Runners_Cron/ws/src/sdks/python/test-suites/tox/py310/build/srcs/sdks/python/apache_beam/io/restriction_trackers.py",> line 93, in check_done
      raise ValueError(
  ValueError: OffsetRestrictionTracker is not done since work in range [0, 6) has not been claimed.
  
    warnings.warn(pytest.PytestUnhandledThreadExceptionWarning(msg))

-- Docs: https://docs.pytest.org/en/stable/how-to/capture-warnings.html
- generated xml file: <https://ci-beam.apache.org/job/beam_PreCommit_Python_Runners_Cron/ws/src/sdks/python/test-suites/tox/py310/build/srcs/sdks/python/pytest_py310-cython.xml> -
=========================== short test summary info ============================
FAILED apache_beam/runners/portability/portable_runner_test.py::PortableRunnerTest::test_sdf_with_dofn_as_watermark_estimator
===== 1 failed, 1164 passed, 768 skipped, 44 warnings in 268.34s (0:04:28) =====

> Task :sdks:python:test-suites:tox:py37:testPy37Cython
..s..........s... [ 89%]
......s....s.......s...s.....s........ss................ss.s.s...ss..... [ 93%]
.................s...................................................... [ 96%]
........................................................Exception in thread fn_api_status_handler:
Traceback (most recent call last):
  File "/usr/lib/python3.7/threading.py", line 926, in _bootstrap_inner
    self.run()
  File "/usr/lib/python3.7/threading.py", line 870, in run
    self._target(*self._args, **self._kwargs)
  File "<https://ci-beam.apache.org/job/beam_PreCommit_Python_Runners_Cron/ws/src/sdks/python/test-suites/tox/py37/build/srcs/sdks/python/apache_beam/runners/worker/worker_status.py",> line 177, in <lambda>
    target=lambda: self._serve(), name='fn_api_status_handler')
  File "<https://ci-beam.apache.org/job/beam_PreCommit_Python_Runners_Cron/ws/src/sdks/python/test-suites/tox/py37/build/srcs/sdks/python/apache_beam/runners/worker/worker_status.py",> line 198, in _serve
    for request in self._status_stub.WorkerStatus(self._get_responses()):
  File "<https://ci-beam.apache.org/job/beam_PreCommit_Python_Runners_Cron/ws/src/sdks/python/test-suites/tox/py37/build/srcs/sdks/python/target/.tox-py37-cython/py37-cython/lib/python3.7/site-packages/grpc/_channel.py",> line 426, in __next__
    return self._next()
  File "<https://ci-beam.apache.org/job/beam_PreCommit_Python_Runners_Cron/ws/src/sdks/python/test-suites/tox/py37/build/srcs/sdks/python/target/.tox-py37-cython/py37-cython/lib/python3.7/site-packages/grpc/_channel.py",> line 826, in _next
    raise self
grpc._channel._MultiThreadedRendezvous: <_MultiThreadedRendezvous of RPC that terminated with:
	status = StatusCode.UNAVAILABLE
	details = "Cancelling all calls"
	debug_error_string = "UNKNOWN:Error received from peer ipv6:%5B::1%5D:37725 {grpc_message:"Cancelling all calls", grpc_status:14, created_time:"2023-01-31T10:36:00.319799726+00:00"}"
>

.
> Task :sdks:python:test-suites:tox:py310:testPy310Cython FAILED
============================= test session starts ==============================
platform linux -- Python 3.10.2, pytest-7.2.1, pluggy-1.0.0
cachedir: target/.tox-py310-cython/py310-cython/.pytest_cache
rootdir: <https://ci-beam.apache.org/job/beam_PreCommit_Python_Runners_Cron/ws/src/sdks/python/test-suites/tox/py310/build/srcs/sdks/python,> configfile: pytest.ini
plugins: hypothesis-6.65.2, xdist-2.5.0, timeout-2.1.0, forked-1.4.0, requests-mock-1.10.0
timeout: 600.0s
timeout method: signal
timeout func_only: False
collected 1935 items / 1932 deselected / 1 skipped / 3 selected

apache_beam/runners/dataflow/dataflow_exercise_streaming_metrics_pipeline_test.py s [ 33%]
                                                                         [ 33%]
apache_beam/runners/portability/stager_test.py ..                        [100%]

=============================== warnings summary ===============================
target/.tox-py310-cython/py310-cython/lib/python3.10/site-packages/hdfs/config.py:15
  <https://ci-beam.apache.org/job/beam_PreCommit_Python_Runners_Cron/ws/src/sdks/python/test-suites/tox/py310/build/srcs/sdks/python/target/.tox-py310-cython/py310-cython/lib/python3.10/site-packages/hdfs/config.py>:15: DeprecationWarning: the imp module is deprecated in favour of importlib and slated for removal in Python 3.12; see the module's documentation for alternative uses
    from imp import load_source

target/.tox-py310-cython/py310-cython/lib/python3.10/site-packages/tenacity/_asyncio.py:42
  <https://ci-beam.apache.org/job/beam_PreCommit_Python_Runners_Cron/ws/src/sdks/python/test-suites/tox/py310/build/srcs/sdks/python/target/.tox-py310-cython/py310-cython/lib/python3.10/site-packages/tenacity/_asyncio.py>:42: DeprecationWarning: "@coroutine" decorator is deprecated since Python 3.8, use "async def" instead
    def call(self, fn, *args, **kwargs):

-- Docs: https://docs.pytest.org/en/stable/how-to/capture-warnings.html
- generated xml file: <https://ci-beam.apache.org/job/beam_PreCommit_Python_Runners_Cron/ws/src/sdks/python/test-suites/tox/py310/build/srcs/sdks/python/pytest_py310-cython_no_xdist.xml> -
========== 2 passed, 2 skipped, 1932 deselected, 2 warnings in 1.31s ===========
ERROR: InvocationError for command <https://ci-beam.apache.org/job/beam_PreCommit_Python_Runners_Cron/ws/src/sdks/python/test-suites/tox/py310/build/srcs/sdks/python/scripts/run_pytest.sh> py310-cython apache_beam/runners (exited with code 1)
py310-cython run-test-post: commands[0] | bash <https://ci-beam.apache.org/job/beam_PreCommit_Python_Runners_Cron/ws/src/sdks/python/test-suites/tox/py310/build/srcs/sdks/python/scripts/run_tox_cleanup.sh>
___________________________________ summary ____________________________________
ERROR:   py310-cython: commands failed

> Task :sdks:python:test-suites:tox:py37:testPy37Cython
..              [100%]
=============================== warnings summary ===============================
target/.tox-py37-cython/py37-cython/lib/python3.7/site-packages/hdfs/config.py:15
target/.tox-py37-cython/py37-cython/lib/python3.7/site-packages/hdfs/config.py:15
target/.tox-py37-cython/py37-cython/lib/python3.7/site-packages/hdfs/config.py:15
target/.tox-py37-cython/py37-cython/lib/python3.7/site-packages/hdfs/config.py:15
target/.tox-py37-cython/py37-cython/lib/python3.7/site-packages/hdfs/config.py:15
target/.tox-py37-cython/py37-cython/lib/python3.7/site-packages/hdfs/config.py:15
target/.tox-py37-cython/py37-cython/lib/python3.7/site-packages/hdfs/config.py:15
  <https://ci-beam.apache.org/job/beam_PreCommit_Python_Runners_Cron/ws/src/sdks/python/test-suites/tox/py37/build/srcs/sdks/python/target/.tox-py37-cython/py37-cython/lib/python3.7/site-packages/hdfs/config.py>:15: DeprecationWarning: the imp module is deprecated in favour of importlib; see the module's documentation for alternative uses
    from imp import load_source

-- Docs: https://docs.pytest.org/en/stable/how-to/capture-warnings.html
- generated xml file: <https://ci-beam.apache.org/job/beam_PreCommit_Python_Runners_Cron/ws/src/sdks/python/test-suites/tox/py37/build/srcs/sdks/python/pytest_py37-cython.xml> -
========== 1165 passed, 768 skipped, 7 warnings in 273.00s (0:04:32) ===========
============================= test session starts ==============================
platform linux -- Python 3.7.12, pytest-7.2.1, pluggy-1.0.0
cachedir: target/.tox-py37-cython/py37-cython/.pytest_cache
rootdir: <https://ci-beam.apache.org/job/beam_PreCommit_Python_Runners_Cron/ws/src/sdks/python/test-suites/tox/py37/build/srcs/sdks/python,> configfile: pytest.ini
plugins: hypothesis-6.65.2, xdist-2.5.0, timeout-2.1.0, forked-1.4.0, requests-mock-1.10.0
timeout: 600.0s
timeout method: signal
timeout func_only: False
collected 1935 items / 1932 deselected / 1 skipped / 3 selected

apache_beam/runners/dataflow/dataflow_exercise_streaming_metrics_pipeline_test.py s [ 33%]
                                                                         [ 33%]
apache_beam/runners/portability/stager_test.py ..                        [100%]

=============================== warnings summary ===============================
target/.tox-py37-cython/py37-cython/lib/python3.7/site-packages/hdfs/config.py:15
  <https://ci-beam.apache.org/job/beam_PreCommit_Python_Runners_Cron/ws/src/sdks/python/test-suites/tox/py37/build/srcs/sdks/python/target/.tox-py37-cython/py37-cython/lib/python3.7/site-packages/hdfs/config.py>:15: DeprecationWarning: the imp module is deprecated in favour of importlib; see the module's documentation for alternative uses
    from imp import load_source

-- Docs: https://docs.pytest.org/en/stable/how-to/capture-warnings.html
- generated xml file: <https://ci-beam.apache.org/job/beam_PreCommit_Python_Runners_Cron/ws/src/sdks/python/test-suites/tox/py37/build/srcs/sdks/python/pytest_py37-cython_no_xdist.xml> -
=========== 2 passed, 2 skipped, 1932 deselected, 1 warning in 1.56s ===========
py37-cython run-test-post: commands[0] | bash <https://ci-beam.apache.org/job/beam_PreCommit_Python_Runners_Cron/ws/src/sdks/python/test-suites/tox/py37/build/srcs/sdks/python/scripts/run_tox_cleanup.sh>
___________________________________ summary ____________________________________
  py37-cython: commands succeeded
  congratulations :)

> Task :sdks:python:test-suites:tox:py37:preCommitPy37

FAILURE: Build failed with an exception.

* What went wrong:
Execution failed for task ':sdks:python:test-suites:tox:py310:testPy310Cython'.
> Process 'command 'sh'' finished with non-zero exit value 1

* Try:
> Run with --stacktrace option to get the stack trace.
> Run with --info or --debug option to get more log output.

* Get more help at https://help.gradle.org

BUILD FAILED in 20m 35s
23 actionable tasks: 17 executed, 4 from cache, 2 up-to-date

Publishing build scan...
https://gradle.com/s/riaehs4pbiclq

Build step 'Invoke Gradle script' changed build result to FAILURE
Build step 'Invoke Gradle script' marked build as failure

---------------------------------------------------------------------
To unsubscribe, e-mail: builds-unsubscribe@beam.apache.org
For additional commands, e-mail: builds-help@beam.apache.org


Jenkins build is back to normal : beam_PreCommit_Python_Runners_Cron #108

Posted by Apache Jenkins Server <je...@builds.apache.org>.
See <https://ci-beam.apache.org/job/beam_PreCommit_Python_Runners_Cron/108/display/redirect>


---------------------------------------------------------------------
To unsubscribe, e-mail: builds-unsubscribe@beam.apache.org
For additional commands, e-mail: builds-help@beam.apache.org