You are viewing a plain text version of this content. The canonical link for it is here.
Posted to commits@sling.apache.org by Apache Jenkins Server <je...@builds.apache.org> on 2018/08/15 09:21:12 UTC
Build failed in Jenkins:
sling-org-apache-sling-feature-resolver-1.8 #53
See <https://builds.apache.org/job/sling-org-apache-sling-feature-resolver-1.8/53/display/redirect>
------------------------------------------
Started by upstream project "sling-org-apache-sling-feature-analyser-1.8" build number 50
originally caused by:
Started by an SCM change
[EnvInject] - Loading node environment variables.
Building remotely on H20 (ubuntu xenial) in workspace <https://builds.apache.org/job/sling-org-apache-sling-feature-resolver-1.8/ws/>
Cloning the remote Git repository
Cloning repository https://github.com/apache/sling-org-apache-sling-feature-resolver.git
> git init <https://builds.apache.org/job/sling-org-apache-sling-feature-resolver-1.8/ws/> # timeout=10
Fetching upstream changes from https://github.com/apache/sling-org-apache-sling-feature-resolver.git
> git --version # timeout=10
> git fetch --tags --progress https://github.com/apache/sling-org-apache-sling-feature-resolver.git +refs/heads/*:refs/remotes/origin/*
> git config remote.origin.url https://github.com/apache/sling-org-apache-sling-feature-resolver.git # timeout=10
> git config --add remote.origin.fetch +refs/heads/*:refs/remotes/origin/* # timeout=10
> git config remote.origin.url https://github.com/apache/sling-org-apache-sling-feature-resolver.git # timeout=10
Fetching upstream changes from https://github.com/apache/sling-org-apache-sling-feature-resolver.git
> git fetch --tags --progress https://github.com/apache/sling-org-apache-sling-feature-resolver.git +refs/heads/*:refs/remotes/origin/*
> git rev-parse origin/master^{commit} # timeout=10
Checking out Revision f52d6465fa38070398787727e1a5ea9de69d8b8d (origin/master)
> git config core.sparsecheckout # timeout=10
> git checkout -f f52d6465fa38070398787727e1a5ea9de69d8b8d
Commit message: "Update to Configurator 1.0.4"
> git rev-list --no-walk f52d6465fa38070398787727e1a5ea9de69d8b8d # timeout=10
Parsing POMs
Established TCP socket on 34037
maven33-agent.jar already up to date
maven33-interceptor.jar already up to date
maven3-interceptor-commons.jar already up to date
[sling-org-apache-sling-feature-resolver-1.8] $ /home/jenkins/tools/java/latest1.8/bin/java -Xmx4g -Xms4g -cp /home/jenkins/jenkins-slave/maven33-agent.jar:/home/jenkins/tools/maven/apache-maven-3.3.9/boot/plexus-classworlds-2.5.2.jar:/home/jenkins/tools/maven/apache-maven-3.3.9/conf/logging jenkins.maven3.agent.Maven33Main /home/jenkins/tools/maven/apache-maven-3.3.9 /home/jenkins/jenkins-slave/slave.jar /home/jenkins/jenkins-slave/maven33-interceptor.jar /home/jenkins/jenkins-slave/maven3-interceptor-commons.jar 34037
<===[JENKINS REMOTING CAPACITY]===> channel started
Executing Maven: -B -f <https://builds.apache.org/job/sling-org-apache-sling-feature-resolver-1.8/ws/pom.xml> -Dmaven.repo.local=/home/jenkins/jenkins-slave/maven-repositories/1 -U clean deploy
[INFO] Scanning for projects...
[INFO]
[INFO] ------------------------------------------------------------------------
[INFO] Building Apache Sling Feature Resolver 0.1.0-SNAPSHOT
[INFO] ------------------------------------------------------------------------
[INFO] Downloading: http://repository.apache.org/snapshots/org/apache/sling/org.apache.sling.feature/0.1.3-SNAPSHOT/maven-metadata.xml
[INFO] Downloaded: http://repository.apache.org/snapshots/org/apache/sling/org.apache.sling.feature/0.1.3-SNAPSHOT/maven-metadata.xml (1008 B at 2.3 KB/sec)
[INFO] Downloading: http://repository.apache.org/snapshots/org/apache/sling/org.apache.sling.feature/0.1.3-SNAPSHOT/org.apache.sling.feature-0.1.3-20180815.084357-23.pom
[INFO] Downloaded: http://repository.apache.org/snapshots/org/apache/sling/org.apache.sling.feature/0.1.3-SNAPSHOT/org.apache.sling.feature-0.1.3-20180815.084357-23.pom (5 KB at 14.2 KB/sec)
[INFO] Downloading: http://repository.apache.org/snapshots/org/apache/sling/org.apache.sling.feature.analyser/0.1.3-SNAPSHOT/maven-metadata.xml
[INFO] Downloaded: http://repository.apache.org/snapshots/org/apache/sling/org.apache.sling.feature.analyser/0.1.3-SNAPSHOT/maven-metadata.xml (1017 B at 3.4 KB/sec)
[INFO] Downloading: http://repository.apache.org/snapshots/org/apache/sling/org.apache.sling.feature.analyser/0.1.3-SNAPSHOT/org.apache.sling.feature.analyser-0.1.3-20180815.092004-40.pom
[INFO] Downloaded: http://repository.apache.org/snapshots/org/apache/sling/org.apache.sling.feature.analyser/0.1.3-SNAPSHOT/org.apache.sling.feature.analyser-0.1.3-20180815.092004-40.pom (7 KB at 23.5 KB/sec)
[INFO] Downloading: http://repository.apache.org/snapshots/org/apache/sling/org.apache.sling.feature.io/0.1.3-SNAPSHOT/maven-metadata.xml
[INFO] Downloaded: http://repository.apache.org/snapshots/org/apache/sling/org.apache.sling.feature.io/0.1.3-SNAPSHOT/maven-metadata.xml (1011 B at 3.5 KB/sec)
[INFO] Downloading: http://repository.apache.org/snapshots/org/apache/sling/org.apache.sling.feature.io/0.1.3-SNAPSHOT/org.apache.sling.feature.io-0.1.3-20180815.084642-31.pom
[INFO] Downloaded: http://repository.apache.org/snapshots/org/apache/sling/org.apache.sling.feature.io/0.1.3-SNAPSHOT/org.apache.sling.feature.io-0.1.3-20180815.084642-31.pom (6 KB at 17.4 KB/sec)
[INFO] Downloading: https://repo.maven.apache.org/maven2/org/mockito/mockito-core/2.8.9/mockito-core-2.8.9.pom
[INFO] Downloaded: https://repo.maven.apache.org/maven2/org/mockito/mockito-core/2.8.9/mockito-core-2.8.9.pom (3 KB at 10.6 KB/sec)
[INFO] Downloading: https://repo.maven.apache.org/maven2/net/bytebuddy/byte-buddy/1.6.14/byte-buddy-1.6.14.pom
[INFO] Downloaded: https://repo.maven.apache.org/maven2/net/bytebuddy/byte-buddy/1.6.14/byte-buddy-1.6.14.pom (12 KB at 500.4 KB/sec)
[INFO] Downloading: https://repo.maven.apache.org/maven2/net/bytebuddy/byte-buddy-parent/1.6.14/byte-buddy-parent-1.6.14.pom
[INFO] Downloaded: https://repo.maven.apache.org/maven2/net/bytebuddy/byte-buddy-parent/1.6.14/byte-buddy-parent-1.6.14.pom (26 KB at 910.9 KB/sec)
[INFO] Downloading: https://repo.maven.apache.org/maven2/net/bytebuddy/byte-buddy-agent/1.6.14/byte-buddy-agent-1.6.14.pom
[INFO] Downloaded: https://repo.maven.apache.org/maven2/net/bytebuddy/byte-buddy-agent/1.6.14/byte-buddy-agent-1.6.14.pom (5 KB at 243.9 KB/sec)
[INFO] Downloading: http://repository.apache.org/snapshots/org/apache/sling/org.apache.sling.feature/0.1.3-SNAPSHOT/org.apache.sling.feature-0.1.3-20180815.084357-23.jar
[INFO] Downloading: http://repository.apache.org/snapshots/org/apache/sling/org.apache.sling.feature.analyser/0.1.3-SNAPSHOT/org.apache.sling.feature.analyser-0.1.3-20180815.092004-40.jar
[INFO] Downloading: http://repository.apache.org/snapshots/org/apache/sling/org.apache.sling.feature.io/0.1.3-SNAPSHOT/org.apache.sling.feature.io-0.1.3-20180815.084642-31.jar
[INFO] Downloaded: http://repository.apache.org/snapshots/org/apache/sling/org.apache.sling.feature.io/0.1.3-SNAPSHOT/org.apache.sling.feature.io-0.1.3-20180815.084642-31.jar (103 KB at 209.3 KB/sec)
[INFO] Downloaded: http://repository.apache.org/snapshots/org/apache/sling/org.apache.sling.feature/0.1.3-SNAPSHOT/org.apache.sling.feature-0.1.3-20180815.084357-23.jar (103 KB at 201.8 KB/sec)
[INFO] Downloaded: http://repository.apache.org/snapshots/org/apache/sling/org.apache.sling.feature.analyser/0.1.3-SNAPSHOT/org.apache.sling.feature.analyser-0.1.3-20180815.092004-40.jar (1386 KB at 1924.9 KB/sec)
[INFO] Downloading: https://repo.maven.apache.org/maven2/org/mockito/mockito-core/2.8.9/mockito-core-2.8.9.jar
[INFO] Downloading: https://repo.maven.apache.org/maven2/net/bytebuddy/byte-buddy/1.6.14/byte-buddy-1.6.14.jar
[INFO] Downloading: https://repo.maven.apache.org/maven2/net/bytebuddy/byte-buddy-agent/1.6.14/byte-buddy-agent-1.6.14.jar
[INFO] Downloaded: https://repo.maven.apache.org/maven2/net/bytebuddy/byte-buddy-agent/1.6.14/byte-buddy-agent-1.6.14.jar (42 KB at 931.7 KB/sec)
[INFO] Downloaded: https://repo.maven.apache.org/maven2/org/mockito/mockito-core/2.8.9/mockito-core-2.8.9.jar (520 KB at 5525.3 KB/sec)
[INFO] Downloaded: https://repo.maven.apache.org/maven2/net/bytebuddy/byte-buddy/1.6.14/byte-buddy-1.6.14.jar (2731 KB at 11975.5 KB/sec)
[INFO]
[INFO] --- maven-clean-plugin:3.0.0:clean (default-clean) @ org.apache.sling.feature.resolver ---
[INFO]
[INFO] --- maven-enforcer-plugin:3.0.0-M1:enforce (enforce-property-values) @ org.apache.sling.feature.resolver ---
[INFO]
[INFO] --- maven-enforcer-plugin:3.0.0-M1:enforce (enforce-java) @ org.apache.sling.feature.resolver ---
[INFO]
[INFO] --- maven-enforcer-plugin:3.0.0-M1:enforce (ban-maven-scr-plugin) @ org.apache.sling.feature.resolver ---
[INFO]
[INFO] --- maven-remote-resources-plugin:1.5:process (process-resource-bundles) @ org.apache.sling.feature.resolver ---
[INFO]
[INFO] --- maven-remote-resources-plugin:1.5:process (default) @ org.apache.sling.feature.resolver ---
[INFO]
[INFO] --- maven-resources-plugin:2.7:resources (default-resources) @ org.apache.sling.feature.resolver ---
[INFO] Using 'UTF-8' encoding to copy filtered resources.
[INFO] skip non existing resourceDirectory <https://builds.apache.org/job/sling-org-apache-sling-feature-resolver-1.8/ws/src/main/resources>
[INFO] Copying 3 resources
[INFO] Copying 3 resources
[INFO]
[INFO] --- maven-compiler-plugin:3.7.0:compile (default-compile) @ org.apache.sling.feature.resolver ---
[INFO] Changes detected - recompiling the module!
[INFO] Compiling 11 source files to <https://builds.apache.org/job/sling-org-apache-sling-feature-resolver-1.8/ws/target/classes>
[INFO] -------------------------------------------------------------
[ERROR] COMPILATION ERROR :
[INFO] -------------------------------------------------------------
[ERROR] <https://builds.apache.org/job/sling-org-apache-sling-feature-resolver-1.8/ws/src/main/java/org/apache/sling/feature/resolver/ApplicationResolverAssembler.java>:[19,32] cannot find symbol
symbol: class Application
location: package org.apache.sling.feature
[ERROR] <https://builds.apache.org/job/sling-org-apache-sling-feature-resolver-1.8/ws/src/main/java/org/apache/sling/feature/resolver/ApplicationResolverAssembler.java>:[22,40] cannot find symbol
symbol: class ApplicationBuilder
location: package org.apache.sling.feature.builder
[ERROR] <https://builds.apache.org/job/sling-org-apache-sling-feature-resolver-1.8/ws/src/main/java/org/apache/sling/feature/resolver/ApplicationResolverAssembler.java>:[29,58] cannot find symbol
symbol: class SubstituteVariables
location: class org.apache.sling.feature.io.json.FeatureJSONReader
[ERROR] <https://builds.apache.org/job/sling-org-apache-sling-feature-resolver-1.8/ws/src/main/java/org/apache/sling/feature/resolver/ApplicationResolverAssembler.java>:[50,13] cannot find symbol
symbol: class Application
location: class org.apache.sling.feature.resolver.ApplicationResolverAssembler
[ERROR] <https://builds.apache.org/job/sling-org-apache-sling-feature-resolver-1.8/ws/src/main/java/org/apache/sling/feature/resolver/ApplicationResolverAssembler.java>:[49,19] cannot find symbol
symbol: class Application
location: class org.apache.sling.feature.resolver.ApplicationResolverAssembler
[ERROR] <https://builds.apache.org/job/sling-org-apache-sling-feature-resolver-1.8/ws/src/main/java/org/apache/sling/feature/resolver/ApplicationResolverAssembler.java>:[95,13] cannot find symbol
symbol: class Application
location: class org.apache.sling.feature.resolver.ApplicationResolverAssembler
[ERROR] <https://builds.apache.org/job/sling-org-apache-sling-feature-resolver-1.8/ws/src/main/java/org/apache/sling/feature/resolver/ApplicationResolverAssembler.java>:[94,19] cannot find symbol
symbol: class Application
location: class org.apache.sling.feature.resolver.ApplicationResolverAssembler
[ERROR] <https://builds.apache.org/job/sling-org-apache-sling-feature-resolver-1.8/ws/src/main/java/org/apache/sling/feature/resolver/ApplicationResolverAssembler.java>:[58,81] cannot find symbol
symbol: variable SubstituteVariables
location: class org.apache.sling.feature.resolver.ApplicationResolverAssembler
[ERROR] <https://builds.apache.org/job/sling-org-apache-sling-feature-resolver-1.8/ws/src/main/java/org/apache/sling/feature/resolver/ApplicationResolverAssembler.java>:[111,87] cannot find symbol
symbol: variable SubstituteVariables
[ERROR] <https://builds.apache.org/job/sling-org-apache-sling-feature-resolver-1.8/ws/src/main/java/org/apache/sling/feature/resolver/ApplicationResolverAssembler.java>:[104,15] cannot find symbol
symbol: variable ApplicationBuilder
location: class org.apache.sling.feature.resolver.ApplicationResolverAssembler
[INFO] 10 errors
[INFO] -------------------------------------------------------------
[WARNING] Attempt to (de-)serialize anonymous class hudson.maven.reporters.MavenArtifactArchiver$2; see: https://jenkins.io/redirect/serialization-of-anonymous-classes/
[JENKINS] Archiving disabled
[WARNING] Attempt to (de-)serialize anonymous class hudson.maven.reporters.MavenFingerprinter$1; see: https://jenkins.io/redirect/serialization-of-anonymous-classes/
[JENKINS] Archiving disabled
[INFO] ------------------------------------------------------------------------
[INFO] BUILD FAILURE
[INFO] ------------------------------------------------------------------------
[INFO] Total time: 19.388 s
[INFO] Finished at: 2018-08-15T09:21:10+00:00
[INFO] Final Memory: 49M/3925M
[INFO] ------------------------------------------------------------------------
Waiting for Jenkins to finish collecting data
[ERROR] Failed to execute goal org.apache.maven.plugins:maven-compiler-plugin:3.7.0:compile (default-compile) on project org.apache.sling.feature.resolver: Compilation failure: Compilation failure:
[ERROR] <https://builds.apache.org/job/sling-org-apache-sling-feature-resolver-1.8/ws/src/main/java/org/apache/sling/feature/resolver/ApplicationResolverAssembler.java>:[19,32] cannot find symbol
[ERROR] symbol: class Application
[ERROR] location: package org.apache.sling.feature
[ERROR] <https://builds.apache.org/job/sling-org-apache-sling-feature-resolver-1.8/ws/src/main/java/org/apache/sling/feature/resolver/ApplicationResolverAssembler.java>:[22,40] cannot find symbol
[ERROR] symbol: class ApplicationBuilder
[ERROR] location: package org.apache.sling.feature.builder
[ERROR] <https://builds.apache.org/job/sling-org-apache-sling-feature-resolver-1.8/ws/src/main/java/org/apache/sling/feature/resolver/ApplicationResolverAssembler.java>:[29,58] cannot find symbol
[ERROR] symbol: class SubstituteVariables
[ERROR] location: class org.apache.sling.feature.io.json.FeatureJSONReader
[ERROR] <https://builds.apache.org/job/sling-org-apache-sling-feature-resolver-1.8/ws/src/main/java/org/apache/sling/feature/resolver/ApplicationResolverAssembler.java>:[50,13] cannot find symbol
[ERROR] symbol: class Application
[ERROR] location: class org.apache.sling.feature.resolver.ApplicationResolverAssembler
[ERROR] <https://builds.apache.org/job/sling-org-apache-sling-feature-resolver-1.8/ws/src/main/java/org/apache/sling/feature/resolver/ApplicationResolverAssembler.java>:[49,19] cannot find symbol
[ERROR] symbol: class Application
[ERROR] location: class org.apache.sling.feature.resolver.ApplicationResolverAssembler
[ERROR] <https://builds.apache.org/job/sling-org-apache-sling-feature-resolver-1.8/ws/src/main/java/org/apache/sling/feature/resolver/ApplicationResolverAssembler.java>:[95,13] cannot find symbol
[ERROR] symbol: class Application
[ERROR] location: class org.apache.sling.feature.resolver.ApplicationResolverAssembler
[ERROR] <https://builds.apache.org/job/sling-org-apache-sling-feature-resolver-1.8/ws/src/main/java/org/apache/sling/feature/resolver/ApplicationResolverAssembler.java>:[94,19] cannot find symbol
[ERROR] symbol: class Application
[ERROR] location: class org.apache.sling.feature.resolver.ApplicationResolverAssembler
[ERROR] <https://builds.apache.org/job/sling-org-apache-sling-feature-resolver-1.8/ws/src/main/java/org/apache/sling/feature/resolver/ApplicationResolverAssembler.java>:[58,81] cannot find symbol
[ERROR] symbol: variable SubstituteVariables
[ERROR] location: class org.apache.sling.feature.resolver.ApplicationResolverAssembler
[ERROR] <https://builds.apache.org/job/sling-org-apache-sling-feature-resolver-1.8/ws/src/main/java/org/apache/sling/feature/resolver/ApplicationResolverAssembler.java>:[111,87] cannot find symbol
[ERROR] symbol: variable SubstituteVariables
[ERROR] <https://builds.apache.org/job/sling-org-apache-sling-feature-resolver-1.8/ws/src/main/java/org/apache/sling/feature/resolver/ApplicationResolverAssembler.java>:[104,15] cannot find symbol
[ERROR] symbol: variable ApplicationBuilder
[ERROR] location: class org.apache.sling.feature.resolver.ApplicationResolverAssembler
[ERROR] -> [Help 1]
[ERROR]
[ERROR] To see the full stack trace of the errors, re-run Maven with the -e switch.
[ERROR] Re-run Maven using the -X switch to enable full debug logging.
[ERROR]
[ERROR] For more information about the errors and possible solutions, please read the following articles:
[ERROR] [Help 1] http://cwiki.apache.org/confluence/display/MAVEN/MojoFailureException
channel stopped
Recording test results
Build failed in Jenkins:
sling-org-apache-sling-feature-resolver-1.8 #65
Posted by Apache Jenkins Server <je...@builds.apache.org>.
See <https://builds.apache.org/job/sling-org-apache-sling-feature-resolver-1.8/65/display/redirect>
------------------------------------------
Started by upstream project "sling-org-apache-sling-feature-analyser-1.8" build number 61
originally caused by:
Started by upstream project "sling-org-apache-sling-feature-io-1.8" build number 46
originally caused by:
Started by upstream project "sling-org-apache-sling-feature-1.8" build number 32
originally caused by:
Started by an SCM change
[EnvInject] - Loading node environment variables.
Building remotely on H31 (ubuntu xenial) in workspace <https://builds.apache.org/job/sling-org-apache-sling-feature-resolver-1.8/ws/>
> git rev-parse --is-inside-work-tree # timeout=10
Fetching changes from the remote Git repository
> git config remote.origin.url https://github.com/apache/sling-org-apache-sling-feature-resolver.git # timeout=10
Fetching upstream changes from https://github.com/apache/sling-org-apache-sling-feature-resolver.git
> git --version # timeout=10
> git fetch --tags --progress https://github.com/apache/sling-org-apache-sling-feature-resolver.git +refs/heads/*:refs/remotes/origin/*
> git rev-parse origin/master^{commit} # timeout=10
Checking out Revision f52d6465fa38070398787727e1a5ea9de69d8b8d (origin/master)
> git config core.sparsecheckout # timeout=10
> git checkout -f f52d6465fa38070398787727e1a5ea9de69d8b8d
Commit message: "Update to Configurator 1.0.4"
> git rev-list --no-walk f52d6465fa38070398787727e1a5ea9de69d8b8d # timeout=10
Parsing POMs
Established TCP socket on 34361
maven33-agent.jar already up to date
maven33-interceptor.jar already up to date
maven3-interceptor-commons.jar already up to date
[sling-org-apache-sling-feature-resolver-1.8] $ /home/jenkins/tools/java/latest1.8/bin/java -Xmx4g -Xms4g -cp /home/jenkins/jenkins-slave/maven33-agent.jar:/home/jenkins/tools/maven/apache-maven-3.3.9/boot/plexus-classworlds-2.5.2.jar:/home/jenkins/tools/maven/apache-maven-3.3.9/conf/logging jenkins.maven3.agent.Maven33Main /home/jenkins/tools/maven/apache-maven-3.3.9 /home/jenkins/jenkins-slave/slave.jar /home/jenkins/jenkins-slave/maven33-interceptor.jar /home/jenkins/jenkins-slave/maven3-interceptor-commons.jar 34361
<===[JENKINS REMOTING CAPACITY]===> channel started
Executing Maven: -B -f <https://builds.apache.org/job/sling-org-apache-sling-feature-resolver-1.8/ws/pom.xml> -Dmaven.repo.local=/home/jenkins/jenkins-slave/maven-repositories/1 -U clean deploy
[INFO] Scanning for projects...
[INFO]
[INFO] ------------------------------------------------------------------------
[INFO] Building Apache Sling Feature Resolver 0.1.0-SNAPSHOT
[INFO] ------------------------------------------------------------------------
[INFO] Downloading: https://repo.maven.apache.org/maven2/org/osgi/org.osgi.service.resolver/1.1.0/org.osgi.service.resolver-1.1.0.pom
[INFO] Downloaded: https://repo.maven.apache.org/maven2/org/osgi/org.osgi.service.resolver/1.1.0/org.osgi.service.resolver-1.1.0.pom (2 KB at 2.2 KB/sec)
[INFO] Downloading: http://repository.apache.org/snapshots/org/apache/sling/org.apache.sling.feature/0.1.3-SNAPSHOT/maven-metadata.xml
[INFO] Downloaded: http://repository.apache.org/snapshots/org/apache/sling/org.apache.sling.feature/0.1.3-SNAPSHOT/maven-metadata.xml (1008 B at 3.2 KB/sec)
[INFO] Downloading: http://repository.apache.org/snapshots/org/apache/sling/org.apache.sling.feature.analyser/0.1.3-SNAPSHOT/maven-metadata.xml
[INFO] Downloaded: http://repository.apache.org/snapshots/org/apache/sling/org.apache.sling.feature.analyser/0.1.3-SNAPSHOT/maven-metadata.xml (1017 B at 3.2 KB/sec)
[INFO] Downloading: http://repository.apache.org/snapshots/org/apache/sling/org.apache.sling.feature.analyser/0.1.3-SNAPSHOT/org.apache.sling.feature.analyser-0.1.3-20180828.205115-50.pom
[INFO] Downloaded: http://repository.apache.org/snapshots/org/apache/sling/org.apache.sling.feature.analyser/0.1.3-SNAPSHOT/org.apache.sling.feature.analyser-0.1.3-20180828.205115-50.pom (7 KB at 23.2 KB/sec)
[INFO] Downloading: http://repository.apache.org/snapshots/org/apache/sling/org.apache.sling.feature.io/0.1.3-SNAPSHOT/maven-metadata.xml
[INFO] Downloaded: http://repository.apache.org/snapshots/org/apache/sling/org.apache.sling.feature.io/0.1.3-SNAPSHOT/maven-metadata.xml (1011 B at 3.3 KB/sec)
[INFO] Downloading: https://repo.maven.apache.org/maven2/org/osgi/org.osgi.service.resolver/1.1.0/org.osgi.service.resolver-1.1.0.jar
[INFO] Downloaded: https://repo.maven.apache.org/maven2/org/osgi/org.osgi.service.resolver/1.1.0/org.osgi.service.resolver-1.1.0.jar (23 KB at 200.9 KB/sec)
[INFO] Downloading: http://repository.apache.org/snapshots/org/apache/sling/org.apache.sling.feature.analyser/0.1.3-SNAPSHOT/org.apache.sling.feature.analyser-0.1.3-20180828.205115-50.jar
[INFO] Downloaded: http://repository.apache.org/snapshots/org/apache/sling/org.apache.sling.feature.analyser/0.1.3-SNAPSHOT/org.apache.sling.feature.analyser-0.1.3-20180828.205115-50.jar (1386 KB at 1914.3 KB/sec)
[INFO]
[INFO] --- maven-clean-plugin:3.0.0:clean (default-clean) @ org.apache.sling.feature.resolver ---
[INFO] Deleting <https://builds.apache.org/job/sling-org-apache-sling-feature-resolver-1.8/ws/target>
[INFO]
[INFO] --- maven-enforcer-plugin:3.0.0-M1:enforce (enforce-property-values) @ org.apache.sling.feature.resolver ---
[INFO]
[INFO] --- maven-enforcer-plugin:3.0.0-M1:enforce (enforce-java) @ org.apache.sling.feature.resolver ---
[INFO]
[INFO] --- maven-enforcer-plugin:3.0.0-M1:enforce (ban-maven-scr-plugin) @ org.apache.sling.feature.resolver ---
[INFO]
[INFO] --- maven-remote-resources-plugin:1.5:process (process-resource-bundles) @ org.apache.sling.feature.resolver ---
[INFO]
[INFO] --- maven-remote-resources-plugin:1.5:process (default) @ org.apache.sling.feature.resolver ---
[INFO]
[INFO] --- maven-resources-plugin:2.7:resources (default-resources) @ org.apache.sling.feature.resolver ---
[INFO] Using 'UTF-8' encoding to copy filtered resources.
[INFO] skip non existing resourceDirectory <https://builds.apache.org/job/sling-org-apache-sling-feature-resolver-1.8/ws/src/main/resources>
[INFO] Copying 3 resources
[INFO] Copying 3 resources
[INFO]
[INFO] --- maven-compiler-plugin:3.7.0:compile (default-compile) @ org.apache.sling.feature.resolver ---
[INFO] Changes detected - recompiling the module!
[INFO] Compiling 11 source files to <https://builds.apache.org/job/sling-org-apache-sling-feature-resolver-1.8/ws/target/classes>
[INFO] -------------------------------------------------------------
[ERROR] COMPILATION ERROR :
[INFO] -------------------------------------------------------------
[ERROR] <https://builds.apache.org/job/sling-org-apache-sling-feature-resolver-1.8/ws/src/main/java/org/apache/sling/feature/resolver/ApplicationResolverAssembler.java>:[19,32] cannot find symbol
symbol: class Application
location: package org.apache.sling.feature
[ERROR] <https://builds.apache.org/job/sling-org-apache-sling-feature-resolver-1.8/ws/src/main/java/org/apache/sling/feature/resolver/ApplicationResolverAssembler.java>:[22,40] cannot find symbol
symbol: class ApplicationBuilder
location: package org.apache.sling.feature.builder
[ERROR] <https://builds.apache.org/job/sling-org-apache-sling-feature-resolver-1.8/ws/src/main/java/org/apache/sling/feature/resolver/ApplicationResolverAssembler.java>:[29,58] cannot find symbol
symbol: class SubstituteVariables
location: class org.apache.sling.feature.io.json.FeatureJSONReader
[ERROR] <https://builds.apache.org/job/sling-org-apache-sling-feature-resolver-1.8/ws/src/main/java/org/apache/sling/feature/resolver/ApplicationResolverAssembler.java>:[50,13] cannot find symbol
symbol: class Application
location: class org.apache.sling.feature.resolver.ApplicationResolverAssembler
[ERROR] <https://builds.apache.org/job/sling-org-apache-sling-feature-resolver-1.8/ws/src/main/java/org/apache/sling/feature/resolver/ApplicationResolverAssembler.java>:[49,19] cannot find symbol
symbol: class Application
location: class org.apache.sling.feature.resolver.ApplicationResolverAssembler
[ERROR] <https://builds.apache.org/job/sling-org-apache-sling-feature-resolver-1.8/ws/src/main/java/org/apache/sling/feature/resolver/ApplicationResolverAssembler.java>:[95,13] cannot find symbol
symbol: class Application
location: class org.apache.sling.feature.resolver.ApplicationResolverAssembler
[ERROR] <https://builds.apache.org/job/sling-org-apache-sling-feature-resolver-1.8/ws/src/main/java/org/apache/sling/feature/resolver/ApplicationResolverAssembler.java>:[94,19] cannot find symbol
symbol: class Application
location: class org.apache.sling.feature.resolver.ApplicationResolverAssembler
[ERROR] <https://builds.apache.org/job/sling-org-apache-sling-feature-resolver-1.8/ws/src/main/java/org/apache/sling/feature/resolver/ApplicationResolverAssembler.java>:[58,81] cannot find symbol
symbol: variable SubstituteVariables
location: class org.apache.sling.feature.resolver.ApplicationResolverAssembler
[ERROR] <https://builds.apache.org/job/sling-org-apache-sling-feature-resolver-1.8/ws/src/main/java/org/apache/sling/feature/resolver/ApplicationResolverAssembler.java>:[111,87] cannot find symbol
symbol: variable SubstituteVariables
[ERROR] <https://builds.apache.org/job/sling-org-apache-sling-feature-resolver-1.8/ws/src/main/java/org/apache/sling/feature/resolver/ApplicationResolverAssembler.java>:[104,15] cannot find symbol
symbol: variable ApplicationBuilder
location: class org.apache.sling.feature.resolver.ApplicationResolverAssembler
[INFO] 10 errors
[INFO] -------------------------------------------------------------
[WARNING] Attempt to (de-)serialize anonymous class hudson.maven.reporters.MavenArtifactArchiver$2; see: https://jenkins.io/redirect/serialization-of-anonymous-classes/
[JENKINS] Archiving disabled
[WARNING] Attempt to (de-)serialize anonymous class hudson.maven.reporters.MavenFingerprinter$1; see: https://jenkins.io/redirect/serialization-of-anonymous-classes/
[JENKINS] Archiving disabled
[INFO] ------------------------------------------------------------------------
[INFO] BUILD FAILURE
[INFO] ------------------------------------------------------------------------
[INFO] Total time: 18.576 s
[INFO] Finished at: 2018-08-28T20:52:18+00:00
[INFO] Final Memory: 49M/3925M
[INFO] ------------------------------------------------------------------------
Waiting for Jenkins to finish collecting data
[ERROR] Failed to execute goal org.apache.maven.plugins:maven-compiler-plugin:3.7.0:compile (default-compile) on project org.apache.sling.feature.resolver: Compilation failure: Compilation failure:
[ERROR] <https://builds.apache.org/job/sling-org-apache-sling-feature-resolver-1.8/ws/src/main/java/org/apache/sling/feature/resolver/ApplicationResolverAssembler.java>:[19,32] cannot find symbol
[ERROR] symbol: class Application
[ERROR] location: package org.apache.sling.feature
[ERROR] <https://builds.apache.org/job/sling-org-apache-sling-feature-resolver-1.8/ws/src/main/java/org/apache/sling/feature/resolver/ApplicationResolverAssembler.java>:[22,40] cannot find symbol
[ERROR] symbol: class ApplicationBuilder
[ERROR] location: package org.apache.sling.feature.builder
[ERROR] <https://builds.apache.org/job/sling-org-apache-sling-feature-resolver-1.8/ws/src/main/java/org/apache/sling/feature/resolver/ApplicationResolverAssembler.java>:[29,58] cannot find symbol
[ERROR] symbol: class SubstituteVariables
[ERROR] location: class org.apache.sling.feature.io.json.FeatureJSONReader
[ERROR] <https://builds.apache.org/job/sling-org-apache-sling-feature-resolver-1.8/ws/src/main/java/org/apache/sling/feature/resolver/ApplicationResolverAssembler.java>:[50,13] cannot find symbol
[ERROR] symbol: class Application
[ERROR] location: class org.apache.sling.feature.resolver.ApplicationResolverAssembler
[ERROR] <https://builds.apache.org/job/sling-org-apache-sling-feature-resolver-1.8/ws/src/main/java/org/apache/sling/feature/resolver/ApplicationResolverAssembler.java>:[49,19] cannot find symbol
[ERROR] symbol: class Application
[ERROR] location: class org.apache.sling.feature.resolver.ApplicationResolverAssembler
[ERROR] <https://builds.apache.org/job/sling-org-apache-sling-feature-resolver-1.8/ws/src/main/java/org/apache/sling/feature/resolver/ApplicationResolverAssembler.java>:[95,13] cannot find symbol
[ERROR] symbol: class Application
[ERROR] location: class org.apache.sling.feature.resolver.ApplicationResolverAssembler
[ERROR] <https://builds.apache.org/job/sling-org-apache-sling-feature-resolver-1.8/ws/src/main/java/org/apache/sling/feature/resolver/ApplicationResolverAssembler.java>:[94,19] cannot find symbol
[ERROR] symbol: class Application
[ERROR] location: class org.apache.sling.feature.resolver.ApplicationResolverAssembler
[ERROR] <https://builds.apache.org/job/sling-org-apache-sling-feature-resolver-1.8/ws/src/main/java/org/apache/sling/feature/resolver/ApplicationResolverAssembler.java>:[58,81] cannot find symbol
[ERROR] symbol: variable SubstituteVariables
[ERROR] location: class org.apache.sling.feature.resolver.ApplicationResolverAssembler
[ERROR] <https://builds.apache.org/job/sling-org-apache-sling-feature-resolver-1.8/ws/src/main/java/org/apache/sling/feature/resolver/ApplicationResolverAssembler.java>:[111,87] cannot find symbol
[ERROR] symbol: variable SubstituteVariables
[ERROR] <https://builds.apache.org/job/sling-org-apache-sling-feature-resolver-1.8/ws/src/main/java/org/apache/sling/feature/resolver/ApplicationResolverAssembler.java>:[104,15] cannot find symbol
[ERROR] symbol: variable ApplicationBuilder
[ERROR] location: class org.apache.sling.feature.resolver.ApplicationResolverAssembler
[ERROR] -> [Help 1]
[ERROR]
[ERROR] To see the full stack trace of the errors, re-run Maven with the -e switch.
[ERROR] Re-run Maven using the -X switch to enable full debug logging.
[ERROR]
[ERROR] For more information about the errors and possible solutions, please read the following articles:
[ERROR] [Help 1] http://cwiki.apache.org/confluence/display/MAVEN/MojoFailureException
channel stopped
Recording test results
Build failed in Jenkins:
sling-org-apache-sling-feature-resolver-1.8 #64
Posted by Apache Jenkins Server <je...@builds.apache.org>.
See <https://builds.apache.org/job/sling-org-apache-sling-feature-resolver-1.8/64/display/redirect>
------------------------------------------
Started by upstream project "sling-org-apache-sling-feature-analyser-1.8" build number 60
originally caused by:
Started by upstream project "sling-org-apache-sling-feature-io-1.8" build number 45
originally caused by:
Started by an SCM change
[EnvInject] - Loading node environment variables.
Building remotely on H27 (ubuntu xenial) in workspace <https://builds.apache.org/job/sling-org-apache-sling-feature-resolver-1.8/ws/>
> git rev-parse --is-inside-work-tree # timeout=10
Fetching changes from the remote Git repository
> git config remote.origin.url https://github.com/apache/sling-org-apache-sling-feature-resolver.git # timeout=10
Fetching upstream changes from https://github.com/apache/sling-org-apache-sling-feature-resolver.git
> git --version # timeout=10
> git fetch --tags --progress https://github.com/apache/sling-org-apache-sling-feature-resolver.git +refs/heads/*:refs/remotes/origin/*
> git rev-parse origin/master^{commit} # timeout=10
Checking out Revision f52d6465fa38070398787727e1a5ea9de69d8b8d (origin/master)
> git config core.sparsecheckout # timeout=10
> git checkout -f f52d6465fa38070398787727e1a5ea9de69d8b8d
Commit message: "Update to Configurator 1.0.4"
> git rev-list --no-walk f52d6465fa38070398787727e1a5ea9de69d8b8d # timeout=10
Parsing POMs
Established TCP socket on 43354
maven33-agent.jar already up to date
maven33-interceptor.jar already up to date
maven3-interceptor-commons.jar already up to date
[sling-org-apache-sling-feature-resolver-1.8] $ /home/jenkins/tools/java/latest1.8/bin/java -Xmx4g -Xms4g -cp /home/jenkins/jenkins-slave/maven33-agent.jar:/home/jenkins/tools/maven/apache-maven-3.3.9/boot/plexus-classworlds-2.5.2.jar:/home/jenkins/tools/maven/apache-maven-3.3.9/conf/logging jenkins.maven3.agent.Maven33Main /home/jenkins/tools/maven/apache-maven-3.3.9 /home/jenkins/jenkins-slave/slave.jar /home/jenkins/jenkins-slave/maven33-interceptor.jar /home/jenkins/jenkins-slave/maven3-interceptor-commons.jar 43354
<===[JENKINS REMOTING CAPACITY]===> channel started
Executing Maven: -B -f <https://builds.apache.org/job/sling-org-apache-sling-feature-resolver-1.8/ws/pom.xml> -Dmaven.repo.local=/home/jenkins/jenkins-slave/maven-repositories/1 -U clean deploy
[INFO] Scanning for projects...
[INFO]
[INFO] ------------------------------------------------------------------------
[INFO] Building Apache Sling Feature Resolver 0.1.0-SNAPSHOT
[INFO] ------------------------------------------------------------------------
[INFO] Downloading: http://repository.apache.org/snapshots/org/apache/sling/org.apache.sling.feature/0.1.3-SNAPSHOT/maven-metadata.xml
[INFO] Downloaded: http://repository.apache.org/snapshots/org/apache/sling/org.apache.sling.feature/0.1.3-SNAPSHOT/maven-metadata.xml (1008 B at 2.6 KB/sec)
[INFO] Downloading: http://repository.apache.org/snapshots/org/apache/sling/org.apache.sling.feature.analyser/0.1.3-SNAPSHOT/maven-metadata.xml
[INFO] Downloaded: http://repository.apache.org/snapshots/org/apache/sling/org.apache.sling.feature.analyser/0.1.3-SNAPSHOT/maven-metadata.xml (1017 B at 3.4 KB/sec)
[INFO] Downloading: http://repository.apache.org/snapshots/org/apache/sling/org.apache.sling.feature.analyser/0.1.3-SNAPSHOT/org.apache.sling.feature.analyser-0.1.3-20180828.091354-49.pom
[INFO] Downloaded: http://repository.apache.org/snapshots/org/apache/sling/org.apache.sling.feature.analyser/0.1.3-SNAPSHOT/org.apache.sling.feature.analyser-0.1.3-20180828.091354-49.pom (7 KB at 24.4 KB/sec)
[INFO] Downloading: http://repository.apache.org/snapshots/org/apache/sling/org.apache.sling.feature.io/0.1.3-SNAPSHOT/maven-metadata.xml
[INFO] Downloaded: http://repository.apache.org/snapshots/org/apache/sling/org.apache.sling.feature.io/0.1.3-SNAPSHOT/maven-metadata.xml (1011 B at 3.3 KB/sec)
[INFO] Downloading: http://repository.apache.org/snapshots/org/apache/sling/org.apache.sling.feature.analyser/0.1.3-SNAPSHOT/org.apache.sling.feature.analyser-0.1.3-20180828.091354-49.jar
[INFO] Downloaded: http://repository.apache.org/snapshots/org/apache/sling/org.apache.sling.feature.analyser/0.1.3-SNAPSHOT/org.apache.sling.feature.analyser-0.1.3-20180828.091354-49.jar (1386 KB at 1977.1 KB/sec)
[INFO]
[INFO] --- maven-clean-plugin:3.0.0:clean (default-clean) @ org.apache.sling.feature.resolver ---
[INFO] Deleting <https://builds.apache.org/job/sling-org-apache-sling-feature-resolver-1.8/ws/target>
[INFO]
[INFO] --- maven-enforcer-plugin:3.0.0-M1:enforce (enforce-property-values) @ org.apache.sling.feature.resolver ---
[INFO]
[INFO] --- maven-enforcer-plugin:3.0.0-M1:enforce (enforce-java) @ org.apache.sling.feature.resolver ---
[INFO]
[INFO] --- maven-enforcer-plugin:3.0.0-M1:enforce (ban-maven-scr-plugin) @ org.apache.sling.feature.resolver ---
[INFO]
[INFO] --- maven-remote-resources-plugin:1.5:process (process-resource-bundles) @ org.apache.sling.feature.resolver ---
[INFO]
[INFO] --- maven-remote-resources-plugin:1.5:process (default) @ org.apache.sling.feature.resolver ---
[INFO]
[INFO] --- maven-resources-plugin:2.7:resources (default-resources) @ org.apache.sling.feature.resolver ---
[INFO] Using 'UTF-8' encoding to copy filtered resources.
[INFO] skip non existing resourceDirectory <https://builds.apache.org/job/sling-org-apache-sling-feature-resolver-1.8/ws/src/main/resources>
[INFO] Copying 3 resources
[INFO] Copying 3 resources
[INFO]
[INFO] --- maven-compiler-plugin:3.7.0:compile (default-compile) @ org.apache.sling.feature.resolver ---
[INFO] Changes detected - recompiling the module!
[INFO] Compiling 11 source files to <https://builds.apache.org/job/sling-org-apache-sling-feature-resolver-1.8/ws/target/classes>
[INFO] -------------------------------------------------------------
[ERROR] COMPILATION ERROR :
[INFO] -------------------------------------------------------------
[ERROR] <https://builds.apache.org/job/sling-org-apache-sling-feature-resolver-1.8/ws/src/main/java/org/apache/sling/feature/resolver/ApplicationResolverAssembler.java>:[19,32] cannot find symbol
symbol: class Application
location: package org.apache.sling.feature
[ERROR] <https://builds.apache.org/job/sling-org-apache-sling-feature-resolver-1.8/ws/src/main/java/org/apache/sling/feature/resolver/ApplicationResolverAssembler.java>:[22,40] cannot find symbol
symbol: class ApplicationBuilder
location: package org.apache.sling.feature.builder
[ERROR] <https://builds.apache.org/job/sling-org-apache-sling-feature-resolver-1.8/ws/src/main/java/org/apache/sling/feature/resolver/ApplicationResolverAssembler.java>:[29,58] cannot find symbol
symbol: class SubstituteVariables
location: class org.apache.sling.feature.io.json.FeatureJSONReader
[ERROR] <https://builds.apache.org/job/sling-org-apache-sling-feature-resolver-1.8/ws/src/main/java/org/apache/sling/feature/resolver/ApplicationResolverAssembler.java>:[50,13] cannot find symbol
symbol: class Application
location: class org.apache.sling.feature.resolver.ApplicationResolverAssembler
[ERROR] <https://builds.apache.org/job/sling-org-apache-sling-feature-resolver-1.8/ws/src/main/java/org/apache/sling/feature/resolver/ApplicationResolverAssembler.java>:[49,19] cannot find symbol
symbol: class Application
location: class org.apache.sling.feature.resolver.ApplicationResolverAssembler
[ERROR] <https://builds.apache.org/job/sling-org-apache-sling-feature-resolver-1.8/ws/src/main/java/org/apache/sling/feature/resolver/ApplicationResolverAssembler.java>:[95,13] cannot find symbol
symbol: class Application
location: class org.apache.sling.feature.resolver.ApplicationResolverAssembler
[ERROR] <https://builds.apache.org/job/sling-org-apache-sling-feature-resolver-1.8/ws/src/main/java/org/apache/sling/feature/resolver/ApplicationResolverAssembler.java>:[94,19] cannot find symbol
symbol: class Application
location: class org.apache.sling.feature.resolver.ApplicationResolverAssembler
[ERROR] <https://builds.apache.org/job/sling-org-apache-sling-feature-resolver-1.8/ws/src/main/java/org/apache/sling/feature/resolver/ApplicationResolverAssembler.java>:[58,81] cannot find symbol
symbol: variable SubstituteVariables
location: class org.apache.sling.feature.resolver.ApplicationResolverAssembler
[ERROR] <https://builds.apache.org/job/sling-org-apache-sling-feature-resolver-1.8/ws/src/main/java/org/apache/sling/feature/resolver/ApplicationResolverAssembler.java>:[111,87] cannot find symbol
symbol: variable SubstituteVariables
[ERROR] <https://builds.apache.org/job/sling-org-apache-sling-feature-resolver-1.8/ws/src/main/java/org/apache/sling/feature/resolver/ApplicationResolverAssembler.java>:[104,15] cannot find symbol
symbol: variable ApplicationBuilder
location: class org.apache.sling.feature.resolver.ApplicationResolverAssembler
[INFO] 10 errors
[INFO] -------------------------------------------------------------
[WARNING] Attempt to (de-)serialize anonymous class hudson.maven.reporters.MavenArtifactArchiver$2; see: https://jenkins.io/redirect/serialization-of-anonymous-classes/
[JENKINS] Archiving disabled
[WARNING] Attempt to (de-)serialize anonymous class hudson.maven.reporters.MavenFingerprinter$1; see: https://jenkins.io/redirect/serialization-of-anonymous-classes/
[JENKINS] Archiving disabled
[INFO] ------------------------------------------------------------------------
[INFO] BUILD FAILURE
[INFO] ------------------------------------------------------------------------
[INFO] Total time: 16.879 s
[INFO] Finished at: 2018-08-28T09:14:55+00:00
[INFO] Final Memory: 49M/3925M
[INFO] ------------------------------------------------------------------------
Waiting for Jenkins to finish collecting data
[ERROR] Failed to execute goal org.apache.maven.plugins:maven-compiler-plugin:3.7.0:compile (default-compile) on project org.apache.sling.feature.resolver: Compilation failure: Compilation failure:
[ERROR] <https://builds.apache.org/job/sling-org-apache-sling-feature-resolver-1.8/ws/src/main/java/org/apache/sling/feature/resolver/ApplicationResolverAssembler.java>:[19,32] cannot find symbol
[ERROR] symbol: class Application
[ERROR] location: package org.apache.sling.feature
[ERROR] <https://builds.apache.org/job/sling-org-apache-sling-feature-resolver-1.8/ws/src/main/java/org/apache/sling/feature/resolver/ApplicationResolverAssembler.java>:[22,40] cannot find symbol
[ERROR] symbol: class ApplicationBuilder
[ERROR] location: package org.apache.sling.feature.builder
[ERROR] <https://builds.apache.org/job/sling-org-apache-sling-feature-resolver-1.8/ws/src/main/java/org/apache/sling/feature/resolver/ApplicationResolverAssembler.java>:[29,58] cannot find symbol
[ERROR] symbol: class SubstituteVariables
[ERROR] location: class org.apache.sling.feature.io.json.FeatureJSONReader
[ERROR] <https://builds.apache.org/job/sling-org-apache-sling-feature-resolver-1.8/ws/src/main/java/org/apache/sling/feature/resolver/ApplicationResolverAssembler.java>:[50,13] cannot find symbol
[ERROR] symbol: class Application
[ERROR] location: class org.apache.sling.feature.resolver.ApplicationResolverAssembler
[ERROR] <https://builds.apache.org/job/sling-org-apache-sling-feature-resolver-1.8/ws/src/main/java/org/apache/sling/feature/resolver/ApplicationResolverAssembler.java>:[49,19] cannot find symbol
[ERROR] symbol: class Application
[ERROR] location: class org.apache.sling.feature.resolver.ApplicationResolverAssembler
[ERROR] <https://builds.apache.org/job/sling-org-apache-sling-feature-resolver-1.8/ws/src/main/java/org/apache/sling/feature/resolver/ApplicationResolverAssembler.java>:[95,13] cannot find symbol
[ERROR] symbol: class Application
[ERROR] location: class org.apache.sling.feature.resolver.ApplicationResolverAssembler
[ERROR] <https://builds.apache.org/job/sling-org-apache-sling-feature-resolver-1.8/ws/src/main/java/org/apache/sling/feature/resolver/ApplicationResolverAssembler.java>:[94,19] cannot find symbol
[ERROR] symbol: class Application
[ERROR] location: class org.apache.sling.feature.resolver.ApplicationResolverAssembler
[ERROR] <https://builds.apache.org/job/sling-org-apache-sling-feature-resolver-1.8/ws/src/main/java/org/apache/sling/feature/resolver/ApplicationResolverAssembler.java>:[58,81] cannot find symbol
[ERROR] symbol: variable SubstituteVariables
[ERROR] location: class org.apache.sling.feature.resolver.ApplicationResolverAssembler
[ERROR] <https://builds.apache.org/job/sling-org-apache-sling-feature-resolver-1.8/ws/src/main/java/org/apache/sling/feature/resolver/ApplicationResolverAssembler.java>:[111,87] cannot find symbol
[ERROR] symbol: variable SubstituteVariables
[ERROR] <https://builds.apache.org/job/sling-org-apache-sling-feature-resolver-1.8/ws/src/main/java/org/apache/sling/feature/resolver/ApplicationResolverAssembler.java>:[104,15] cannot find symbol
[ERROR] symbol: variable ApplicationBuilder
[ERROR] location: class org.apache.sling.feature.resolver.ApplicationResolverAssembler
[ERROR] -> [Help 1]
[ERROR]
[ERROR] To see the full stack trace of the errors, re-run Maven with the -e switch.
[ERROR] Re-run Maven using the -X switch to enable full debug logging.
[ERROR]
[ERROR] For more information about the errors and possible solutions, please read the following articles:
[ERROR] [Help 1] http://cwiki.apache.org/confluence/display/MAVEN/MojoFailureException
channel stopped
Recording test results
Build failed in Jenkins:
sling-org-apache-sling-feature-resolver-1.8 #63
Posted by Apache Jenkins Server <je...@builds.apache.org>.
See <https://builds.apache.org/job/sling-org-apache-sling-feature-resolver-1.8/63/display/redirect>
------------------------------------------
Started by upstream project "sling-org-apache-sling-feature-analyser-1.8" build number 59
originally caused by:
Started by upstream project "sling-org-apache-sling-feature-io-1.8" build number 44
originally caused by:
Started by timer
[EnvInject] - Loading node environment variables.
Building remotely on H27 (ubuntu xenial) in workspace <https://builds.apache.org/job/sling-org-apache-sling-feature-resolver-1.8/ws/>
> git rev-parse --is-inside-work-tree # timeout=10
Fetching changes from the remote Git repository
> git config remote.origin.url https://github.com/apache/sling-org-apache-sling-feature-resolver.git # timeout=10
Fetching upstream changes from https://github.com/apache/sling-org-apache-sling-feature-resolver.git
> git --version # timeout=10
> git fetch --tags --progress https://github.com/apache/sling-org-apache-sling-feature-resolver.git +refs/heads/*:refs/remotes/origin/*
> git rev-parse origin/master^{commit} # timeout=10
Checking out Revision f52d6465fa38070398787727e1a5ea9de69d8b8d (origin/master)
> git config core.sparsecheckout # timeout=10
> git checkout -f f52d6465fa38070398787727e1a5ea9de69d8b8d
Commit message: "Update to Configurator 1.0.4"
> git rev-list --no-walk f52d6465fa38070398787727e1a5ea9de69d8b8d # timeout=10
Parsing POMs
Established TCP socket on 37113
maven33-agent.jar already up to date
maven33-interceptor.jar already up to date
maven3-interceptor-commons.jar already up to date
[sling-org-apache-sling-feature-resolver-1.8] $ /home/jenkins/tools/java/latest1.8/bin/java -Xmx4g -Xms4g -cp /home/jenkins/jenkins-slave/maven33-agent.jar:/home/jenkins/tools/maven/apache-maven-3.3.9/boot/plexus-classworlds-2.5.2.jar:/home/jenkins/tools/maven/apache-maven-3.3.9/conf/logging jenkins.maven3.agent.Maven33Main /home/jenkins/tools/maven/apache-maven-3.3.9 /home/jenkins/jenkins-slave/slave.jar /home/jenkins/jenkins-slave/maven33-interceptor.jar /home/jenkins/jenkins-slave/maven3-interceptor-commons.jar 37113
<===[JENKINS REMOTING CAPACITY]===> channel started
Executing Maven: -B -f <https://builds.apache.org/job/sling-org-apache-sling-feature-resolver-1.8/ws/pom.xml> -Dmaven.repo.local=/home/jenkins/jenkins-slave/maven-repositories/1 -U clean deploy
[INFO] Scanning for projects...
[INFO]
[INFO] ------------------------------------------------------------------------
[INFO] Building Apache Sling Feature Resolver 0.1.0-SNAPSHOT
[INFO] ------------------------------------------------------------------------
[INFO] Downloading: http://repository.apache.org/snapshots/org/apache/sling/org.apache.sling.feature/0.1.3-SNAPSHOT/maven-metadata.xml
[INFO] Downloaded: http://repository.apache.org/snapshots/org/apache/sling/org.apache.sling.feature/0.1.3-SNAPSHOT/maven-metadata.xml (1008 B at 2.6 KB/sec)
[INFO] Downloading: http://repository.apache.org/snapshots/org/apache/sling/org.apache.sling.feature.analyser/0.1.3-SNAPSHOT/maven-metadata.xml
[INFO] Downloaded: http://repository.apache.org/snapshots/org/apache/sling/org.apache.sling.feature.analyser/0.1.3-SNAPSHOT/maven-metadata.xml (1017 B at 3.3 KB/sec)
[INFO] Downloading: http://repository.apache.org/snapshots/org/apache/sling/org.apache.sling.feature.analyser/0.1.3-SNAPSHOT/org.apache.sling.feature.analyser-0.1.3-20180826.025737-48.pom
[INFO] Downloaded: http://repository.apache.org/snapshots/org/apache/sling/org.apache.sling.feature.analyser/0.1.3-SNAPSHOT/org.apache.sling.feature.analyser-0.1.3-20180826.025737-48.pom (7 KB at 24.3 KB/sec)
[INFO] Downloading: http://repository.apache.org/snapshots/org/apache/sling/org.apache.sling.feature.io/0.1.3-SNAPSHOT/maven-metadata.xml
[INFO] Downloaded: http://repository.apache.org/snapshots/org/apache/sling/org.apache.sling.feature.io/0.1.3-SNAPSHOT/maven-metadata.xml (1011 B at 3.2 KB/sec)
[INFO] Downloading: http://repository.apache.org/snapshots/org/apache/sling/org.apache.sling.feature.io/0.1.3-SNAPSHOT/org.apache.sling.feature.io-0.1.3-20180826.025535-37.pom
[INFO] Downloaded: http://repository.apache.org/snapshots/org/apache/sling/org.apache.sling.feature.io/0.1.3-SNAPSHOT/org.apache.sling.feature.io-0.1.3-20180826.025535-37.pom (6 KB at 18.3 KB/sec)
[INFO] Downloading: http://repository.apache.org/snapshots/org/apache/sling/org.apache.sling.feature.analyser/0.1.3-SNAPSHOT/org.apache.sling.feature.analyser-0.1.3-20180826.025737-48.jar
[INFO] Downloading: http://repository.apache.org/snapshots/org/apache/sling/org.apache.sling.feature.io/0.1.3-SNAPSHOT/org.apache.sling.feature.io-0.1.3-20180826.025535-37.jar
[INFO] Downloaded: http://repository.apache.org/snapshots/org/apache/sling/org.apache.sling.feature.io/0.1.3-SNAPSHOT/org.apache.sling.feature.io-0.1.3-20180826.025535-37.jar (103 KB at 202.7 KB/sec)
[INFO] Downloaded: http://repository.apache.org/snapshots/org/apache/sling/org.apache.sling.feature.analyser/0.1.3-SNAPSHOT/org.apache.sling.feature.analyser-0.1.3-20180826.025737-48.jar (1386 KB at 1895.9 KB/sec)
[INFO]
[INFO] --- maven-clean-plugin:3.0.0:clean (default-clean) @ org.apache.sling.feature.resolver ---
[INFO] Deleting <https://builds.apache.org/job/sling-org-apache-sling-feature-resolver-1.8/ws/target>
[INFO]
[INFO] --- maven-enforcer-plugin:3.0.0-M1:enforce (enforce-property-values) @ org.apache.sling.feature.resolver ---
[INFO]
[INFO] --- maven-enforcer-plugin:3.0.0-M1:enforce (enforce-java) @ org.apache.sling.feature.resolver ---
[INFO]
[INFO] --- maven-enforcer-plugin:3.0.0-M1:enforce (ban-maven-scr-plugin) @ org.apache.sling.feature.resolver ---
[INFO]
[INFO] --- maven-remote-resources-plugin:1.5:process (process-resource-bundles) @ org.apache.sling.feature.resolver ---
[INFO]
[INFO] --- maven-remote-resources-plugin:1.5:process (default) @ org.apache.sling.feature.resolver ---
[INFO]
[INFO] --- maven-resources-plugin:2.7:resources (default-resources) @ org.apache.sling.feature.resolver ---
[INFO] Using 'UTF-8' encoding to copy filtered resources.
[INFO] skip non existing resourceDirectory <https://builds.apache.org/job/sling-org-apache-sling-feature-resolver-1.8/ws/src/main/resources>
[INFO] Copying 3 resources
[INFO] Copying 3 resources
[INFO]
[INFO] --- maven-compiler-plugin:3.7.0:compile (default-compile) @ org.apache.sling.feature.resolver ---
[INFO] Changes detected - recompiling the module!
[INFO] Compiling 11 source files to <https://builds.apache.org/job/sling-org-apache-sling-feature-resolver-1.8/ws/target/classes>
[INFO] -------------------------------------------------------------
[ERROR] COMPILATION ERROR :
[INFO] -------------------------------------------------------------
[ERROR] <https://builds.apache.org/job/sling-org-apache-sling-feature-resolver-1.8/ws/src/main/java/org/apache/sling/feature/resolver/ApplicationResolverAssembler.java>:[19,32] cannot find symbol
symbol: class Application
location: package org.apache.sling.feature
[ERROR] <https://builds.apache.org/job/sling-org-apache-sling-feature-resolver-1.8/ws/src/main/java/org/apache/sling/feature/resolver/ApplicationResolverAssembler.java>:[22,40] cannot find symbol
symbol: class ApplicationBuilder
location: package org.apache.sling.feature.builder
[ERROR] <https://builds.apache.org/job/sling-org-apache-sling-feature-resolver-1.8/ws/src/main/java/org/apache/sling/feature/resolver/ApplicationResolverAssembler.java>:[29,58] cannot find symbol
symbol: class SubstituteVariables
location: class org.apache.sling.feature.io.json.FeatureJSONReader
[ERROR] <https://builds.apache.org/job/sling-org-apache-sling-feature-resolver-1.8/ws/src/main/java/org/apache/sling/feature/resolver/ApplicationResolverAssembler.java>:[50,13] cannot find symbol
symbol: class Application
location: class org.apache.sling.feature.resolver.ApplicationResolverAssembler
[ERROR] <https://builds.apache.org/job/sling-org-apache-sling-feature-resolver-1.8/ws/src/main/java/org/apache/sling/feature/resolver/ApplicationResolverAssembler.java>:[49,19] cannot find symbol
symbol: class Application
location: class org.apache.sling.feature.resolver.ApplicationResolverAssembler
[ERROR] <https://builds.apache.org/job/sling-org-apache-sling-feature-resolver-1.8/ws/src/main/java/org/apache/sling/feature/resolver/ApplicationResolverAssembler.java>:[95,13] cannot find symbol
symbol: class Application
location: class org.apache.sling.feature.resolver.ApplicationResolverAssembler
[ERROR] <https://builds.apache.org/job/sling-org-apache-sling-feature-resolver-1.8/ws/src/main/java/org/apache/sling/feature/resolver/ApplicationResolverAssembler.java>:[94,19] cannot find symbol
symbol: class Application
location: class org.apache.sling.feature.resolver.ApplicationResolverAssembler
[ERROR] <https://builds.apache.org/job/sling-org-apache-sling-feature-resolver-1.8/ws/src/main/java/org/apache/sling/feature/resolver/ApplicationResolverAssembler.java>:[58,81] cannot find symbol
symbol: variable SubstituteVariables
location: class org.apache.sling.feature.resolver.ApplicationResolverAssembler
[ERROR] <https://builds.apache.org/job/sling-org-apache-sling-feature-resolver-1.8/ws/src/main/java/org/apache/sling/feature/resolver/ApplicationResolverAssembler.java>:[111,87] cannot find symbol
symbol: variable SubstituteVariables
[ERROR] <https://builds.apache.org/job/sling-org-apache-sling-feature-resolver-1.8/ws/src/main/java/org/apache/sling/feature/resolver/ApplicationResolverAssembler.java>:[104,15] cannot find symbol
symbol: variable ApplicationBuilder
location: class org.apache.sling.feature.resolver.ApplicationResolverAssembler
[INFO] 10 errors
[INFO] -------------------------------------------------------------
[WARNING] Attempt to (de-)serialize anonymous class hudson.maven.reporters.MavenArtifactArchiver$2; see: https://jenkins.io/redirect/serialization-of-anonymous-classes/
[JENKINS] Archiving disabled
[WARNING] Attempt to (de-)serialize anonymous class hudson.maven.reporters.MavenFingerprinter$1; see: https://jenkins.io/redirect/serialization-of-anonymous-classes/
[JENKINS] Archiving disabled
[INFO] ------------------------------------------------------------------------
[INFO] BUILD FAILURE
[INFO] ------------------------------------------------------------------------
[INFO] Total time: 17.280 s
[INFO] Finished at: 2018-08-26T02:58:39+00:00
[INFO] Final Memory: 48M/3925M
[INFO] ------------------------------------------------------------------------
Waiting for Jenkins to finish collecting data
[ERROR] Failed to execute goal org.apache.maven.plugins:maven-compiler-plugin:3.7.0:compile (default-compile) on project org.apache.sling.feature.resolver: Compilation failure: Compilation failure:
[ERROR] <https://builds.apache.org/job/sling-org-apache-sling-feature-resolver-1.8/ws/src/main/java/org/apache/sling/feature/resolver/ApplicationResolverAssembler.java>:[19,32] cannot find symbol
[ERROR] symbol: class Application
[ERROR] location: package org.apache.sling.feature
[ERROR] <https://builds.apache.org/job/sling-org-apache-sling-feature-resolver-1.8/ws/src/main/java/org/apache/sling/feature/resolver/ApplicationResolverAssembler.java>:[22,40] cannot find symbol
[ERROR] symbol: class ApplicationBuilder
[ERROR] location: package org.apache.sling.feature.builder
[ERROR] <https://builds.apache.org/job/sling-org-apache-sling-feature-resolver-1.8/ws/src/main/java/org/apache/sling/feature/resolver/ApplicationResolverAssembler.java>:[29,58] cannot find symbol
[ERROR] symbol: class SubstituteVariables
[ERROR] location: class org.apache.sling.feature.io.json.FeatureJSONReader
[ERROR] <https://builds.apache.org/job/sling-org-apache-sling-feature-resolver-1.8/ws/src/main/java/org/apache/sling/feature/resolver/ApplicationResolverAssembler.java>:[50,13] cannot find symbol
[ERROR] symbol: class Application
[ERROR] location: class org.apache.sling.feature.resolver.ApplicationResolverAssembler
[ERROR] <https://builds.apache.org/job/sling-org-apache-sling-feature-resolver-1.8/ws/src/main/java/org/apache/sling/feature/resolver/ApplicationResolverAssembler.java>:[49,19] cannot find symbol
[ERROR] symbol: class Application
[ERROR] location: class org.apache.sling.feature.resolver.ApplicationResolverAssembler
[ERROR] <https://builds.apache.org/job/sling-org-apache-sling-feature-resolver-1.8/ws/src/main/java/org/apache/sling/feature/resolver/ApplicationResolverAssembler.java>:[95,13] cannot find symbol
[ERROR] symbol: class Application
[ERROR] location: class org.apache.sling.feature.resolver.ApplicationResolverAssembler
[ERROR] <https://builds.apache.org/job/sling-org-apache-sling-feature-resolver-1.8/ws/src/main/java/org/apache/sling/feature/resolver/ApplicationResolverAssembler.java>:[94,19] cannot find symbol
[ERROR] symbol: class Application
[ERROR] location: class org.apache.sling.feature.resolver.ApplicationResolverAssembler
[ERROR] <https://builds.apache.org/job/sling-org-apache-sling-feature-resolver-1.8/ws/src/main/java/org/apache/sling/feature/resolver/ApplicationResolverAssembler.java>:[58,81] cannot find symbol
[ERROR] symbol: variable SubstituteVariables
[ERROR] location: class org.apache.sling.feature.resolver.ApplicationResolverAssembler
[ERROR] <https://builds.apache.org/job/sling-org-apache-sling-feature-resolver-1.8/ws/src/main/java/org/apache/sling/feature/resolver/ApplicationResolverAssembler.java>:[111,87] cannot find symbol
[ERROR] symbol: variable SubstituteVariables
[ERROR] <https://builds.apache.org/job/sling-org-apache-sling-feature-resolver-1.8/ws/src/main/java/org/apache/sling/feature/resolver/ApplicationResolverAssembler.java>:[104,15] cannot find symbol
[ERROR] symbol: variable ApplicationBuilder
[ERROR] location: class org.apache.sling.feature.resolver.ApplicationResolverAssembler
[ERROR] -> [Help 1]
[ERROR]
[ERROR] To see the full stack trace of the errors, re-run Maven with the -e switch.
[ERROR] Re-run Maven using the -X switch to enable full debug logging.
[ERROR]
[ERROR] For more information about the errors and possible solutions, please read the following articles:
[ERROR] [Help 1] http://cwiki.apache.org/confluence/display/MAVEN/MojoFailureException
channel stopped
Recording test results
Build failed in Jenkins:
sling-org-apache-sling-feature-resolver-1.8 #62
Posted by Apache Jenkins Server <je...@builds.apache.org>.
See <https://builds.apache.org/job/sling-org-apache-sling-feature-resolver-1.8/62/display/redirect>
------------------------------------------
Started by upstream project "sling-org-apache-sling-feature-analyser-1.8" build number 58
originally caused by:
Started by timer
[EnvInject] - Loading node environment variables.
Building remotely on H20 (ubuntu xenial) in workspace <https://builds.apache.org/job/sling-org-apache-sling-feature-resolver-1.8/ws/>
> git rev-parse --is-inside-work-tree # timeout=10
Fetching changes from the remote Git repository
> git config remote.origin.url https://github.com/apache/sling-org-apache-sling-feature-resolver.git # timeout=10
Fetching upstream changes from https://github.com/apache/sling-org-apache-sling-feature-resolver.git
> git --version # timeout=10
> git fetch --tags --progress https://github.com/apache/sling-org-apache-sling-feature-resolver.git +refs/heads/*:refs/remotes/origin/*
> git rev-parse origin/master^{commit} # timeout=10
Checking out Revision f52d6465fa38070398787727e1a5ea9de69d8b8d (origin/master)
> git config core.sparsecheckout # timeout=10
> git checkout -f f52d6465fa38070398787727e1a5ea9de69d8b8d
Commit message: "Update to Configurator 1.0.4"
> git rev-list --no-walk f52d6465fa38070398787727e1a5ea9de69d8b8d # timeout=10
Parsing POMs
Established TCP socket on 44313
maven33-agent.jar already up to date
maven33-interceptor.jar already up to date
maven3-interceptor-commons.jar already up to date
[sling-org-apache-sling-feature-resolver-1.8] $ /home/jenkins/tools/java/latest1.8/bin/java -Xmx4g -Xms4g -cp /home/jenkins/jenkins-slave/maven33-agent.jar:/home/jenkins/tools/maven/apache-maven-3.3.9/boot/plexus-classworlds-2.5.2.jar:/home/jenkins/tools/maven/apache-maven-3.3.9/conf/logging jenkins.maven3.agent.Maven33Main /home/jenkins/tools/maven/apache-maven-3.3.9 /home/jenkins/jenkins-slave/slave.jar /home/jenkins/jenkins-slave/maven33-interceptor.jar /home/jenkins/jenkins-slave/maven3-interceptor-commons.jar 44313
<===[JENKINS REMOTING CAPACITY]===> channel started
Executing Maven: -B -f <https://builds.apache.org/job/sling-org-apache-sling-feature-resolver-1.8/ws/pom.xml> -Dmaven.repo.local=/home/jenkins/jenkins-slave/maven-repositories/0 -U clean deploy
[INFO] Scanning for projects...
[INFO]
[INFO] ------------------------------------------------------------------------
[INFO] Building Apache Sling Feature Resolver 0.1.0-SNAPSHOT
[INFO] ------------------------------------------------------------------------
[INFO] Downloading: http://repository.apache.org/snapshots/org/apache/sling/org.apache.sling.feature/0.1.3-SNAPSHOT/maven-metadata.xml
[INFO] Downloaded: http://repository.apache.org/snapshots/org/apache/sling/org.apache.sling.feature/0.1.3-SNAPSHOT/maven-metadata.xml (1008 B at 2.6 KB/sec)
[INFO] Downloading: http://repository.apache.org/snapshots/org/apache/sling/org.apache.sling.feature/0.1.3-SNAPSHOT/org.apache.sling.feature-0.1.3-20180823.154637-26.pom
[INFO] Downloaded: http://repository.apache.org/snapshots/org/apache/sling/org.apache.sling.feature/0.1.3-SNAPSHOT/org.apache.sling.feature-0.1.3-20180823.154637-26.pom (5 KB at 13.4 KB/sec)
[INFO] Downloading: http://repository.apache.org/snapshots/org/apache/sling/org.apache.sling.feature.analyser/0.1.3-SNAPSHOT/maven-metadata.xml
[INFO] Downloaded: http://repository.apache.org/snapshots/org/apache/sling/org.apache.sling.feature.analyser/0.1.3-SNAPSHOT/maven-metadata.xml (1017 B at 3.1 KB/sec)
[INFO] Downloading: http://repository.apache.org/snapshots/org/apache/sling/org.apache.sling.feature.analyser/0.1.3-SNAPSHOT/org.apache.sling.feature.analyser-0.1.3-20180824.003522-47.pom
[INFO] Downloaded: http://repository.apache.org/snapshots/org/apache/sling/org.apache.sling.feature.analyser/0.1.3-SNAPSHOT/org.apache.sling.feature.analyser-0.1.3-20180824.003522-47.pom (7 KB at 23.6 KB/sec)
[INFO] Downloading: http://repository.apache.org/snapshots/org/apache/sling/org.apache.sling.feature.io/0.1.3-SNAPSHOT/maven-metadata.xml
[INFO] Downloaded: http://repository.apache.org/snapshots/org/apache/sling/org.apache.sling.feature.io/0.1.3-SNAPSHOT/maven-metadata.xml (1011 B at 3.3 KB/sec)
[INFO] Downloading: http://repository.apache.org/snapshots/org/apache/sling/org.apache.sling.feature.io/0.1.3-SNAPSHOT/org.apache.sling.feature.io-0.1.3-20180823.154843-36.pom
[INFO] Downloaded: http://repository.apache.org/snapshots/org/apache/sling/org.apache.sling.feature.io/0.1.3-SNAPSHOT/org.apache.sling.feature.io-0.1.3-20180823.154843-36.pom (6 KB at 17.8 KB/sec)
[INFO] Downloading: https://repo.maven.apache.org/maven2/org/apache/felix/org.apache.felix.configurator/1.0.4/org.apache.felix.configurator-1.0.4.pom
[INFO] Downloaded: https://repo.maven.apache.org/maven2/org/apache/felix/org.apache.felix.configurator/1.0.4/org.apache.felix.configurator-1.0.4.pom (7 KB at 26.3 KB/sec)
[INFO] Downloading: http://repository.apache.org/snapshots/org/apache/sling/org.apache.sling.feature/0.1.3-SNAPSHOT/org.apache.sling.feature-0.1.3-20180823.154637-26.jar
[INFO] Downloading: http://repository.apache.org/snapshots/org/apache/sling/org.apache.sling.feature.analyser/0.1.3-SNAPSHOT/org.apache.sling.feature.analyser-0.1.3-20180824.003522-47.jar
[INFO] Downloading: http://repository.apache.org/snapshots/org/apache/sling/org.apache.sling.feature.io/0.1.3-SNAPSHOT/org.apache.sling.feature.io-0.1.3-20180823.154843-36.jar
[INFO] Downloaded: http://repository.apache.org/snapshots/org/apache/sling/org.apache.sling.feature/0.1.3-SNAPSHOT/org.apache.sling.feature-0.1.3-20180823.154637-26.jar (103 KB at 201.4 KB/sec)
[INFO] Downloaded: http://repository.apache.org/snapshots/org/apache/sling/org.apache.sling.feature.io/0.1.3-SNAPSHOT/org.apache.sling.feature.io-0.1.3-20180823.154843-36.jar (103 KB at 199.6 KB/sec)
[INFO] Downloaded: http://repository.apache.org/snapshots/org/apache/sling/org.apache.sling.feature.analyser/0.1.3-SNAPSHOT/org.apache.sling.feature.analyser-0.1.3-20180824.003522-47.jar (1386 KB at 1941.1 KB/sec)
[INFO] Downloading: https://repo.maven.apache.org/maven2/org/apache/felix/org.apache.felix.configurator/1.0.4/org.apache.felix.configurator-1.0.4.jar
[INFO] Downloaded: https://repo.maven.apache.org/maven2/org/apache/felix/org.apache.felix.configurator/1.0.4/org.apache.felix.configurator-1.0.4.jar (283 KB at 3282.2 KB/sec)
[INFO]
[INFO] --- maven-clean-plugin:3.0.0:clean (default-clean) @ org.apache.sling.feature.resolver ---
[INFO] Deleting <https://builds.apache.org/job/sling-org-apache-sling-feature-resolver-1.8/ws/target>
[INFO]
[INFO] --- maven-enforcer-plugin:3.0.0-M1:enforce (enforce-property-values) @ org.apache.sling.feature.resolver ---
[INFO]
[INFO] --- maven-enforcer-plugin:3.0.0-M1:enforce (enforce-java) @ org.apache.sling.feature.resolver ---
[INFO]
[INFO] --- maven-enforcer-plugin:3.0.0-M1:enforce (ban-maven-scr-plugin) @ org.apache.sling.feature.resolver ---
[INFO]
[INFO] --- maven-remote-resources-plugin:1.5:process (process-resource-bundles) @ org.apache.sling.feature.resolver ---
[INFO]
[INFO] --- maven-remote-resources-plugin:1.5:process (default) @ org.apache.sling.feature.resolver ---
[INFO]
[INFO] --- maven-resources-plugin:2.7:resources (default-resources) @ org.apache.sling.feature.resolver ---
[INFO] Using 'UTF-8' encoding to copy filtered resources.
[INFO] skip non existing resourceDirectory <https://builds.apache.org/job/sling-org-apache-sling-feature-resolver-1.8/ws/src/main/resources>
[INFO] Copying 3 resources
[INFO] Copying 3 resources
[INFO]
[INFO] --- maven-compiler-plugin:3.7.0:compile (default-compile) @ org.apache.sling.feature.resolver ---
[INFO] Changes detected - recompiling the module!
[INFO] Compiling 11 source files to <https://builds.apache.org/job/sling-org-apache-sling-feature-resolver-1.8/ws/target/classes>
[INFO] -------------------------------------------------------------
[ERROR] COMPILATION ERROR :
[INFO] -------------------------------------------------------------
[ERROR] <https://builds.apache.org/job/sling-org-apache-sling-feature-resolver-1.8/ws/src/main/java/org/apache/sling/feature/resolver/ApplicationResolverAssembler.java>:[19,32] cannot find symbol
symbol: class Application
location: package org.apache.sling.feature
[ERROR] <https://builds.apache.org/job/sling-org-apache-sling-feature-resolver-1.8/ws/src/main/java/org/apache/sling/feature/resolver/ApplicationResolverAssembler.java>:[22,40] cannot find symbol
symbol: class ApplicationBuilder
location: package org.apache.sling.feature.builder
[ERROR] <https://builds.apache.org/job/sling-org-apache-sling-feature-resolver-1.8/ws/src/main/java/org/apache/sling/feature/resolver/ApplicationResolverAssembler.java>:[29,58] cannot find symbol
symbol: class SubstituteVariables
location: class org.apache.sling.feature.io.json.FeatureJSONReader
[ERROR] <https://builds.apache.org/job/sling-org-apache-sling-feature-resolver-1.8/ws/src/main/java/org/apache/sling/feature/resolver/ApplicationResolverAssembler.java>:[50,13] cannot find symbol
symbol: class Application
location: class org.apache.sling.feature.resolver.ApplicationResolverAssembler
[ERROR] <https://builds.apache.org/job/sling-org-apache-sling-feature-resolver-1.8/ws/src/main/java/org/apache/sling/feature/resolver/ApplicationResolverAssembler.java>:[49,19] cannot find symbol
symbol: class Application
location: class org.apache.sling.feature.resolver.ApplicationResolverAssembler
[ERROR] <https://builds.apache.org/job/sling-org-apache-sling-feature-resolver-1.8/ws/src/main/java/org/apache/sling/feature/resolver/ApplicationResolverAssembler.java>:[95,13] cannot find symbol
symbol: class Application
location: class org.apache.sling.feature.resolver.ApplicationResolverAssembler
[ERROR] <https://builds.apache.org/job/sling-org-apache-sling-feature-resolver-1.8/ws/src/main/java/org/apache/sling/feature/resolver/ApplicationResolverAssembler.java>:[94,19] cannot find symbol
symbol: class Application
location: class org.apache.sling.feature.resolver.ApplicationResolverAssembler
[ERROR] <https://builds.apache.org/job/sling-org-apache-sling-feature-resolver-1.8/ws/src/main/java/org/apache/sling/feature/resolver/ApplicationResolverAssembler.java>:[58,81] cannot find symbol
symbol: variable SubstituteVariables
location: class org.apache.sling.feature.resolver.ApplicationResolverAssembler
[ERROR] <https://builds.apache.org/job/sling-org-apache-sling-feature-resolver-1.8/ws/src/main/java/org/apache/sling/feature/resolver/ApplicationResolverAssembler.java>:[111,87] cannot find symbol
symbol: variable SubstituteVariables
[ERROR] <https://builds.apache.org/job/sling-org-apache-sling-feature-resolver-1.8/ws/src/main/java/org/apache/sling/feature/resolver/ApplicationResolverAssembler.java>:[104,15] cannot find symbol
symbol: variable ApplicationBuilder
location: class org.apache.sling.feature.resolver.ApplicationResolverAssembler
[INFO] 10 errors
[INFO] -------------------------------------------------------------
[WARNING] Attempt to (de-)serialize anonymous class hudson.maven.reporters.MavenArtifactArchiver$2; see: https://jenkins.io/redirect/serialization-of-anonymous-classes/
[JENKINS] Archiving disabled
[WARNING] Attempt to (de-)serialize anonymous class hudson.maven.reporters.MavenFingerprinter$1; see: https://jenkins.io/redirect/serialization-of-anonymous-classes/
[JENKINS] Archiving disabled
[INFO] ------------------------------------------------------------------------
[INFO] BUILD FAILURE
[INFO] ------------------------------------------------------------------------
[INFO] Total time: 18.548 s
[INFO] Finished at: 2018-08-24T00:36:29+00:00
[INFO] Final Memory: 49M/3925M
[INFO] ------------------------------------------------------------------------
Waiting for Jenkins to finish collecting data
[ERROR] Failed to execute goal org.apache.maven.plugins:maven-compiler-plugin:3.7.0:compile (default-compile) on project org.apache.sling.feature.resolver: Compilation failure: Compilation failure:
[ERROR] <https://builds.apache.org/job/sling-org-apache-sling-feature-resolver-1.8/ws/src/main/java/org/apache/sling/feature/resolver/ApplicationResolverAssembler.java>:[19,32] cannot find symbol
[ERROR] symbol: class Application
[ERROR] location: package org.apache.sling.feature
[ERROR] <https://builds.apache.org/job/sling-org-apache-sling-feature-resolver-1.8/ws/src/main/java/org/apache/sling/feature/resolver/ApplicationResolverAssembler.java>:[22,40] cannot find symbol
[ERROR] symbol: class ApplicationBuilder
[ERROR] location: package org.apache.sling.feature.builder
[ERROR] <https://builds.apache.org/job/sling-org-apache-sling-feature-resolver-1.8/ws/src/main/java/org/apache/sling/feature/resolver/ApplicationResolverAssembler.java>:[29,58] cannot find symbol
[ERROR] symbol: class SubstituteVariables
[ERROR] location: class org.apache.sling.feature.io.json.FeatureJSONReader
[ERROR] <https://builds.apache.org/job/sling-org-apache-sling-feature-resolver-1.8/ws/src/main/java/org/apache/sling/feature/resolver/ApplicationResolverAssembler.java>:[50,13] cannot find symbol
[ERROR] symbol: class Application
[ERROR] location: class org.apache.sling.feature.resolver.ApplicationResolverAssembler
[ERROR] <https://builds.apache.org/job/sling-org-apache-sling-feature-resolver-1.8/ws/src/main/java/org/apache/sling/feature/resolver/ApplicationResolverAssembler.java>:[49,19] cannot find symbol
[ERROR] symbol: class Application
[ERROR] location: class org.apache.sling.feature.resolver.ApplicationResolverAssembler
[ERROR] <https://builds.apache.org/job/sling-org-apache-sling-feature-resolver-1.8/ws/src/main/java/org/apache/sling/feature/resolver/ApplicationResolverAssembler.java>:[95,13] cannot find symbol
[ERROR] symbol: class Application
[ERROR] location: class org.apache.sling.feature.resolver.ApplicationResolverAssembler
[ERROR] <https://builds.apache.org/job/sling-org-apache-sling-feature-resolver-1.8/ws/src/main/java/org/apache/sling/feature/resolver/ApplicationResolverAssembler.java>:[94,19] cannot find symbol
[ERROR] symbol: class Application
[ERROR] location: class org.apache.sling.feature.resolver.ApplicationResolverAssembler
[ERROR] <https://builds.apache.org/job/sling-org-apache-sling-feature-resolver-1.8/ws/src/main/java/org/apache/sling/feature/resolver/ApplicationResolverAssembler.java>:[58,81] cannot find symbol
[ERROR] symbol: variable SubstituteVariables
[ERROR] location: class org.apache.sling.feature.resolver.ApplicationResolverAssembler
[ERROR] <https://builds.apache.org/job/sling-org-apache-sling-feature-resolver-1.8/ws/src/main/java/org/apache/sling/feature/resolver/ApplicationResolverAssembler.java>:[111,87] cannot find symbol
[ERROR] symbol: variable SubstituteVariables
[ERROR] <https://builds.apache.org/job/sling-org-apache-sling-feature-resolver-1.8/ws/src/main/java/org/apache/sling/feature/resolver/ApplicationResolverAssembler.java>:[104,15] cannot find symbol
[ERROR] symbol: variable ApplicationBuilder
[ERROR] location: class org.apache.sling.feature.resolver.ApplicationResolverAssembler
[ERROR] -> [Help 1]
[ERROR]
[ERROR] To see the full stack trace of the errors, re-run Maven with the -e switch.
[ERROR] Re-run Maven using the -X switch to enable full debug logging.
[ERROR]
[ERROR] For more information about the errors and possible solutions, please read the following articles:
[ERROR] [Help 1] http://cwiki.apache.org/confluence/display/MAVEN/MojoFailureException
channel stopped
Recording test results
Build failed in Jenkins:
sling-org-apache-sling-feature-resolver-1.8 #61
Posted by Apache Jenkins Server <je...@builds.apache.org>.
See <https://builds.apache.org/job/sling-org-apache-sling-feature-resolver-1.8/61/display/redirect>
------------------------------------------
Started by upstream project "sling-org-apache-sling-feature-analyser-1.8" build number 57
originally caused by:
Started by upstream project "sling-org-apache-sling-feature-io-1.8" build number 43
originally caused by:
Started by upstream project "sling-org-apache-sling-feature-1.8" build number 31
originally caused by:
Started by timer
[EnvInject] - Loading node environment variables.
Building remotely on H27 (ubuntu xenial) in workspace <https://builds.apache.org/job/sling-org-apache-sling-feature-resolver-1.8/ws/>
> git rev-parse --is-inside-work-tree # timeout=10
Fetching changes from the remote Git repository
> git config remote.origin.url https://github.com/apache/sling-org-apache-sling-feature-resolver.git # timeout=10
Fetching upstream changes from https://github.com/apache/sling-org-apache-sling-feature-resolver.git
> git --version # timeout=10
> git fetch --tags --progress https://github.com/apache/sling-org-apache-sling-feature-resolver.git +refs/heads/*:refs/remotes/origin/*
> git rev-parse origin/master^{commit} # timeout=10
Checking out Revision f52d6465fa38070398787727e1a5ea9de69d8b8d (origin/master)
> git config core.sparsecheckout # timeout=10
> git checkout -f f52d6465fa38070398787727e1a5ea9de69d8b8d
Commit message: "Update to Configurator 1.0.4"
> git rev-list --no-walk f52d6465fa38070398787727e1a5ea9de69d8b8d # timeout=10
Parsing POMs
Established TCP socket on 39743
maven33-agent.jar already up to date
maven33-interceptor.jar already up to date
maven3-interceptor-commons.jar already up to date
[sling-org-apache-sling-feature-resolver-1.8] $ /home/jenkins/tools/java/latest1.8/bin/java -Xmx4g -Xms4g -cp /home/jenkins/jenkins-slave/maven33-agent.jar:/home/jenkins/tools/maven/apache-maven-3.3.9/boot/plexus-classworlds-2.5.2.jar:/home/jenkins/tools/maven/apache-maven-3.3.9/conf/logging jenkins.maven3.agent.Maven33Main /home/jenkins/tools/maven/apache-maven-3.3.9 /home/jenkins/jenkins-slave/slave.jar /home/jenkins/jenkins-slave/maven33-interceptor.jar /home/jenkins/jenkins-slave/maven3-interceptor-commons.jar 39743
<===[JENKINS REMOTING CAPACITY]===> channel started
Executing Maven: -B -f <https://builds.apache.org/job/sling-org-apache-sling-feature-resolver-1.8/ws/pom.xml> -Dmaven.repo.local=/home/jenkins/jenkins-slave/maven-repositories/1 -U clean deploy
[INFO] Scanning for projects...
[INFO]
[INFO] ------------------------------------------------------------------------
[INFO] Building Apache Sling Feature Resolver 0.1.0-SNAPSHOT
[INFO] ------------------------------------------------------------------------
[INFO] Downloading: http://repository.apache.org/snapshots/org/apache/sling/org.apache.sling.feature/0.1.3-SNAPSHOT/maven-metadata.xml
[INFO] Downloaded: http://repository.apache.org/snapshots/org/apache/sling/org.apache.sling.feature/0.1.3-SNAPSHOT/maven-metadata.xml (1008 B at 2.4 KB/sec)
[INFO] Downloading: http://repository.apache.org/snapshots/org/apache/sling/org.apache.sling.feature/0.1.3-SNAPSHOT/org.apache.sling.feature-0.1.3-20180823.154637-26.pom
[INFO] Downloaded: http://repository.apache.org/snapshots/org/apache/sling/org.apache.sling.feature/0.1.3-SNAPSHOT/org.apache.sling.feature-0.1.3-20180823.154637-26.pom (5 KB at 14.2 KB/sec)
[INFO] Downloading: http://repository.apache.org/snapshots/org/apache/sling/org.apache.sling.feature.analyser/0.1.3-SNAPSHOT/maven-metadata.xml
[INFO] Downloaded: http://repository.apache.org/snapshots/org/apache/sling/org.apache.sling.feature.analyser/0.1.3-SNAPSHOT/maven-metadata.xml (1017 B at 3.2 KB/sec)
[INFO] Downloading: http://repository.apache.org/snapshots/org/apache/sling/org.apache.sling.feature.analyser/0.1.3-SNAPSHOT/org.apache.sling.feature.analyser-0.1.3-20180823.155045-46.pom
[INFO] Downloaded: http://repository.apache.org/snapshots/org/apache/sling/org.apache.sling.feature.analyser/0.1.3-SNAPSHOT/org.apache.sling.feature.analyser-0.1.3-20180823.155045-46.pom (7 KB at 23.4 KB/sec)
[INFO] Downloading: http://repository.apache.org/snapshots/org/apache/sling/org.apache.sling.feature.io/0.1.3-SNAPSHOT/maven-metadata.xml
[INFO] Downloaded: http://repository.apache.org/snapshots/org/apache/sling/org.apache.sling.feature.io/0.1.3-SNAPSHOT/maven-metadata.xml (1011 B at 3.3 KB/sec)
[INFO] Downloading: http://repository.apache.org/snapshots/org/apache/sling/org.apache.sling.feature.io/0.1.3-SNAPSHOT/org.apache.sling.feature.io-0.1.3-20180823.154843-36.pom
[INFO] Downloaded: http://repository.apache.org/snapshots/org/apache/sling/org.apache.sling.feature.io/0.1.3-SNAPSHOT/org.apache.sling.feature.io-0.1.3-20180823.154843-36.pom (6 KB at 18.2 KB/sec)
[INFO] Downloading: http://repository.apache.org/snapshots/org/apache/sling/org.apache.sling.feature/0.1.3-SNAPSHOT/org.apache.sling.feature-0.1.3-20180823.154637-26.jar
[INFO] Downloading: http://repository.apache.org/snapshots/org/apache/sling/org.apache.sling.feature.analyser/0.1.3-SNAPSHOT/org.apache.sling.feature.analyser-0.1.3-20180823.155045-46.jar
[INFO] Downloading: http://repository.apache.org/snapshots/org/apache/sling/org.apache.sling.feature.io/0.1.3-SNAPSHOT/org.apache.sling.feature.io-0.1.3-20180823.154843-36.jar
[INFO] Downloaded: http://repository.apache.org/snapshots/org/apache/sling/org.apache.sling.feature.io/0.1.3-SNAPSHOT/org.apache.sling.feature.io-0.1.3-20180823.154843-36.jar (103 KB at 208.9 KB/sec)
[INFO] Downloaded: http://repository.apache.org/snapshots/org/apache/sling/org.apache.sling.feature/0.1.3-SNAPSHOT/org.apache.sling.feature-0.1.3-20180823.154637-26.jar (103 KB at 199.8 KB/sec)
[INFO] Downloaded: http://repository.apache.org/snapshots/org/apache/sling/org.apache.sling.feature.analyser/0.1.3-SNAPSHOT/org.apache.sling.feature.analyser-0.1.3-20180823.155045-46.jar (1386 KB at 1749.9 KB/sec)
[INFO]
[INFO] --- maven-clean-plugin:3.0.0:clean (default-clean) @ org.apache.sling.feature.resolver ---
[INFO] Deleting <https://builds.apache.org/job/sling-org-apache-sling-feature-resolver-1.8/ws/target>
[INFO]
[INFO] --- maven-enforcer-plugin:3.0.0-M1:enforce (enforce-property-values) @ org.apache.sling.feature.resolver ---
[INFO]
[INFO] --- maven-enforcer-plugin:3.0.0-M1:enforce (enforce-java) @ org.apache.sling.feature.resolver ---
[INFO]
[INFO] --- maven-enforcer-plugin:3.0.0-M1:enforce (ban-maven-scr-plugin) @ org.apache.sling.feature.resolver ---
[INFO]
[INFO] --- maven-remote-resources-plugin:1.5:process (process-resource-bundles) @ org.apache.sling.feature.resolver ---
[INFO]
[INFO] --- maven-remote-resources-plugin:1.5:process (default) @ org.apache.sling.feature.resolver ---
[INFO]
[INFO] --- maven-resources-plugin:2.7:resources (default-resources) @ org.apache.sling.feature.resolver ---
[INFO] Using 'UTF-8' encoding to copy filtered resources.
[INFO] skip non existing resourceDirectory <https://builds.apache.org/job/sling-org-apache-sling-feature-resolver-1.8/ws/src/main/resources>
[INFO] Copying 3 resources
[INFO] Copying 3 resources
[INFO]
[INFO] --- maven-compiler-plugin:3.7.0:compile (default-compile) @ org.apache.sling.feature.resolver ---
[INFO] Changes detected - recompiling the module!
[INFO] Compiling 11 source files to <https://builds.apache.org/job/sling-org-apache-sling-feature-resolver-1.8/ws/target/classes>
[INFO] -------------------------------------------------------------
[ERROR] COMPILATION ERROR :
[INFO] -------------------------------------------------------------
[ERROR] <https://builds.apache.org/job/sling-org-apache-sling-feature-resolver-1.8/ws/src/main/java/org/apache/sling/feature/resolver/ApplicationResolverAssembler.java>:[19,32] cannot find symbol
symbol: class Application
location: package org.apache.sling.feature
[ERROR] <https://builds.apache.org/job/sling-org-apache-sling-feature-resolver-1.8/ws/src/main/java/org/apache/sling/feature/resolver/ApplicationResolverAssembler.java>:[22,40] cannot find symbol
symbol: class ApplicationBuilder
location: package org.apache.sling.feature.builder
[ERROR] <https://builds.apache.org/job/sling-org-apache-sling-feature-resolver-1.8/ws/src/main/java/org/apache/sling/feature/resolver/ApplicationResolverAssembler.java>:[29,58] cannot find symbol
symbol: class SubstituteVariables
location: class org.apache.sling.feature.io.json.FeatureJSONReader
[ERROR] <https://builds.apache.org/job/sling-org-apache-sling-feature-resolver-1.8/ws/src/main/java/org/apache/sling/feature/resolver/ApplicationResolverAssembler.java>:[50,13] cannot find symbol
symbol: class Application
location: class org.apache.sling.feature.resolver.ApplicationResolverAssembler
[ERROR] <https://builds.apache.org/job/sling-org-apache-sling-feature-resolver-1.8/ws/src/main/java/org/apache/sling/feature/resolver/ApplicationResolverAssembler.java>:[49,19] cannot find symbol
symbol: class Application
location: class org.apache.sling.feature.resolver.ApplicationResolverAssembler
[ERROR] <https://builds.apache.org/job/sling-org-apache-sling-feature-resolver-1.8/ws/src/main/java/org/apache/sling/feature/resolver/ApplicationResolverAssembler.java>:[95,13] cannot find symbol
symbol: class Application
location: class org.apache.sling.feature.resolver.ApplicationResolverAssembler
[ERROR] <https://builds.apache.org/job/sling-org-apache-sling-feature-resolver-1.8/ws/src/main/java/org/apache/sling/feature/resolver/ApplicationResolverAssembler.java>:[94,19] cannot find symbol
symbol: class Application
location: class org.apache.sling.feature.resolver.ApplicationResolverAssembler
[ERROR] <https://builds.apache.org/job/sling-org-apache-sling-feature-resolver-1.8/ws/src/main/java/org/apache/sling/feature/resolver/ApplicationResolverAssembler.java>:[58,81] cannot find symbol
symbol: variable SubstituteVariables
location: class org.apache.sling.feature.resolver.ApplicationResolverAssembler
[ERROR] <https://builds.apache.org/job/sling-org-apache-sling-feature-resolver-1.8/ws/src/main/java/org/apache/sling/feature/resolver/ApplicationResolverAssembler.java>:[111,87] cannot find symbol
symbol: variable SubstituteVariables
[ERROR] <https://builds.apache.org/job/sling-org-apache-sling-feature-resolver-1.8/ws/src/main/java/org/apache/sling/feature/resolver/ApplicationResolverAssembler.java>:[104,15] cannot find symbol
symbol: variable ApplicationBuilder
location: class org.apache.sling.feature.resolver.ApplicationResolverAssembler
[INFO] 10 errors
[INFO] -------------------------------------------------------------
[WARNING] Attempt to (de-)serialize anonymous class hudson.maven.reporters.MavenArtifactArchiver$2; see: https://jenkins.io/redirect/serialization-of-anonymous-classes/
[JENKINS] Archiving disabled
[WARNING] Attempt to (de-)serialize anonymous class hudson.maven.reporters.MavenFingerprinter$1; see: https://jenkins.io/redirect/serialization-of-anonymous-classes/
[JENKINS] Archiving disabled
[INFO] ------------------------------------------------------------------------
[INFO] BUILD FAILURE
[INFO] ------------------------------------------------------------------------
[INFO] Total time: 21.577 s
[INFO] Finished at: 2018-08-23T15:51:55+00:00
[INFO] Final Memory: 48M/3925M
[INFO] ------------------------------------------------------------------------
Waiting for Jenkins to finish collecting data[ERROR] Failed to execute goal org.apache.maven.plugins:maven-compiler-plugin:3.7.0:compile (default-compile) on project org.apache.sling.feature.resolver: Compilation failure: Compilation failure:
[ERROR] <https://builds.apache.org/job/sling-org-apache-sling-feature-resolver-1.8/ws/src/main/java/org/apache/sling/feature/resolver/ApplicationResolverAssembler.java>:[19,32] cannot find symbol
[ERROR] symbol: class Application
[ERROR] location: package org.apache.sling.feature
[ERROR] <https://builds.apache.org/job/sling-org-apache-sling-feature-resolver-1.8/ws/src/main/java/org/apache/sling/feature/resolver/ApplicationResolverAssembler.java>:[22,40] cannot find symbol
[ERROR] symbol: class ApplicationBuilder
[ERROR] location: package org.apache.sling.feature.builder
[ERROR] <https://builds.apache.org/job/sling-org-apache-sling-feature-resolver-1.8/ws/src/main/java/org/apache/sling/feature/resolver/ApplicationResolverAssembler.java>:[29,58] cannot find symbol
[ERROR] symbol: class SubstituteVariables
[ERROR] location: class org.apache.sling.feature.io.json.FeatureJSONReader
[ERROR] <https://builds.apache.org/job/sling-org-apache-sling-feature-resolver-1.8/ws/src/main/java/org/apache/sling/feature/resolver/ApplicationResolverAssembler.java>:[50,13] cannot find symbol
[ERROR] symbol: class Application
[ERROR] location: class org.apache.sling.feature.resolver.ApplicationResolverAssembler
[ERROR] <https://builds.apache.org/job/sling-org-apache-sling-feature-resolver-1.8/ws/src/main/java/org/apache/sling/feature/resolver/ApplicationResolverAssembler.java>:[49,19] cannot find symbol
[ERROR] symbol: class Application
[ERROR] location: class org.apache.sling.feature.resolver.ApplicationResolverAssembler
[ERROR] <https://builds.apache.org/job/sling-org-apache-sling-feature-resolver-1.8/ws/src/main/java/org/apache/sling/feature/resolver/ApplicationResolverAssembler.java>:[95,13] cannot find symbol
[ERROR] symbol: class Application
[ERROR] location: class org.apache.sling.feature.resolver.ApplicationResolverAssembler
[ERROR] <https://builds.apache.org/job/sling-org-apache-sling-feature-resolver-1.8/ws/src/main/java/org/apache/sling/feature/resolver/ApplicationResolverAssembler.java>:[94,19] cannot find symbol
[ERROR] symbol: class Application
[ERROR] location: class org.apache.sling.feature.resolver.ApplicationResolverAssembler
[ERROR] <https://builds.apache.org/job/sling-org-apache-sling-feature-resolver-1.8/ws/src/main/java/org/apache/sling/feature/resolver/ApplicationResolverAssembler.java>:[58,81] cannot find symbol
[ERROR] symbol: variable SubstituteVariables
[ERROR] location: class org.apache.sling.feature.resolver.ApplicationResolverAssembler
[ERROR] <https://builds.apache.org/job/sling-org-apache-sling-feature-resolver-1.8/ws/src/main/java/org/apache/sling/feature/resolver/ApplicationResolverAssembler.java>:[111,87] cannot find symbol
[ERROR] symbol: variable SubstituteVariables
[ERROR] <https://builds.apache.org/job/sling-org-apache-sling-feature-resolver-1.8/ws/src/main/java/org/apache/sling/feature/resolver/ApplicationResolverAssembler.java>:[104,15] cannot find symbol
[ERROR] symbol: variable ApplicationBuilder
[ERROR] location: class org.apache.sling.feature.resolver.ApplicationResolverAssembler
[ERROR] -> [Help 1]
[ERROR]
[ERROR] To see the full stack trace of the errors, re-run Maven with the -e switch.
[ERROR] Re-run Maven using the -X switch to enable full debug logging.
[ERROR]
[ERROR] For more information about the errors and possible solutions, please read the following articles:
[ERROR] [Help 1] http://cwiki.apache.org/confluence/display/MAVEN/MojoFailureException
channel stopped
Recording test results
Build failed in Jenkins:
sling-org-apache-sling-feature-resolver-1.8 #60
Posted by Apache Jenkins Server <je...@builds.apache.org>.
See <https://builds.apache.org/job/sling-org-apache-sling-feature-resolver-1.8/60/display/redirect>
------------------------------------------
Started by timer
[EnvInject] - Loading node environment variables.
Building remotely on H31 (ubuntu xenial) in workspace <https://builds.apache.org/job/sling-org-apache-sling-feature-resolver-1.8/ws/>
Cloning the remote Git repository
Cloning repository https://github.com/apache/sling-org-apache-sling-feature-resolver.git
> git init <https://builds.apache.org/job/sling-org-apache-sling-feature-resolver-1.8/ws/> # timeout=10
Fetching upstream changes from https://github.com/apache/sling-org-apache-sling-feature-resolver.git
> git --version # timeout=10
> git fetch --tags --progress https://github.com/apache/sling-org-apache-sling-feature-resolver.git +refs/heads/*:refs/remotes/origin/*
> git config remote.origin.url https://github.com/apache/sling-org-apache-sling-feature-resolver.git # timeout=10
> git config --add remote.origin.fetch +refs/heads/*:refs/remotes/origin/* # timeout=10
> git config remote.origin.url https://github.com/apache/sling-org-apache-sling-feature-resolver.git # timeout=10
Fetching upstream changes from https://github.com/apache/sling-org-apache-sling-feature-resolver.git
> git fetch --tags --progress https://github.com/apache/sling-org-apache-sling-feature-resolver.git +refs/heads/*:refs/remotes/origin/*
> git rev-parse origin/master^{commit} # timeout=10
Checking out Revision f52d6465fa38070398787727e1a5ea9de69d8b8d (origin/master)
> git config core.sparsecheckout # timeout=10
> git checkout -f f52d6465fa38070398787727e1a5ea9de69d8b8d
Commit message: "Update to Configurator 1.0.4"
> git rev-list --no-walk f52d6465fa38070398787727e1a5ea9de69d8b8d # timeout=10
Parsing POMs
Established TCP socket on 45844
maven33-agent.jar already up to date
maven33-interceptor.jar already up to date
maven3-interceptor-commons.jar already up to date
[sling-org-apache-sling-feature-resolver-1.8] $ /home/jenkins/tools/java/latest1.8/bin/java -Xmx4g -Xms4g -cp /home/jenkins/jenkins-slave/maven33-agent.jar:/home/jenkins/tools/maven/apache-maven-3.3.9/boot/plexus-classworlds-2.5.2.jar:/home/jenkins/tools/maven/apache-maven-3.3.9/conf/logging jenkins.maven3.agent.Maven33Main /home/jenkins/tools/maven/apache-maven-3.3.9 /home/jenkins/jenkins-slave/slave.jar /home/jenkins/jenkins-slave/maven33-interceptor.jar /home/jenkins/jenkins-slave/maven3-interceptor-commons.jar 45844
<===[JENKINS REMOTING CAPACITY]===> channel started
Executing Maven: -B -f <https://builds.apache.org/job/sling-org-apache-sling-feature-resolver-1.8/ws/pom.xml> -Dmaven.repo.local=/home/jenkins/jenkins-slave/maven-repositories/0 -U clean deploy
[INFO] Scanning for projects...
[INFO]
[INFO] ------------------------------------------------------------------------
[INFO] Building Apache Sling Feature Resolver 0.1.0-SNAPSHOT
[INFO] ------------------------------------------------------------------------
[INFO] Downloading: http://repository.apache.org/snapshots/org/apache/sling/org.apache.sling.feature/0.1.3-SNAPSHOT/maven-metadata.xml
[INFO] Downloaded: http://repository.apache.org/snapshots/org/apache/sling/org.apache.sling.feature/0.1.3-SNAPSHOT/maven-metadata.xml (1008 B at 2.2 KB/sec)
[INFO] Downloading: http://repository.apache.org/snapshots/org/apache/sling/org.apache.sling.feature.analyser/0.1.3-SNAPSHOT/maven-metadata.xml
[INFO] Downloaded: http://repository.apache.org/snapshots/org/apache/sling/org.apache.sling.feature.analyser/0.1.3-SNAPSHOT/maven-metadata.xml (1017 B at 2.8 KB/sec)
[INFO] Downloading: http://repository.apache.org/snapshots/org/apache/sling/org.apache.sling.feature.analyser/0.1.3-SNAPSHOT/org.apache.sling.feature.analyser-0.1.3-20180820.154406-45.pom
[INFO] Downloaded: http://repository.apache.org/snapshots/org/apache/sling/org.apache.sling.feature.analyser/0.1.3-SNAPSHOT/org.apache.sling.feature.analyser-0.1.3-20180820.154406-45.pom (7 KB at 23.3 KB/sec)
[INFO] Downloading: http://repository.apache.org/snapshots/org/apache/sling/org.apache.sling.feature.io/0.1.3-SNAPSHOT/maven-metadata.xml
[INFO] Downloaded: http://repository.apache.org/snapshots/org/apache/sling/org.apache.sling.feature.io/0.1.3-SNAPSHOT/maven-metadata.xml (1011 B at 2.8 KB/sec)
[INFO] Downloading: http://repository.apache.org/snapshots/org/apache/sling/org.apache.sling.feature.io/0.1.3-SNAPSHOT/org.apache.sling.feature.io-0.1.3-20180820.154150-35.pom
[INFO] Downloaded: http://repository.apache.org/snapshots/org/apache/sling/org.apache.sling.feature.io/0.1.3-SNAPSHOT/org.apache.sling.feature.io-0.1.3-20180820.154150-35.pom (6 KB at 17.6 KB/sec)
[INFO] Downloading: http://repository.apache.org/snapshots/org/apache/sling/org.apache.sling.feature.analyser/0.1.3-SNAPSHOT/org.apache.sling.feature.analyser-0.1.3-20180820.154406-45.jar
[INFO] Downloading: http://repository.apache.org/snapshots/org/apache/sling/org.apache.sling.feature.io/0.1.3-SNAPSHOT/org.apache.sling.feature.io-0.1.3-20180820.154150-35.jar
[INFO] Downloaded: http://repository.apache.org/snapshots/org/apache/sling/org.apache.sling.feature.io/0.1.3-SNAPSHOT/org.apache.sling.feature.io-0.1.3-20180820.154150-35.jar (103 KB at 196.5 KB/sec)
[INFO] Downloaded: http://repository.apache.org/snapshots/org/apache/sling/org.apache.sling.feature.analyser/0.1.3-SNAPSHOT/org.apache.sling.feature.analyser-0.1.3-20180820.154406-45.jar (1386 KB at 1865.3 KB/sec)
[INFO]
[INFO] --- maven-clean-plugin:3.0.0:clean (default-clean) @ org.apache.sling.feature.resolver ---
[INFO]
[INFO] --- maven-enforcer-plugin:3.0.0-M1:enforce (enforce-property-values) @ org.apache.sling.feature.resolver ---
[INFO]
[INFO] --- maven-enforcer-plugin:3.0.0-M1:enforce (enforce-java) @ org.apache.sling.feature.resolver ---
[INFO]
[INFO] --- maven-enforcer-plugin:3.0.0-M1:enforce (ban-maven-scr-plugin) @ org.apache.sling.feature.resolver ---
[INFO]
[INFO] --- maven-remote-resources-plugin:1.5:process (process-resource-bundles) @ org.apache.sling.feature.resolver ---
[INFO]
[INFO] --- maven-remote-resources-plugin:1.5:process (default) @ org.apache.sling.feature.resolver ---
[INFO]
[INFO] --- maven-resources-plugin:2.7:resources (default-resources) @ org.apache.sling.feature.resolver ---
[INFO] Using 'UTF-8' encoding to copy filtered resources.
[INFO] skip non existing resourceDirectory <https://builds.apache.org/job/sling-org-apache-sling-feature-resolver-1.8/ws/src/main/resources>
[INFO] Copying 3 resources
[INFO] Copying 3 resources
[INFO]
[INFO] --- maven-compiler-plugin:3.7.0:compile (default-compile) @ org.apache.sling.feature.resolver ---
[INFO] Changes detected - recompiling the module!
[INFO] Compiling 11 source files to <https://builds.apache.org/job/sling-org-apache-sling-feature-resolver-1.8/ws/target/classes>
[INFO] -------------------------------------------------------------
[ERROR] COMPILATION ERROR :
[INFO] -------------------------------------------------------------
[ERROR] <https://builds.apache.org/job/sling-org-apache-sling-feature-resolver-1.8/ws/src/main/java/org/apache/sling/feature/resolver/ApplicationResolverAssembler.java>:[19,32] cannot find symbol
symbol: class Application
location: package org.apache.sling.feature
[ERROR] <https://builds.apache.org/job/sling-org-apache-sling-feature-resolver-1.8/ws/src/main/java/org/apache/sling/feature/resolver/ApplicationResolverAssembler.java>:[22,40] cannot find symbol
symbol: class ApplicationBuilder
location: package org.apache.sling.feature.builder
[ERROR] <https://builds.apache.org/job/sling-org-apache-sling-feature-resolver-1.8/ws/src/main/java/org/apache/sling/feature/resolver/ApplicationResolverAssembler.java>:[29,58] cannot find symbol
symbol: class SubstituteVariables
location: class org.apache.sling.feature.io.json.FeatureJSONReader
[ERROR] <https://builds.apache.org/job/sling-org-apache-sling-feature-resolver-1.8/ws/src/main/java/org/apache/sling/feature/resolver/ApplicationResolverAssembler.java>:[50,13] cannot find symbol
symbol: class Application
location: class org.apache.sling.feature.resolver.ApplicationResolverAssembler
[ERROR] <https://builds.apache.org/job/sling-org-apache-sling-feature-resolver-1.8/ws/src/main/java/org/apache/sling/feature/resolver/ApplicationResolverAssembler.java>:[49,19] cannot find symbol
symbol: class Application
location: class org.apache.sling.feature.resolver.ApplicationResolverAssembler
[ERROR] <https://builds.apache.org/job/sling-org-apache-sling-feature-resolver-1.8/ws/src/main/java/org/apache/sling/feature/resolver/ApplicationResolverAssembler.java>:[95,13] cannot find symbol
symbol: class Application
location: class org.apache.sling.feature.resolver.ApplicationResolverAssembler
[ERROR] <https://builds.apache.org/job/sling-org-apache-sling-feature-resolver-1.8/ws/src/main/java/org/apache/sling/feature/resolver/ApplicationResolverAssembler.java>:[94,19] cannot find symbol
symbol: class Application
location: class org.apache.sling.feature.resolver.ApplicationResolverAssembler
[ERROR] <https://builds.apache.org/job/sling-org-apache-sling-feature-resolver-1.8/ws/src/main/java/org/apache/sling/feature/resolver/ApplicationResolverAssembler.java>:[58,81] cannot find symbol
symbol: variable SubstituteVariables
location: class org.apache.sling.feature.resolver.ApplicationResolverAssembler
[ERROR] <https://builds.apache.org/job/sling-org-apache-sling-feature-resolver-1.8/ws/src/main/java/org/apache/sling/feature/resolver/ApplicationResolverAssembler.java>:[111,87] cannot find symbol
symbol: variable SubstituteVariables
[ERROR] <https://builds.apache.org/job/sling-org-apache-sling-feature-resolver-1.8/ws/src/main/java/org/apache/sling/feature/resolver/ApplicationResolverAssembler.java>:[104,15] cannot find symbol
symbol: variable ApplicationBuilder
location: class org.apache.sling.feature.resolver.ApplicationResolverAssembler
[INFO] 10 errors
[INFO] -------------------------------------------------------------
[WARNING] Attempt to (de-)serialize anonymous class hudson.maven.reporters.MavenArtifactArchiver$2; see: https://jenkins.io/redirect/serialization-of-anonymous-classes/
[JENKINS] Archiving disabled
[WARNING] Attempt to (de-)serialize anonymous class hudson.maven.reporters.MavenFingerprinter$1; see: https://jenkins.io/redirect/serialization-of-anonymous-classes/
[JENKINS] Archiving disabled
[INFO] ------------------------------------------------------------------------
[INFO] BUILD FAILURE
[INFO] ------------------------------------------------------------------------
[INFO] Total time: 19.155 s
[INFO] Finished at: 2018-08-23T05:57:43+00:00
[INFO] Final Memory: 49M/3925M
[INFO] ------------------------------------------------------------------------
Waiting for Jenkins to finish collecting data
[ERROR] Failed to execute goal org.apache.maven.plugins:maven-compiler-plugin:3.7.0:compile (default-compile) on project org.apache.sling.feature.resolver: Compilation failure: Compilation failure:
[ERROR] <https://builds.apache.org/job/sling-org-apache-sling-feature-resolver-1.8/ws/src/main/java/org/apache/sling/feature/resolver/ApplicationResolverAssembler.java>:[19,32] cannot find symbol
[ERROR] symbol: class Application
[ERROR] location: package org.apache.sling.feature
[ERROR] <https://builds.apache.org/job/sling-org-apache-sling-feature-resolver-1.8/ws/src/main/java/org/apache/sling/feature/resolver/ApplicationResolverAssembler.java>:[22,40] cannot find symbol
[ERROR] symbol: class ApplicationBuilder
[ERROR] location: package org.apache.sling.feature.builder
[ERROR] <https://builds.apache.org/job/sling-org-apache-sling-feature-resolver-1.8/ws/src/main/java/org/apache/sling/feature/resolver/ApplicationResolverAssembler.java>:[29,58] cannot find symbol
[ERROR] symbol: class SubstituteVariables
[ERROR] location: class org.apache.sling.feature.io.json.FeatureJSONReader
[ERROR] <https://builds.apache.org/job/sling-org-apache-sling-feature-resolver-1.8/ws/src/main/java/org/apache/sling/feature/resolver/ApplicationResolverAssembler.java>:[50,13] cannot find symbol
[ERROR] symbol: class Application
[ERROR] location: class org.apache.sling.feature.resolver.ApplicationResolverAssembler
[ERROR] <https://builds.apache.org/job/sling-org-apache-sling-feature-resolver-1.8/ws/src/main/java/org/apache/sling/feature/resolver/ApplicationResolverAssembler.java>:[49,19] cannot find symbol
[ERROR] symbol: class Application
[ERROR] location: class org.apache.sling.feature.resolver.ApplicationResolverAssembler
[ERROR] <https://builds.apache.org/job/sling-org-apache-sling-feature-resolver-1.8/ws/src/main/java/org/apache/sling/feature/resolver/ApplicationResolverAssembler.java>:[95,13] cannot find symbol
[ERROR] symbol: class Application
[ERROR] location: class org.apache.sling.feature.resolver.ApplicationResolverAssembler
[ERROR] <https://builds.apache.org/job/sling-org-apache-sling-feature-resolver-1.8/ws/src/main/java/org/apache/sling/feature/resolver/ApplicationResolverAssembler.java>:[94,19] cannot find symbol
[ERROR] symbol: class Application
[ERROR] location: class org.apache.sling.feature.resolver.ApplicationResolverAssembler
[ERROR] <https://builds.apache.org/job/sling-org-apache-sling-feature-resolver-1.8/ws/src/main/java/org/apache/sling/feature/resolver/ApplicationResolverAssembler.java>:[58,81] cannot find symbol
[ERROR] symbol: variable SubstituteVariables
[ERROR] location: class org.apache.sling.feature.resolver.ApplicationResolverAssembler
[ERROR] <https://builds.apache.org/job/sling-org-apache-sling-feature-resolver-1.8/ws/src/main/java/org/apache/sling/feature/resolver/ApplicationResolverAssembler.java>:[111,87] cannot find symbol
[ERROR] symbol: variable SubstituteVariables
[ERROR] <https://builds.apache.org/job/sling-org-apache-sling-feature-resolver-1.8/ws/src/main/java/org/apache/sling/feature/resolver/ApplicationResolverAssembler.java>:[104,15] cannot find symbol
[ERROR] symbol: variable ApplicationBuilder
[ERROR] location: class org.apache.sling.feature.resolver.ApplicationResolverAssembler
[ERROR] -> [Help 1]
[ERROR]
[ERROR] To see the full stack trace of the errors, re-run Maven with the -e switch.
[ERROR] Re-run Maven using the -X switch to enable full debug logging.
[ERROR]
[ERROR] For more information about the errors and possible solutions, please read the following articles:
[ERROR] [Help 1] http://cwiki.apache.org/confluence/display/MAVEN/MojoFailureException
channel stopped
Recording test results
Build failed in Jenkins:
sling-org-apache-sling-feature-resolver-1.8 #59
Posted by Apache Jenkins Server <je...@builds.apache.org>.
See <https://builds.apache.org/job/sling-org-apache-sling-feature-resolver-1.8/59/display/redirect>
------------------------------------------
Started by upstream project "sling-org-apache-sling-feature-analyser-1.8" build number 56
originally caused by:
Started by upstream project "sling-org-apache-sling-feature-io-1.8" build number 42
originally caused by:
Started by an SCM change
[EnvInject] - Loading node environment variables.
Building remotely on H23 (ubuntu xenial) in workspace <https://builds.apache.org/job/sling-org-apache-sling-feature-resolver-1.8/ws/>
> git rev-parse --is-inside-work-tree # timeout=10
Fetching changes from the remote Git repository
> git config remote.origin.url https://github.com/apache/sling-org-apache-sling-feature-resolver.git # timeout=10
Fetching upstream changes from https://github.com/apache/sling-org-apache-sling-feature-resolver.git
> git --version # timeout=10
> git fetch --tags --progress https://github.com/apache/sling-org-apache-sling-feature-resolver.git +refs/heads/*:refs/remotes/origin/*
> git rev-parse origin/master^{commit} # timeout=10
Checking out Revision f52d6465fa38070398787727e1a5ea9de69d8b8d (origin/master)
> git config core.sparsecheckout # timeout=10
> git checkout -f f52d6465fa38070398787727e1a5ea9de69d8b8d
Commit message: "Update to Configurator 1.0.4"
> git rev-list --no-walk f52d6465fa38070398787727e1a5ea9de69d8b8d # timeout=10
Parsing POMs
Established TCP socket on 33378
maven33-agent.jar already up to date
maven33-interceptor.jar already up to date
maven3-interceptor-commons.jar already up to date
[sling-org-apache-sling-feature-resolver-1.8] $ /home/jenkins/tools/java/latest1.8/bin/java -Xmx4g -Xms4g -cp /home/jenkins/jenkins-slave/maven33-agent.jar:/home/jenkins/tools/maven/apache-maven-3.3.9/boot/plexus-classworlds-2.5.2.jar:/home/jenkins/tools/maven/apache-maven-3.3.9/conf/logging jenkins.maven3.agent.Maven33Main /home/jenkins/tools/maven/apache-maven-3.3.9 /home/jenkins/jenkins-slave/slave.jar /home/jenkins/jenkins-slave/maven33-interceptor.jar /home/jenkins/jenkins-slave/maven3-interceptor-commons.jar 33378
<===[JENKINS REMOTING CAPACITY]===> channel started
Executing Maven: -B -f <https://builds.apache.org/job/sling-org-apache-sling-feature-resolver-1.8/ws/pom.xml> -Dmaven.repo.local=/home/jenkins/jenkins-slave/maven-repositories/1 -U clean deploy
[INFO] Scanning for projects...
[INFO]
[INFO] ------------------------------------------------------------------------
[INFO] Building Apache Sling Feature Resolver 0.1.0-SNAPSHOT
[INFO] ------------------------------------------------------------------------
[INFO] Downloading: http://repository.apache.org/snapshots/org/apache/sling/org.apache.sling.feature/0.1.3-SNAPSHOT/maven-metadata.xml
[INFO] Downloaded: http://repository.apache.org/snapshots/org/apache/sling/org.apache.sling.feature/0.1.3-SNAPSHOT/maven-metadata.xml (1008 B at 2.6 KB/sec)
[INFO] Downloading: http://repository.apache.org/snapshots/org/apache/sling/org.apache.sling.feature.analyser/0.1.3-SNAPSHOT/maven-metadata.xml
[INFO] Downloaded: http://repository.apache.org/snapshots/org/apache/sling/org.apache.sling.feature.analyser/0.1.3-SNAPSHOT/maven-metadata.xml (1017 B at 3.3 KB/sec)
[INFO] Downloading: http://repository.apache.org/snapshots/org/apache/sling/org.apache.sling.feature.analyser/0.1.3-SNAPSHOT/org.apache.sling.feature.analyser-0.1.3-20180820.154406-45.pom
[INFO] Downloaded: http://repository.apache.org/snapshots/org/apache/sling/org.apache.sling.feature.analyser/0.1.3-SNAPSHOT/org.apache.sling.feature.analyser-0.1.3-20180820.154406-45.pom (7 KB at 23.8 KB/sec)
[INFO] Downloading: http://repository.apache.org/snapshots/org/apache/sling/org.apache.sling.feature.io/0.1.3-SNAPSHOT/maven-metadata.xml
[INFO] Downloaded: http://repository.apache.org/snapshots/org/apache/sling/org.apache.sling.feature.io/0.1.3-SNAPSHOT/maven-metadata.xml (1011 B at 3.5 KB/sec)
[INFO] Downloading: http://repository.apache.org/snapshots/org/apache/sling/org.apache.sling.feature.analyser/0.1.3-SNAPSHOT/org.apache.sling.feature.analyser-0.1.3-20180820.154406-45.jar
[INFO] Downloaded: http://repository.apache.org/snapshots/org/apache/sling/org.apache.sling.feature.analyser/0.1.3-SNAPSHOT/org.apache.sling.feature.analyser-0.1.3-20180820.154406-45.jar (1386 KB at 1914.3 KB/sec)
[INFO]
[INFO] --- maven-clean-plugin:3.0.0:clean (default-clean) @ org.apache.sling.feature.resolver ---
[INFO] Deleting <https://builds.apache.org/job/sling-org-apache-sling-feature-resolver-1.8/ws/target>
[INFO]
[INFO] --- maven-enforcer-plugin:3.0.0-M1:enforce (enforce-property-values) @ org.apache.sling.feature.resolver ---
[INFO]
[INFO] --- maven-enforcer-plugin:3.0.0-M1:enforce (enforce-java) @ org.apache.sling.feature.resolver ---
[INFO]
[INFO] --- maven-enforcer-plugin:3.0.0-M1:enforce (ban-maven-scr-plugin) @ org.apache.sling.feature.resolver ---
[INFO]
[INFO] --- maven-remote-resources-plugin:1.5:process (process-resource-bundles) @ org.apache.sling.feature.resolver ---
[INFO]
[INFO] --- maven-remote-resources-plugin:1.5:process (default) @ org.apache.sling.feature.resolver ---
[INFO]
[INFO] --- maven-resources-plugin:2.7:resources (default-resources) @ org.apache.sling.feature.resolver ---
[INFO] Using 'UTF-8' encoding to copy filtered resources.
[INFO] skip non existing resourceDirectory <https://builds.apache.org/job/sling-org-apache-sling-feature-resolver-1.8/ws/src/main/resources>
[INFO] Copying 3 resources
[INFO] Copying 3 resources
[INFO]
[INFO] --- maven-compiler-plugin:3.7.0:compile (default-compile) @ org.apache.sling.feature.resolver ---
[INFO] Changes detected - recompiling the module!
[INFO] Compiling 11 source files to <https://builds.apache.org/job/sling-org-apache-sling-feature-resolver-1.8/ws/target/classes>
[INFO] -------------------------------------------------------------
[ERROR] COMPILATION ERROR :
[INFO] -------------------------------------------------------------
[ERROR] <https://builds.apache.org/job/sling-org-apache-sling-feature-resolver-1.8/ws/src/main/java/org/apache/sling/feature/resolver/ApplicationResolverAssembler.java>:[19,32] cannot find symbol
symbol: class Application
location: package org.apache.sling.feature
[ERROR] <https://builds.apache.org/job/sling-org-apache-sling-feature-resolver-1.8/ws/src/main/java/org/apache/sling/feature/resolver/ApplicationResolverAssembler.java>:[22,40] cannot find symbol
symbol: class ApplicationBuilder
location: package org.apache.sling.feature.builder
[ERROR] <https://builds.apache.org/job/sling-org-apache-sling-feature-resolver-1.8/ws/src/main/java/org/apache/sling/feature/resolver/ApplicationResolverAssembler.java>:[29,58] cannot find symbol
symbol: class SubstituteVariables
location: class org.apache.sling.feature.io.json.FeatureJSONReader
[ERROR] <https://builds.apache.org/job/sling-org-apache-sling-feature-resolver-1.8/ws/src/main/java/org/apache/sling/feature/resolver/ApplicationResolverAssembler.java>:[50,13] cannot find symbol
symbol: class Application
location: class org.apache.sling.feature.resolver.ApplicationResolverAssembler
[ERROR] <https://builds.apache.org/job/sling-org-apache-sling-feature-resolver-1.8/ws/src/main/java/org/apache/sling/feature/resolver/ApplicationResolverAssembler.java>:[49,19] cannot find symbol
symbol: class Application
location: class org.apache.sling.feature.resolver.ApplicationResolverAssembler
[ERROR] <https://builds.apache.org/job/sling-org-apache-sling-feature-resolver-1.8/ws/src/main/java/org/apache/sling/feature/resolver/ApplicationResolverAssembler.java>:[95,13] cannot find symbol
symbol: class Application
location: class org.apache.sling.feature.resolver.ApplicationResolverAssembler
[ERROR] <https://builds.apache.org/job/sling-org-apache-sling-feature-resolver-1.8/ws/src/main/java/org/apache/sling/feature/resolver/ApplicationResolverAssembler.java>:[94,19] cannot find symbol
symbol: class Application
location: class org.apache.sling.feature.resolver.ApplicationResolverAssembler
[ERROR] <https://builds.apache.org/job/sling-org-apache-sling-feature-resolver-1.8/ws/src/main/java/org/apache/sling/feature/resolver/ApplicationResolverAssembler.java>:[58,81] cannot find symbol
symbol: variable SubstituteVariables
location: class org.apache.sling.feature.resolver.ApplicationResolverAssembler
[ERROR] <https://builds.apache.org/job/sling-org-apache-sling-feature-resolver-1.8/ws/src/main/java/org/apache/sling/feature/resolver/ApplicationResolverAssembler.java>:[111,87] cannot find symbol
symbol: variable SubstituteVariables
[ERROR] <https://builds.apache.org/job/sling-org-apache-sling-feature-resolver-1.8/ws/src/main/java/org/apache/sling/feature/resolver/ApplicationResolverAssembler.java>:[104,15] cannot find symbol
symbol: variable ApplicationBuilder
location: class org.apache.sling.feature.resolver.ApplicationResolverAssembler
[INFO] 10 errors
[INFO] -------------------------------------------------------------
[WARNING] Attempt to (de-)serialize anonymous class hudson.maven.reporters.MavenArtifactArchiver$2; see: https://jenkins.io/redirect/serialization-of-anonymous-classes/
[JENKINS] Archiving disabled
[WARNING] Attempt to (de-)serialize anonymous class hudson.maven.reporters.MavenFingerprinter$1; see: https://jenkins.io/redirect/serialization-of-anonymous-classes/
[JENKINS] Archiving disabled
[INFO] ------------------------------------------------------------------------
[INFO] BUILD FAILURE
[INFO] ------------------------------------------------------------------------
[INFO] Total time: 17.086 s
[INFO] Finished at: 2018-08-20T15:45:09+00:00
[INFO] Final Memory: 46M/3925M
[INFO] ------------------------------------------------------------------------
Waiting for Jenkins to finish collecting data
[ERROR] Failed to execute goal org.apache.maven.plugins:maven-compiler-plugin:3.7.0:compile (default-compile) on project org.apache.sling.feature.resolver: Compilation failure: Compilation failure:
[ERROR] <https://builds.apache.org/job/sling-org-apache-sling-feature-resolver-1.8/ws/src/main/java/org/apache/sling/feature/resolver/ApplicationResolverAssembler.java>:[19,32] cannot find symbol
[ERROR] symbol: class Application
[ERROR] location: package org.apache.sling.feature
[ERROR] <https://builds.apache.org/job/sling-org-apache-sling-feature-resolver-1.8/ws/src/main/java/org/apache/sling/feature/resolver/ApplicationResolverAssembler.java>:[22,40] cannot find symbol
[ERROR] symbol: class ApplicationBuilder
[ERROR] location: package org.apache.sling.feature.builder
[ERROR] <https://builds.apache.org/job/sling-org-apache-sling-feature-resolver-1.8/ws/src/main/java/org/apache/sling/feature/resolver/ApplicationResolverAssembler.java>:[29,58] cannot find symbol
[ERROR] symbol: class SubstituteVariables
[ERROR] location: class org.apache.sling.feature.io.json.FeatureJSONReader
[ERROR] <https://builds.apache.org/job/sling-org-apache-sling-feature-resolver-1.8/ws/src/main/java/org/apache/sling/feature/resolver/ApplicationResolverAssembler.java>:[50,13] cannot find symbol
[ERROR] symbol: class Application
[ERROR] location: class org.apache.sling.feature.resolver.ApplicationResolverAssembler
[ERROR] <https://builds.apache.org/job/sling-org-apache-sling-feature-resolver-1.8/ws/src/main/java/org/apache/sling/feature/resolver/ApplicationResolverAssembler.java>:[49,19] cannot find symbol
[ERROR] symbol: class Application
[ERROR] location: class org.apache.sling.feature.resolver.ApplicationResolverAssembler
[ERROR] <https://builds.apache.org/job/sling-org-apache-sling-feature-resolver-1.8/ws/src/main/java/org/apache/sling/feature/resolver/ApplicationResolverAssembler.java>:[95,13] cannot find symbol
[ERROR] symbol: class Application
[ERROR] location: class org.apache.sling.feature.resolver.ApplicationResolverAssembler
[ERROR] <https://builds.apache.org/job/sling-org-apache-sling-feature-resolver-1.8/ws/src/main/java/org/apache/sling/feature/resolver/ApplicationResolverAssembler.java>:[94,19] cannot find symbol
[ERROR] symbol: class Application
[ERROR] location: class org.apache.sling.feature.resolver.ApplicationResolverAssembler
[ERROR] <https://builds.apache.org/job/sling-org-apache-sling-feature-resolver-1.8/ws/src/main/java/org/apache/sling/feature/resolver/ApplicationResolverAssembler.java>:[58,81] cannot find symbol
[ERROR] symbol: variable SubstituteVariables
[ERROR] location: class org.apache.sling.feature.resolver.ApplicationResolverAssembler
[ERROR] <https://builds.apache.org/job/sling-org-apache-sling-feature-resolver-1.8/ws/src/main/java/org/apache/sling/feature/resolver/ApplicationResolverAssembler.java>:[111,87] cannot find symbol
[ERROR] symbol: variable SubstituteVariables
[ERROR] <https://builds.apache.org/job/sling-org-apache-sling-feature-resolver-1.8/ws/src/main/java/org/apache/sling/feature/resolver/ApplicationResolverAssembler.java>:[104,15] cannot find symbol
[ERROR] symbol: variable ApplicationBuilder
[ERROR] location: class org.apache.sling.feature.resolver.ApplicationResolverAssembler
[ERROR] -> [Help 1]
[ERROR]
[ERROR] To see the full stack trace of the errors, re-run Maven with the -e switch.
[ERROR] Re-run Maven using the -X switch to enable full debug logging.
[ERROR]
[ERROR] For more information about the errors and possible solutions, please read the following articles:
[ERROR] [Help 1] http://cwiki.apache.org/confluence/display/MAVEN/MojoFailureException
channel stopped
Recording test results
Build failed in Jenkins:
sling-org-apache-sling-feature-resolver-1.8 #58
Posted by Apache Jenkins Server <je...@builds.apache.org>.
See <https://builds.apache.org/job/sling-org-apache-sling-feature-resolver-1.8/58/display/redirect>
------------------------------------------
Started by upstream project "sling-org-apache-sling-feature-analyser-1.8" build number 55
originally caused by:
Started by upstream project "sling-org-apache-sling-feature-io-1.8" build number 41
originally caused by:
Started by timer
[EnvInject] - Loading node environment variables.
Building remotely on H27 (ubuntu xenial) in workspace <https://builds.apache.org/job/sling-org-apache-sling-feature-resolver-1.8/ws/>
> git rev-parse --is-inside-work-tree # timeout=10
Fetching changes from the remote Git repository
> git config remote.origin.url https://github.com/apache/sling-org-apache-sling-feature-resolver.git # timeout=10
Fetching upstream changes from https://github.com/apache/sling-org-apache-sling-feature-resolver.git
> git --version # timeout=10
> git fetch --tags --progress https://github.com/apache/sling-org-apache-sling-feature-resolver.git +refs/heads/*:refs/remotes/origin/*
> git rev-parse origin/master^{commit} # timeout=10
Checking out Revision f52d6465fa38070398787727e1a5ea9de69d8b8d (origin/master)
> git config core.sparsecheckout # timeout=10
> git checkout -f f52d6465fa38070398787727e1a5ea9de69d8b8d
Commit message: "Update to Configurator 1.0.4"
> git rev-list --no-walk f52d6465fa38070398787727e1a5ea9de69d8b8d # timeout=10
Parsing POMs
Established TCP socket on 44989
maven33-agent.jar already up to date
maven33-interceptor.jar already up to date
maven3-interceptor-commons.jar already up to date
[sling-org-apache-sling-feature-resolver-1.8] $ /home/jenkins/tools/java/latest1.8/bin/java -Xmx4g -Xms4g -cp /home/jenkins/jenkins-slave/maven33-agent.jar:/home/jenkins/tools/maven/apache-maven-3.3.9/boot/plexus-classworlds-2.5.2.jar:/home/jenkins/tools/maven/apache-maven-3.3.9/conf/logging jenkins.maven3.agent.Maven33Main /home/jenkins/tools/maven/apache-maven-3.3.9 /home/jenkins/jenkins-slave/slave.jar /home/jenkins/jenkins-slave/maven33-interceptor.jar /home/jenkins/jenkins-slave/maven3-interceptor-commons.jar 44989
<===[JENKINS REMOTING CAPACITY]===> channel started
Executing Maven: -B -f <https://builds.apache.org/job/sling-org-apache-sling-feature-resolver-1.8/ws/pom.xml> -Dmaven.repo.local=/home/jenkins/jenkins-slave/maven-repositories/1 -U clean deploy
[INFO] Scanning for projects...
[INFO]
[INFO] ------------------------------------------------------------------------
[INFO] Building Apache Sling Feature Resolver 0.1.0-SNAPSHOT
[INFO] ------------------------------------------------------------------------
[INFO] Downloading: http://repository.apache.org/snapshots/org/apache/sling/org.apache.sling.feature/0.1.3-SNAPSHOT/maven-metadata.xml
[INFO] Downloaded: http://repository.apache.org/snapshots/org/apache/sling/org.apache.sling.feature/0.1.3-SNAPSHOT/maven-metadata.xml (1008 B at 2.4 KB/sec)
[INFO] Downloading: http://repository.apache.org/snapshots/org/apache/sling/org.apache.sling.feature.analyser/0.1.3-SNAPSHOT/maven-metadata.xml
[INFO] Downloaded: http://repository.apache.org/snapshots/org/apache/sling/org.apache.sling.feature.analyser/0.1.3-SNAPSHOT/maven-metadata.xml (1017 B at 3.2 KB/sec)
[INFO] Downloading: http://repository.apache.org/snapshots/org/apache/sling/org.apache.sling.feature.analyser/0.1.3-SNAPSHOT/org.apache.sling.feature.analyser-0.1.3-20180819.025841-44.pom
[INFO] Downloaded: http://repository.apache.org/snapshots/org/apache/sling/org.apache.sling.feature.analyser/0.1.3-SNAPSHOT/org.apache.sling.feature.analyser-0.1.3-20180819.025841-44.pom (7 KB at 23.5 KB/sec)
[INFO] Downloading: http://repository.apache.org/snapshots/org/apache/sling/org.apache.sling.feature.io/0.1.3-SNAPSHOT/maven-metadata.xml
[INFO] Downloaded: http://repository.apache.org/snapshots/org/apache/sling/org.apache.sling.feature.io/0.1.3-SNAPSHOT/maven-metadata.xml (1011 B at 3.3 KB/sec)
[INFO] Downloading: http://repository.apache.org/snapshots/org/apache/sling/org.apache.sling.feature.io/0.1.3-SNAPSHOT/org.apache.sling.feature.io-0.1.3-20180819.025640-34.pom
[INFO] Downloaded: http://repository.apache.org/snapshots/org/apache/sling/org.apache.sling.feature.io/0.1.3-SNAPSHOT/org.apache.sling.feature.io-0.1.3-20180819.025640-34.pom (6 KB at 18.7 KB/sec)
[INFO] Downloading: http://repository.apache.org/snapshots/org/apache/sling/org.apache.sling.feature.analyser/0.1.3-SNAPSHOT/org.apache.sling.feature.analyser-0.1.3-20180819.025841-44.jar
[INFO] Downloading: http://repository.apache.org/snapshots/org/apache/sling/org.apache.sling.feature.io/0.1.3-SNAPSHOT/org.apache.sling.feature.io-0.1.3-20180819.025640-34.jar
[INFO] Downloaded: http://repository.apache.org/snapshots/org/apache/sling/org.apache.sling.feature.io/0.1.3-SNAPSHOT/org.apache.sling.feature.io-0.1.3-20180819.025640-34.jar (103 KB at 208.8 KB/sec)
[INFO] Downloaded: http://repository.apache.org/snapshots/org/apache/sling/org.apache.sling.feature.analyser/0.1.3-SNAPSHOT/org.apache.sling.feature.analyser-0.1.3-20180819.025841-44.jar (1386 KB at 1908.7 KB/sec)
[INFO]
[INFO] --- maven-clean-plugin:3.0.0:clean (default-clean) @ org.apache.sling.feature.resolver ---
[INFO] Deleting <https://builds.apache.org/job/sling-org-apache-sling-feature-resolver-1.8/ws/target>
[INFO]
[INFO] --- maven-enforcer-plugin:3.0.0-M1:enforce (enforce-property-values) @ org.apache.sling.feature.resolver ---
[INFO]
[INFO] --- maven-enforcer-plugin:3.0.0-M1:enforce (enforce-java) @ org.apache.sling.feature.resolver ---
[INFO]
[INFO] --- maven-enforcer-plugin:3.0.0-M1:enforce (ban-maven-scr-plugin) @ org.apache.sling.feature.resolver ---
[INFO]
[INFO] --- maven-remote-resources-plugin:1.5:process (process-resource-bundles) @ org.apache.sling.feature.resolver ---
[INFO]
[INFO] --- maven-remote-resources-plugin:1.5:process (default) @ org.apache.sling.feature.resolver ---
[INFO]
[INFO] --- maven-resources-plugin:2.7:resources (default-resources) @ org.apache.sling.feature.resolver ---
[INFO] Using 'UTF-8' encoding to copy filtered resources.
[INFO] skip non existing resourceDirectory <https://builds.apache.org/job/sling-org-apache-sling-feature-resolver-1.8/ws/src/main/resources>
[INFO] Copying 3 resources
[INFO] Copying 3 resources
[INFO]
[INFO] --- maven-compiler-plugin:3.7.0:compile (default-compile) @ org.apache.sling.feature.resolver ---
[INFO] Changes detected - recompiling the module!
[INFO] Compiling 11 source files to <https://builds.apache.org/job/sling-org-apache-sling-feature-resolver-1.8/ws/target/classes>
[INFO] -------------------------------------------------------------
[ERROR] COMPILATION ERROR :
[INFO] -------------------------------------------------------------
[ERROR] <https://builds.apache.org/job/sling-org-apache-sling-feature-resolver-1.8/ws/src/main/java/org/apache/sling/feature/resolver/ApplicationResolverAssembler.java>:[19,32] cannot find symbol
symbol: class Application
location: package org.apache.sling.feature
[ERROR] <https://builds.apache.org/job/sling-org-apache-sling-feature-resolver-1.8/ws/src/main/java/org/apache/sling/feature/resolver/ApplicationResolverAssembler.java>:[22,40] cannot find symbol
symbol: class ApplicationBuilder
location: package org.apache.sling.feature.builder
[ERROR] <https://builds.apache.org/job/sling-org-apache-sling-feature-resolver-1.8/ws/src/main/java/org/apache/sling/feature/resolver/ApplicationResolverAssembler.java>:[29,58] cannot find symbol
symbol: class SubstituteVariables
location: class org.apache.sling.feature.io.json.FeatureJSONReader
[ERROR] <https://builds.apache.org/job/sling-org-apache-sling-feature-resolver-1.8/ws/src/main/java/org/apache/sling/feature/resolver/ApplicationResolverAssembler.java>:[50,13] cannot find symbol
symbol: class Application
location: class org.apache.sling.feature.resolver.ApplicationResolverAssembler
[ERROR] <https://builds.apache.org/job/sling-org-apache-sling-feature-resolver-1.8/ws/src/main/java/org/apache/sling/feature/resolver/ApplicationResolverAssembler.java>:[49,19] cannot find symbol
symbol: class Application
location: class org.apache.sling.feature.resolver.ApplicationResolverAssembler
[ERROR] <https://builds.apache.org/job/sling-org-apache-sling-feature-resolver-1.8/ws/src/main/java/org/apache/sling/feature/resolver/ApplicationResolverAssembler.java>:[95,13] cannot find symbol
symbol: class Application
location: class org.apache.sling.feature.resolver.ApplicationResolverAssembler
[ERROR] <https://builds.apache.org/job/sling-org-apache-sling-feature-resolver-1.8/ws/src/main/java/org/apache/sling/feature/resolver/ApplicationResolverAssembler.java>:[94,19] cannot find symbol
symbol: class Application
location: class org.apache.sling.feature.resolver.ApplicationResolverAssembler
[ERROR] <https://builds.apache.org/job/sling-org-apache-sling-feature-resolver-1.8/ws/src/main/java/org/apache/sling/feature/resolver/ApplicationResolverAssembler.java>:[58,81] cannot find symbol
symbol: variable SubstituteVariables
location: class org.apache.sling.feature.resolver.ApplicationResolverAssembler
[ERROR] <https://builds.apache.org/job/sling-org-apache-sling-feature-resolver-1.8/ws/src/main/java/org/apache/sling/feature/resolver/ApplicationResolverAssembler.java>:[111,87] cannot find symbol
symbol: variable SubstituteVariables
[ERROR] <https://builds.apache.org/job/sling-org-apache-sling-feature-resolver-1.8/ws/src/main/java/org/apache/sling/feature/resolver/ApplicationResolverAssembler.java>:[104,15] cannot find symbol
symbol: variable ApplicationBuilder
location: class org.apache.sling.feature.resolver.ApplicationResolverAssembler
[INFO] 10 errors
[INFO] -------------------------------------------------------------
[WARNING] Attempt to (de-)serialize anonymous class hudson.maven.reporters.MavenArtifactArchiver$2; see: https://jenkins.io/redirect/serialization-of-anonymous-classes/
[JENKINS] Archiving disabled
[WARNING] Attempt to (de-)serialize anonymous class hudson.maven.reporters.MavenFingerprinter$1; see: https://jenkins.io/redirect/serialization-of-anonymous-classes/
[JENKINS] Archiving disabled
[INFO] ------------------------------------------------------------------------
[INFO] BUILD FAILURE
[INFO] ------------------------------------------------------------------------
[INFO] Total time: 18.127 s
[INFO] Finished at: 2018-08-19T02:59:47+00:00
[INFO] Final Memory: 48M/3925M
[INFO] ------------------------------------------------------------------------
Waiting for Jenkins to finish collecting data
[ERROR] Failed to execute goal org.apache.maven.plugins:maven-compiler-plugin:3.7.0:compile (default-compile) on project org.apache.sling.feature.resolver: Compilation failure: Compilation failure:
[ERROR] <https://builds.apache.org/job/sling-org-apache-sling-feature-resolver-1.8/ws/src/main/java/org/apache/sling/feature/resolver/ApplicationResolverAssembler.java>:[19,32] cannot find symbol
[ERROR] symbol: class Application
[ERROR] location: package org.apache.sling.feature
[ERROR] <https://builds.apache.org/job/sling-org-apache-sling-feature-resolver-1.8/ws/src/main/java/org/apache/sling/feature/resolver/ApplicationResolverAssembler.java>:[22,40] cannot find symbol
[ERROR] symbol: class ApplicationBuilder
[ERROR] location: package org.apache.sling.feature.builder
[ERROR] <https://builds.apache.org/job/sling-org-apache-sling-feature-resolver-1.8/ws/src/main/java/org/apache/sling/feature/resolver/ApplicationResolverAssembler.java>:[29,58] cannot find symbol
[ERROR] symbol: class SubstituteVariables
[ERROR] location: class org.apache.sling.feature.io.json.FeatureJSONReader
[ERROR] <https://builds.apache.org/job/sling-org-apache-sling-feature-resolver-1.8/ws/src/main/java/org/apache/sling/feature/resolver/ApplicationResolverAssembler.java>:[50,13] cannot find symbol
[ERROR] symbol: class Application
[ERROR] location: class org.apache.sling.feature.resolver.ApplicationResolverAssembler
[ERROR] <https://builds.apache.org/job/sling-org-apache-sling-feature-resolver-1.8/ws/src/main/java/org/apache/sling/feature/resolver/ApplicationResolverAssembler.java>:[49,19] cannot find symbol
[ERROR] symbol: class Application
[ERROR] location: class org.apache.sling.feature.resolver.ApplicationResolverAssembler
[ERROR] <https://builds.apache.org/job/sling-org-apache-sling-feature-resolver-1.8/ws/src/main/java/org/apache/sling/feature/resolver/ApplicationResolverAssembler.java>:[95,13] cannot find symbol
[ERROR] symbol: class Application
[ERROR] location: class org.apache.sling.feature.resolver.ApplicationResolverAssembler
[ERROR] <https://builds.apache.org/job/sling-org-apache-sling-feature-resolver-1.8/ws/src/main/java/org/apache/sling/feature/resolver/ApplicationResolverAssembler.java>:[94,19] cannot find symbol
[ERROR] symbol: class Application
[ERROR] location: class org.apache.sling.feature.resolver.ApplicationResolverAssembler
[ERROR] <https://builds.apache.org/job/sling-org-apache-sling-feature-resolver-1.8/ws/src/main/java/org/apache/sling/feature/resolver/ApplicationResolverAssembler.java>:[58,81] cannot find symbol
[ERROR] symbol: variable SubstituteVariables
[ERROR] location: class org.apache.sling.feature.resolver.ApplicationResolverAssembler
[ERROR] <https://builds.apache.org/job/sling-org-apache-sling-feature-resolver-1.8/ws/src/main/java/org/apache/sling/feature/resolver/ApplicationResolverAssembler.java>:[111,87] cannot find symbol
[ERROR] symbol: variable SubstituteVariables
[ERROR] <https://builds.apache.org/job/sling-org-apache-sling-feature-resolver-1.8/ws/src/main/java/org/apache/sling/feature/resolver/ApplicationResolverAssembler.java>:[104,15] cannot find symbol
[ERROR] symbol: variable ApplicationBuilder
[ERROR] location: class org.apache.sling.feature.resolver.ApplicationResolverAssembler
[ERROR] -> [Help 1]
[ERROR]
[ERROR] To see the full stack trace of the errors, re-run Maven with the -e switch.
[ERROR] Re-run Maven using the -X switch to enable full debug logging.
[ERROR]
[ERROR] For more information about the errors and possible solutions, please read the following articles:
[ERROR] [Help 1] http://cwiki.apache.org/confluence/display/MAVEN/MojoFailureException
channel stopped
Recording test results
Build failed in Jenkins:
sling-org-apache-sling-feature-resolver-1.8 #57
Posted by Apache Jenkins Server <je...@builds.apache.org>.
See <https://builds.apache.org/job/sling-org-apache-sling-feature-resolver-1.8/57/display/redirect>
------------------------------------------
Started by upstream project "sling-org-apache-sling-feature-analyser-1.8" build number 54
originally caused by:
Started by timer
[EnvInject] - Loading node environment variables.
Building remotely on H27 (ubuntu xenial) in workspace <https://builds.apache.org/job/sling-org-apache-sling-feature-resolver-1.8/ws/>
> git rev-parse --is-inside-work-tree # timeout=10
Fetching changes from the remote Git repository
> git config remote.origin.url https://github.com/apache/sling-org-apache-sling-feature-resolver.git # timeout=10
Fetching upstream changes from https://github.com/apache/sling-org-apache-sling-feature-resolver.git
> git --version # timeout=10
> git fetch --tags --progress https://github.com/apache/sling-org-apache-sling-feature-resolver.git +refs/heads/*:refs/remotes/origin/*
> git rev-parse origin/master^{commit} # timeout=10
Checking out Revision f52d6465fa38070398787727e1a5ea9de69d8b8d (origin/master)
> git config core.sparsecheckout # timeout=10
> git checkout -f f52d6465fa38070398787727e1a5ea9de69d8b8d
Commit message: "Update to Configurator 1.0.4"
> git rev-list --no-walk f52d6465fa38070398787727e1a5ea9de69d8b8d # timeout=10
Parsing POMs
Established TCP socket on 44086
maven33-agent.jar already up to date
maven33-interceptor.jar already up to date
maven3-interceptor-commons.jar already up to date
[sling-org-apache-sling-feature-resolver-1.8] $ /home/jenkins/tools/java/latest1.8/bin/java -Xmx4g -Xms4g -cp /home/jenkins/jenkins-slave/maven33-agent.jar:/home/jenkins/tools/maven/apache-maven-3.3.9/boot/plexus-classworlds-2.5.2.jar:/home/jenkins/tools/maven/apache-maven-3.3.9/conf/logging jenkins.maven3.agent.Maven33Main /home/jenkins/tools/maven/apache-maven-3.3.9 /home/jenkins/jenkins-slave/slave.jar /home/jenkins/jenkins-slave/maven33-interceptor.jar /home/jenkins/jenkins-slave/maven3-interceptor-commons.jar 44086
<===[JENKINS REMOTING CAPACITY]===> channel started
Executing Maven: -B -f <https://builds.apache.org/job/sling-org-apache-sling-feature-resolver-1.8/ws/pom.xml> -Dmaven.repo.local=/home/jenkins/jenkins-slave/maven-repositories/1 -U clean deploy
[INFO] Scanning for projects...
[INFO]
[INFO] ------------------------------------------------------------------------
[INFO] Building Apache Sling Feature Resolver 0.1.0-SNAPSHOT
[INFO] ------------------------------------------------------------------------
[INFO] Downloading: http://repository.apache.org/snapshots/org/apache/sling/org.apache.sling.feature/0.1.3-SNAPSHOT/maven-metadata.xml
[INFO] Downloaded: http://repository.apache.org/snapshots/org/apache/sling/org.apache.sling.feature/0.1.3-SNAPSHOT/maven-metadata.xml (1008 B at 2.3 KB/sec)
[INFO] Downloading: http://repository.apache.org/snapshots/org/apache/sling/org.apache.sling.feature.analyser/0.1.3-SNAPSHOT/maven-metadata.xml
[INFO] Downloaded: http://repository.apache.org/snapshots/org/apache/sling/org.apache.sling.feature.analyser/0.1.3-SNAPSHOT/maven-metadata.xml (1017 B at 3.4 KB/sec)
[INFO] Downloading: http://repository.apache.org/snapshots/org/apache/sling/org.apache.sling.feature.analyser/0.1.3-SNAPSHOT/org.apache.sling.feature.analyser-0.1.3-20180817.021107-43.pom
[INFO] Downloaded: http://repository.apache.org/snapshots/org/apache/sling/org.apache.sling.feature.analyser/0.1.3-SNAPSHOT/org.apache.sling.feature.analyser-0.1.3-20180817.021107-43.pom (7 KB at 23.2 KB/sec)
[INFO] Downloading: http://repository.apache.org/snapshots/org/apache/sling/org.apache.sling.feature.io/0.1.3-SNAPSHOT/maven-metadata.xml
[INFO] Downloaded: http://repository.apache.org/snapshots/org/apache/sling/org.apache.sling.feature.io/0.1.3-SNAPSHOT/maven-metadata.xml (1011 B at 3.4 KB/sec)
[INFO] Downloading: http://repository.apache.org/snapshots/org/apache/sling/org.apache.sling.feature.analyser/0.1.3-SNAPSHOT/org.apache.sling.feature.analyser-0.1.3-20180817.021107-43.jar
[INFO] Downloaded: http://repository.apache.org/snapshots/org/apache/sling/org.apache.sling.feature.analyser/0.1.3-SNAPSHOT/org.apache.sling.feature.analyser-0.1.3-20180817.021107-43.jar (1386 KB at 1985.2 KB/sec)
[INFO]
[INFO] --- maven-clean-plugin:3.0.0:clean (default-clean) @ org.apache.sling.feature.resolver ---
[INFO] Deleting <https://builds.apache.org/job/sling-org-apache-sling-feature-resolver-1.8/ws/target>
[INFO]
[INFO] --- maven-enforcer-plugin:3.0.0-M1:enforce (enforce-property-values) @ org.apache.sling.feature.resolver ---
[INFO]
[INFO] --- maven-enforcer-plugin:3.0.0-M1:enforce (enforce-java) @ org.apache.sling.feature.resolver ---
[INFO]
[INFO] --- maven-enforcer-plugin:3.0.0-M1:enforce (ban-maven-scr-plugin) @ org.apache.sling.feature.resolver ---
[INFO]
[INFO] --- maven-remote-resources-plugin:1.5:process (process-resource-bundles) @ org.apache.sling.feature.resolver ---
[INFO]
[INFO] --- maven-remote-resources-plugin:1.5:process (default) @ org.apache.sling.feature.resolver ---
[INFO]
[INFO] --- maven-resources-plugin:2.7:resources (default-resources) @ org.apache.sling.feature.resolver ---
[INFO] Using 'UTF-8' encoding to copy filtered resources.
[INFO] skip non existing resourceDirectory <https://builds.apache.org/job/sling-org-apache-sling-feature-resolver-1.8/ws/src/main/resources>
[INFO] Copying 3 resources
[INFO] Copying 3 resources
[INFO]
[INFO] --- maven-compiler-plugin:3.7.0:compile (default-compile) @ org.apache.sling.feature.resolver ---
[INFO] Changes detected - recompiling the module!
[INFO] Compiling 11 source files to <https://builds.apache.org/job/sling-org-apache-sling-feature-resolver-1.8/ws/target/classes>
[INFO] -------------------------------------------------------------
[ERROR] COMPILATION ERROR :
[INFO] -------------------------------------------------------------
[ERROR] <https://builds.apache.org/job/sling-org-apache-sling-feature-resolver-1.8/ws/src/main/java/org/apache/sling/feature/resolver/ApplicationResolverAssembler.java>:[19,32] cannot find symbol
symbol: class Application
location: package org.apache.sling.feature
[ERROR] <https://builds.apache.org/job/sling-org-apache-sling-feature-resolver-1.8/ws/src/main/java/org/apache/sling/feature/resolver/ApplicationResolverAssembler.java>:[22,40] cannot find symbol
symbol: class ApplicationBuilder
location: package org.apache.sling.feature.builder
[ERROR] <https://builds.apache.org/job/sling-org-apache-sling-feature-resolver-1.8/ws/src/main/java/org/apache/sling/feature/resolver/ApplicationResolverAssembler.java>:[29,58] cannot find symbol
symbol: class SubstituteVariables
location: class org.apache.sling.feature.io.json.FeatureJSONReader
[ERROR] <https://builds.apache.org/job/sling-org-apache-sling-feature-resolver-1.8/ws/src/main/java/org/apache/sling/feature/resolver/ApplicationResolverAssembler.java>:[50,13] cannot find symbol
symbol: class Application
location: class org.apache.sling.feature.resolver.ApplicationResolverAssembler
[ERROR] <https://builds.apache.org/job/sling-org-apache-sling-feature-resolver-1.8/ws/src/main/java/org/apache/sling/feature/resolver/ApplicationResolverAssembler.java>:[49,19] cannot find symbol
symbol: class Application
location: class org.apache.sling.feature.resolver.ApplicationResolverAssembler
[ERROR] <https://builds.apache.org/job/sling-org-apache-sling-feature-resolver-1.8/ws/src/main/java/org/apache/sling/feature/resolver/ApplicationResolverAssembler.java>:[95,13] cannot find symbol
symbol: class Application
location: class org.apache.sling.feature.resolver.ApplicationResolverAssembler
[ERROR] <https://builds.apache.org/job/sling-org-apache-sling-feature-resolver-1.8/ws/src/main/java/org/apache/sling/feature/resolver/ApplicationResolverAssembler.java>:[94,19] cannot find symbol
symbol: class Application
location: class org.apache.sling.feature.resolver.ApplicationResolverAssembler
[ERROR] <https://builds.apache.org/job/sling-org-apache-sling-feature-resolver-1.8/ws/src/main/java/org/apache/sling/feature/resolver/ApplicationResolverAssembler.java>:[58,81] cannot find symbol
symbol: variable SubstituteVariables
location: class org.apache.sling.feature.resolver.ApplicationResolverAssembler
[ERROR] <https://builds.apache.org/job/sling-org-apache-sling-feature-resolver-1.8/ws/src/main/java/org/apache/sling/feature/resolver/ApplicationResolverAssembler.java>:[111,87] cannot find symbol
symbol: variable SubstituteVariables
[ERROR] <https://builds.apache.org/job/sling-org-apache-sling-feature-resolver-1.8/ws/src/main/java/org/apache/sling/feature/resolver/ApplicationResolverAssembler.java>:[104,15] cannot find symbol
symbol: variable ApplicationBuilder
location: class org.apache.sling.feature.resolver.ApplicationResolverAssembler
[INFO] 10 errors
[INFO] -------------------------------------------------------------
[WARNING] Attempt to (de-)serialize anonymous class hudson.maven.reporters.MavenArtifactArchiver$2; see: https://jenkins.io/redirect/serialization-of-anonymous-classes/
[JENKINS] Archiving disabled
[WARNING] Attempt to (de-)serialize anonymous class hudson.maven.reporters.MavenFingerprinter$1; see: https://jenkins.io/redirect/serialization-of-anonymous-classes/
[JENKINS] Archiving disabled
[INFO] ------------------------------------------------------------------------
[INFO] BUILD FAILURE
[INFO] ------------------------------------------------------------------------
[INFO] Total time: 17.760 s
[INFO] Finished at: 2018-08-17T02:12:10+00:00
[INFO] Final Memory: 48M/3925M
[INFO] ------------------------------------------------------------------------
Waiting for Jenkins to finish collecting data
[ERROR] Failed to execute goal org.apache.maven.plugins:maven-compiler-plugin:3.7.0:compile (default-compile) on project org.apache.sling.feature.resolver: Compilation failure: Compilation failure:
[ERROR] <https://builds.apache.org/job/sling-org-apache-sling-feature-resolver-1.8/ws/src/main/java/org/apache/sling/feature/resolver/ApplicationResolverAssembler.java>:[19,32] cannot find symbol
[ERROR] symbol: class Application
[ERROR] location: package org.apache.sling.feature
[ERROR] <https://builds.apache.org/job/sling-org-apache-sling-feature-resolver-1.8/ws/src/main/java/org/apache/sling/feature/resolver/ApplicationResolverAssembler.java>:[22,40] cannot find symbol
[ERROR] symbol: class ApplicationBuilder
[ERROR] location: package org.apache.sling.feature.builder
[ERROR] <https://builds.apache.org/job/sling-org-apache-sling-feature-resolver-1.8/ws/src/main/java/org/apache/sling/feature/resolver/ApplicationResolverAssembler.java>:[29,58] cannot find symbol
[ERROR] symbol: class SubstituteVariables
[ERROR] location: class org.apache.sling.feature.io.json.FeatureJSONReader
[ERROR] <https://builds.apache.org/job/sling-org-apache-sling-feature-resolver-1.8/ws/src/main/java/org/apache/sling/feature/resolver/ApplicationResolverAssembler.java>:[50,13] cannot find symbol
[ERROR] symbol: class Application
[ERROR] location: class org.apache.sling.feature.resolver.ApplicationResolverAssembler
[ERROR] <https://builds.apache.org/job/sling-org-apache-sling-feature-resolver-1.8/ws/src/main/java/org/apache/sling/feature/resolver/ApplicationResolverAssembler.java>:[49,19] cannot find symbol
[ERROR] symbol: class Application
[ERROR] location: class org.apache.sling.feature.resolver.ApplicationResolverAssembler
[ERROR] <https://builds.apache.org/job/sling-org-apache-sling-feature-resolver-1.8/ws/src/main/java/org/apache/sling/feature/resolver/ApplicationResolverAssembler.java>:[95,13] cannot find symbol
[ERROR] symbol: class Application
[ERROR] location: class org.apache.sling.feature.resolver.ApplicationResolverAssembler
[ERROR] <https://builds.apache.org/job/sling-org-apache-sling-feature-resolver-1.8/ws/src/main/java/org/apache/sling/feature/resolver/ApplicationResolverAssembler.java>:[94,19] cannot find symbol
[ERROR] symbol: class Application
[ERROR] location: class org.apache.sling.feature.resolver.ApplicationResolverAssembler
[ERROR] <https://builds.apache.org/job/sling-org-apache-sling-feature-resolver-1.8/ws/src/main/java/org/apache/sling/feature/resolver/ApplicationResolverAssembler.java>:[58,81] cannot find symbol
[ERROR] symbol: variable SubstituteVariables
[ERROR] location: class org.apache.sling.feature.resolver.ApplicationResolverAssembler
[ERROR] <https://builds.apache.org/job/sling-org-apache-sling-feature-resolver-1.8/ws/src/main/java/org/apache/sling/feature/resolver/ApplicationResolverAssembler.java>:[111,87] cannot find symbol
[ERROR] symbol: variable SubstituteVariables
[ERROR] <https://builds.apache.org/job/sling-org-apache-sling-feature-resolver-1.8/ws/src/main/java/org/apache/sling/feature/resolver/ApplicationResolverAssembler.java>:[104,15] cannot find symbol
[ERROR] symbol: variable ApplicationBuilder
[ERROR] location: class org.apache.sling.feature.resolver.ApplicationResolverAssembler
[ERROR] -> [Help 1]
[ERROR]
[ERROR] To see the full stack trace of the errors, re-run Maven with the -e switch.
[ERROR] Re-run Maven using the -X switch to enable full debug logging.
[ERROR]
[ERROR] For more information about the errors and possible solutions, please read the following articles:
[ERROR] [Help 1] http://cwiki.apache.org/confluence/display/MAVEN/MojoFailureException
channel stopped
Recording test results
Build failed in Jenkins:
sling-org-apache-sling-feature-resolver-1.8 #56
Posted by Apache Jenkins Server <je...@builds.apache.org>.
See <https://builds.apache.org/job/sling-org-apache-sling-feature-resolver-1.8/56/display/redirect>
------------------------------------------
Started by upstream project "sling-org-apache-sling-feature-analyser-1.8" build number 53
originally caused by:
Started by upstream project "sling-org-apache-sling-feature-io-1.8" build number 40
originally caused by:
Started by upstream project "sling-org-apache-sling-feature-1.8" build number 30
originally caused by:
Started by timer
[EnvInject] - Loading node environment variables.
Building remotely on H27 (ubuntu xenial) in workspace <https://builds.apache.org/job/sling-org-apache-sling-feature-resolver-1.8/ws/>
> git rev-parse --is-inside-work-tree # timeout=10
Fetching changes from the remote Git repository
> git config remote.origin.url https://github.com/apache/sling-org-apache-sling-feature-resolver.git # timeout=10
Fetching upstream changes from https://github.com/apache/sling-org-apache-sling-feature-resolver.git
> git --version # timeout=10
> git fetch --tags --progress https://github.com/apache/sling-org-apache-sling-feature-resolver.git +refs/heads/*:refs/remotes/origin/*
> git rev-parse origin/master^{commit} # timeout=10
Checking out Revision f52d6465fa38070398787727e1a5ea9de69d8b8d (origin/master)
> git config core.sparsecheckout # timeout=10
> git checkout -f f52d6465fa38070398787727e1a5ea9de69d8b8d
Commit message: "Update to Configurator 1.0.4"
> git rev-list --no-walk f52d6465fa38070398787727e1a5ea9de69d8b8d # timeout=10
Parsing POMs
Established TCP socket on 43819
maven33-agent.jar already up to date
maven33-interceptor.jar already up to date
maven3-interceptor-commons.jar already up to date
[sling-org-apache-sling-feature-resolver-1.8] $ /home/jenkins/tools/java/latest1.8/bin/java -Xmx4g -Xms4g -cp /home/jenkins/jenkins-slave/maven33-agent.jar:/home/jenkins/tools/maven/apache-maven-3.3.9/boot/plexus-classworlds-2.5.2.jar:/home/jenkins/tools/maven/apache-maven-3.3.9/conf/logging jenkins.maven3.agent.Maven33Main /home/jenkins/tools/maven/apache-maven-3.3.9 /home/jenkins/jenkins-slave/slave.jar /home/jenkins/jenkins-slave/maven33-interceptor.jar /home/jenkins/jenkins-slave/maven3-interceptor-commons.jar 43819
<===[JENKINS REMOTING CAPACITY]===> channel started
Executing Maven: -B -f <https://builds.apache.org/job/sling-org-apache-sling-feature-resolver-1.8/ws/pom.xml> -Dmaven.repo.local=/home/jenkins/jenkins-slave/maven-repositories/0 -U clean deploy
[INFO] Scanning for projects...
[INFO]
[INFO] ------------------------------------------------------------------------
[INFO] Building Apache Sling Feature Resolver 0.1.0-SNAPSHOT
[INFO] ------------------------------------------------------------------------
[INFO] Downloading: http://repository.apache.org/snapshots/org/apache/sling/org.apache.sling.feature/0.1.3-SNAPSHOT/maven-metadata.xml
[INFO] Downloaded: http://repository.apache.org/snapshots/org/apache/sling/org.apache.sling.feature/0.1.3-SNAPSHOT/maven-metadata.xml (1008 B at 2.6 KB/sec)
[INFO] Downloading: http://repository.apache.org/snapshots/org/apache/sling/org.apache.sling.feature.analyser/0.1.3-SNAPSHOT/maven-metadata.xml
[INFO] Downloaded: http://repository.apache.org/snapshots/org/apache/sling/org.apache.sling.feature.analyser/0.1.3-SNAPSHOT/maven-metadata.xml (1017 B at 3.3 KB/sec)
[INFO] Downloading: http://repository.apache.org/snapshots/org/apache/sling/org.apache.sling.feature.analyser/0.1.3-SNAPSHOT/org.apache.sling.feature.analyser-0.1.3-20180816.163139-42.pom
[INFO] Downloaded: http://repository.apache.org/snapshots/org/apache/sling/org.apache.sling.feature.analyser/0.1.3-SNAPSHOT/org.apache.sling.feature.analyser-0.1.3-20180816.163139-42.pom (7 KB at 22.5 KB/sec)
[INFO] Downloading: http://repository.apache.org/snapshots/org/apache/sling/org.apache.sling.feature.io/0.1.3-SNAPSHOT/maven-metadata.xml
[INFO] Downloaded: http://repository.apache.org/snapshots/org/apache/sling/org.apache.sling.feature.io/0.1.3-SNAPSHOT/maven-metadata.xml (1011 B at 3.3 KB/sec)
[INFO] Downloading: http://repository.apache.org/snapshots/org/apache/sling/org.apache.sling.feature.analyser/0.1.3-SNAPSHOT/org.apache.sling.feature.analyser-0.1.3-20180816.163139-42.jar
[INFO] Downloaded: http://repository.apache.org/snapshots/org/apache/sling/org.apache.sling.feature.analyser/0.1.3-SNAPSHOT/org.apache.sling.feature.analyser-0.1.3-20180816.163139-42.jar (1386 KB at 1951.7 KB/sec)
[INFO]
[INFO] --- maven-clean-plugin:3.0.0:clean (default-clean) @ org.apache.sling.feature.resolver ---
[INFO] Deleting <https://builds.apache.org/job/sling-org-apache-sling-feature-resolver-1.8/ws/target>
[INFO]
[INFO] --- maven-enforcer-plugin:3.0.0-M1:enforce (enforce-property-values) @ org.apache.sling.feature.resolver ---
[INFO]
[INFO] --- maven-enforcer-plugin:3.0.0-M1:enforce (enforce-java) @ org.apache.sling.feature.resolver ---
[INFO]
[INFO] --- maven-enforcer-plugin:3.0.0-M1:enforce (ban-maven-scr-plugin) @ org.apache.sling.feature.resolver ---
[INFO]
[INFO] --- maven-remote-resources-plugin:1.5:process (process-resource-bundles) @ org.apache.sling.feature.resolver ---
[INFO]
[INFO] --- maven-remote-resources-plugin:1.5:process (default) @ org.apache.sling.feature.resolver ---
[INFO]
[INFO] --- maven-resources-plugin:2.7:resources (default-resources) @ org.apache.sling.feature.resolver ---
[INFO] Using 'UTF-8' encoding to copy filtered resources.
[INFO] skip non existing resourceDirectory <https://builds.apache.org/job/sling-org-apache-sling-feature-resolver-1.8/ws/src/main/resources>
[INFO] Copying 3 resources
[INFO] Copying 3 resources
[INFO]
[INFO] --- maven-compiler-plugin:3.7.0:compile (default-compile) @ org.apache.sling.feature.resolver ---
[INFO] Changes detected - recompiling the module!
[INFO] Compiling 11 source files to <https://builds.apache.org/job/sling-org-apache-sling-feature-resolver-1.8/ws/target/classes>
[INFO] -------------------------------------------------------------
[ERROR] COMPILATION ERROR :
[INFO] -------------------------------------------------------------
[ERROR] <https://builds.apache.org/job/sling-org-apache-sling-feature-resolver-1.8/ws/src/main/java/org/apache/sling/feature/resolver/ApplicationResolverAssembler.java>:[19,32] cannot find symbol
symbol: class Application
location: package org.apache.sling.feature
[ERROR] <https://builds.apache.org/job/sling-org-apache-sling-feature-resolver-1.8/ws/src/main/java/org/apache/sling/feature/resolver/ApplicationResolverAssembler.java>:[22,40] cannot find symbol
symbol: class ApplicationBuilder
location: package org.apache.sling.feature.builder
[ERROR] <https://builds.apache.org/job/sling-org-apache-sling-feature-resolver-1.8/ws/src/main/java/org/apache/sling/feature/resolver/ApplicationResolverAssembler.java>:[29,58] cannot find symbol
symbol: class SubstituteVariables
location: class org.apache.sling.feature.io.json.FeatureJSONReader
[ERROR] <https://builds.apache.org/job/sling-org-apache-sling-feature-resolver-1.8/ws/src/main/java/org/apache/sling/feature/resolver/ApplicationResolverAssembler.java>:[50,13] cannot find symbol
symbol: class Application
location: class org.apache.sling.feature.resolver.ApplicationResolverAssembler
[ERROR] <https://builds.apache.org/job/sling-org-apache-sling-feature-resolver-1.8/ws/src/main/java/org/apache/sling/feature/resolver/ApplicationResolverAssembler.java>:[49,19] cannot find symbol
symbol: class Application
location: class org.apache.sling.feature.resolver.ApplicationResolverAssembler
[ERROR] <https://builds.apache.org/job/sling-org-apache-sling-feature-resolver-1.8/ws/src/main/java/org/apache/sling/feature/resolver/ApplicationResolverAssembler.java>:[95,13] cannot find symbol
symbol: class Application
location: class org.apache.sling.feature.resolver.ApplicationResolverAssembler
[ERROR] <https://builds.apache.org/job/sling-org-apache-sling-feature-resolver-1.8/ws/src/main/java/org/apache/sling/feature/resolver/ApplicationResolverAssembler.java>:[94,19] cannot find symbol
symbol: class Application
location: class org.apache.sling.feature.resolver.ApplicationResolverAssembler
[ERROR] <https://builds.apache.org/job/sling-org-apache-sling-feature-resolver-1.8/ws/src/main/java/org/apache/sling/feature/resolver/ApplicationResolverAssembler.java>:[58,81] cannot find symbol
symbol: variable SubstituteVariables
location: class org.apache.sling.feature.resolver.ApplicationResolverAssembler
[ERROR] <https://builds.apache.org/job/sling-org-apache-sling-feature-resolver-1.8/ws/src/main/java/org/apache/sling/feature/resolver/ApplicationResolverAssembler.java>:[111,87] cannot find symbol
symbol: variable SubstituteVariables
[ERROR] <https://builds.apache.org/job/sling-org-apache-sling-feature-resolver-1.8/ws/src/main/java/org/apache/sling/feature/resolver/ApplicationResolverAssembler.java>:[104,15] cannot find symbol
symbol: variable ApplicationBuilder
location: class org.apache.sling.feature.resolver.ApplicationResolverAssembler
[INFO] 10 errors
[INFO] -------------------------------------------------------------
[WARNING] Attempt to (de-)serialize anonymous class hudson.maven.reporters.MavenArtifactArchiver$2; see: https://jenkins.io/redirect/serialization-of-anonymous-classes/
[JENKINS] Archiving disabled
[WARNING] Attempt to (de-)serialize anonymous class hudson.maven.reporters.MavenFingerprinter$1; see: https://jenkins.io/redirect/serialization-of-anonymous-classes/
[JENKINS] Archiving disabled
[INFO] ------------------------------------------------------------------------
[INFO] BUILD FAILURE
[INFO] ------------------------------------------------------------------------
[INFO] Total time: 16.901 s
[INFO] Finished at: 2018-08-16T16:53:43+00:00
[INFO] Final Memory: 48M/3925M
[INFO] ------------------------------------------------------------------------
Waiting for Jenkins to finish collecting data
[ERROR] Failed to execute goal org.apache.maven.plugins:maven-compiler-plugin:3.7.0:compile (default-compile) on project org.apache.sling.feature.resolver: Compilation failure: Compilation failure:
[ERROR] <https://builds.apache.org/job/sling-org-apache-sling-feature-resolver-1.8/ws/src/main/java/org/apache/sling/feature/resolver/ApplicationResolverAssembler.java>:[19,32] cannot find symbol
[ERROR] symbol: class Application
[ERROR] location: package org.apache.sling.feature
[ERROR] <https://builds.apache.org/job/sling-org-apache-sling-feature-resolver-1.8/ws/src/main/java/org/apache/sling/feature/resolver/ApplicationResolverAssembler.java>:[22,40] cannot find symbol
[ERROR] symbol: class ApplicationBuilder
[ERROR] location: package org.apache.sling.feature.builder
[ERROR] <https://builds.apache.org/job/sling-org-apache-sling-feature-resolver-1.8/ws/src/main/java/org/apache/sling/feature/resolver/ApplicationResolverAssembler.java>:[29,58] cannot find symbol
[ERROR] symbol: class SubstituteVariables
[ERROR] location: class org.apache.sling.feature.io.json.FeatureJSONReader
[ERROR] <https://builds.apache.org/job/sling-org-apache-sling-feature-resolver-1.8/ws/src/main/java/org/apache/sling/feature/resolver/ApplicationResolverAssembler.java>:[50,13] cannot find symbol
[ERROR] symbol: class Application
[ERROR] location: class org.apache.sling.feature.resolver.ApplicationResolverAssembler
[ERROR] <https://builds.apache.org/job/sling-org-apache-sling-feature-resolver-1.8/ws/src/main/java/org/apache/sling/feature/resolver/ApplicationResolverAssembler.java>:[49,19] cannot find symbol
[ERROR] symbol: class Application
[ERROR] location: class org.apache.sling.feature.resolver.ApplicationResolverAssembler
[ERROR] <https://builds.apache.org/job/sling-org-apache-sling-feature-resolver-1.8/ws/src/main/java/org/apache/sling/feature/resolver/ApplicationResolverAssembler.java>:[95,13] cannot find symbol
[ERROR] symbol: class Application
[ERROR] location: class org.apache.sling.feature.resolver.ApplicationResolverAssembler
[ERROR] <https://builds.apache.org/job/sling-org-apache-sling-feature-resolver-1.8/ws/src/main/java/org/apache/sling/feature/resolver/ApplicationResolverAssembler.java>:[94,19] cannot find symbol
[ERROR] symbol: class Application
[ERROR] location: class org.apache.sling.feature.resolver.ApplicationResolverAssembler
[ERROR] <https://builds.apache.org/job/sling-org-apache-sling-feature-resolver-1.8/ws/src/main/java/org/apache/sling/feature/resolver/ApplicationResolverAssembler.java>:[58,81] cannot find symbol
[ERROR] symbol: variable SubstituteVariables
[ERROR] location: class org.apache.sling.feature.resolver.ApplicationResolverAssembler
[ERROR] <https://builds.apache.org/job/sling-org-apache-sling-feature-resolver-1.8/ws/src/main/java/org/apache/sling/feature/resolver/ApplicationResolverAssembler.java>:[111,87] cannot find symbol
[ERROR] symbol: variable SubstituteVariables
[ERROR] <https://builds.apache.org/job/sling-org-apache-sling-feature-resolver-1.8/ws/src/main/java/org/apache/sling/feature/resolver/ApplicationResolverAssembler.java>:[104,15] cannot find symbol
[ERROR] symbol: variable ApplicationBuilder
[ERROR] location: class org.apache.sling.feature.resolver.ApplicationResolverAssembler
[ERROR] -> [Help 1]
[ERROR]
[ERROR] To see the full stack trace of the errors, re-run Maven with the -e switch.
[ERROR] Re-run Maven using the -X switch to enable full debug logging.
[ERROR]
[ERROR] For more information about the errors and possible solutions, please read the following articles:
[ERROR] [Help 1] http://cwiki.apache.org/confluence/display/MAVEN/MojoFailureException
channel stopped
Recording test results
Build failed in Jenkins:
sling-org-apache-sling-feature-resolver-1.8 #55
Posted by Apache Jenkins Server <je...@builds.apache.org>.
See <https://builds.apache.org/job/sling-org-apache-sling-feature-resolver-1.8/55/display/redirect>
------------------------------------------
Started by timer
[EnvInject] - Loading node environment variables.
Building remotely on H27 (ubuntu xenial) in workspace <https://builds.apache.org/job/sling-org-apache-sling-feature-resolver-1.8/ws/>
> git rev-parse --is-inside-work-tree # timeout=10
Fetching changes from the remote Git repository
> git config remote.origin.url https://github.com/apache/sling-org-apache-sling-feature-resolver.git # timeout=10
Fetching upstream changes from https://github.com/apache/sling-org-apache-sling-feature-resolver.git
> git --version # timeout=10
> git fetch --tags --progress https://github.com/apache/sling-org-apache-sling-feature-resolver.git +refs/heads/*:refs/remotes/origin/*
> git rev-parse origin/master^{commit} # timeout=10
Checking out Revision f52d6465fa38070398787727e1a5ea9de69d8b8d (origin/master)
> git config core.sparsecheckout # timeout=10
> git checkout -f f52d6465fa38070398787727e1a5ea9de69d8b8d
Commit message: "Update to Configurator 1.0.4"
> git rev-list --no-walk f52d6465fa38070398787727e1a5ea9de69d8b8d # timeout=10
Parsing POMs
Established TCP socket on 43574
maven33-agent.jar already up to date
maven33-interceptor.jar already up to date
maven3-interceptor-commons.jar already up to date
[sling-org-apache-sling-feature-resolver-1.8] $ /home/jenkins/tools/java/latest1.8/bin/java -Xmx4g -Xms4g -cp /home/jenkins/jenkins-slave/maven33-agent.jar:/home/jenkins/tools/maven/apache-maven-3.3.9/boot/plexus-classworlds-2.5.2.jar:/home/jenkins/tools/maven/apache-maven-3.3.9/conf/logging jenkins.maven3.agent.Maven33Main /home/jenkins/tools/maven/apache-maven-3.3.9 /home/jenkins/jenkins-slave/slave.jar /home/jenkins/jenkins-slave/maven33-interceptor.jar /home/jenkins/jenkins-slave/maven3-interceptor-commons.jar 43574
<===[JENKINS REMOTING CAPACITY]===> channel started
Executing Maven: -B -f <https://builds.apache.org/job/sling-org-apache-sling-feature-resolver-1.8/ws/pom.xml> -Dmaven.repo.local=/home/jenkins/jenkins-slave/maven-repositories/0 -U clean deploy
[INFO] Scanning for projects...
[INFO]
[INFO] ------------------------------------------------------------------------
[INFO] Building Apache Sling Feature Resolver 0.1.0-SNAPSHOT
[INFO] ------------------------------------------------------------------------
[INFO] Downloading: http://repository.apache.org/snapshots/org/apache/sling/org.apache.sling.feature/0.1.3-SNAPSHOT/maven-metadata.xml
[INFO] Downloaded: http://repository.apache.org/snapshots/org/apache/sling/org.apache.sling.feature/0.1.3-SNAPSHOT/maven-metadata.xml (1008 B at 2.2 KB/sec)
[INFO] Downloading: http://repository.apache.org/snapshots/org/apache/sling/org.apache.sling.feature/0.1.3-SNAPSHOT/org.apache.sling.feature-0.1.3-20180815.133154-24.pom
[INFO] Downloaded: http://repository.apache.org/snapshots/org/apache/sling/org.apache.sling.feature/0.1.3-SNAPSHOT/org.apache.sling.feature-0.1.3-20180815.133154-24.pom (5 KB at 13.3 KB/sec)
[INFO] Downloading: http://repository.apache.org/snapshots/org/apache/sling/org.apache.sling.feature.analyser/0.1.3-SNAPSHOT/maven-metadata.xml
[INFO] Downloaded: http://repository.apache.org/snapshots/org/apache/sling/org.apache.sling.feature.analyser/0.1.3-SNAPSHOT/maven-metadata.xml (1017 B at 3.1 KB/sec)
[INFO] Downloading: http://repository.apache.org/snapshots/org/apache/sling/org.apache.sling.feature.analyser/0.1.3-SNAPSHOT/org.apache.sling.feature.analyser-0.1.3-20180815.153532-41.pom
[INFO] Downloaded: http://repository.apache.org/snapshots/org/apache/sling/org.apache.sling.feature.analyser/0.1.3-SNAPSHOT/org.apache.sling.feature.analyser-0.1.3-20180815.153532-41.pom (7 KB at 21.9 KB/sec)
[INFO] Downloading: http://repository.apache.org/snapshots/org/apache/sling/org.apache.sling.feature.io/0.1.3-SNAPSHOT/maven-metadata.xml
[INFO] Downloaded: http://repository.apache.org/snapshots/org/apache/sling/org.apache.sling.feature.io/0.1.3-SNAPSHOT/maven-metadata.xml (1011 B at 3.1 KB/sec)
[INFO] Downloading: http://repository.apache.org/snapshots/org/apache/sling/org.apache.sling.feature.io/0.1.3-SNAPSHOT/org.apache.sling.feature.io-0.1.3-20180815.133403-32.pom
[INFO] Downloaded: http://repository.apache.org/snapshots/org/apache/sling/org.apache.sling.feature.io/0.1.3-SNAPSHOT/org.apache.sling.feature.io-0.1.3-20180815.133403-32.pom (6 KB at 16.8 KB/sec)
[INFO] Downloading: https://repo.maven.apache.org/maven2/org/apache/felix/org.apache.felix.configurator/1.0.4/org.apache.felix.configurator-1.0.4.pom
[INFO] Downloaded: https://repo.maven.apache.org/maven2/org/apache/felix/org.apache.felix.configurator/1.0.4/org.apache.felix.configurator-1.0.4.pom (7 KB at 29.1 KB/sec)
[INFO] Downloading: http://repository.apache.org/snapshots/org/apache/sling/org.apache.sling.feature/0.1.3-SNAPSHOT/org.apache.sling.feature-0.1.3-20180815.133154-24.jar
[INFO] Downloading: http://repository.apache.org/snapshots/org/apache/sling/org.apache.sling.feature.analyser/0.1.3-SNAPSHOT/org.apache.sling.feature.analyser-0.1.3-20180815.153532-41.jar
[INFO] Downloading: http://repository.apache.org/snapshots/org/apache/sling/org.apache.sling.feature.io/0.1.3-SNAPSHOT/org.apache.sling.feature.io-0.1.3-20180815.133403-32.jar
[INFO] Downloaded: http://repository.apache.org/snapshots/org/apache/sling/org.apache.sling.feature.io/0.1.3-SNAPSHOT/org.apache.sling.feature.io-0.1.3-20180815.133403-32.jar (103 KB at 199.5 KB/sec)
[INFO] Downloaded: http://repository.apache.org/snapshots/org/apache/sling/org.apache.sling.feature/0.1.3-SNAPSHOT/org.apache.sling.feature-0.1.3-20180815.133154-24.jar (103 KB at 198.7 KB/sec)
[INFO] Downloaded: http://repository.apache.org/snapshots/org/apache/sling/org.apache.sling.feature.analyser/0.1.3-SNAPSHOT/org.apache.sling.feature.analyser-0.1.3-20180815.153532-41.jar (1386 KB at 1847.6 KB/sec)
[INFO] Downloading: https://repo.maven.apache.org/maven2/org/apache/felix/org.apache.felix.configurator/1.0.4/org.apache.felix.configurator-1.0.4.jar
[INFO] Downloaded: https://repo.maven.apache.org/maven2/org/apache/felix/org.apache.felix.configurator/1.0.4/org.apache.felix.configurator-1.0.4.jar (283 KB at 3035.1 KB/sec)
[INFO]
[INFO] --- maven-clean-plugin:3.0.0:clean (default-clean) @ org.apache.sling.feature.resolver ---
[INFO] Deleting <https://builds.apache.org/job/sling-org-apache-sling-feature-resolver-1.8/ws/target>
[INFO]
[INFO] --- maven-enforcer-plugin:3.0.0-M1:enforce (enforce-property-values) @ org.apache.sling.feature.resolver ---
[INFO]
[INFO] --- maven-enforcer-plugin:3.0.0-M1:enforce (enforce-java) @ org.apache.sling.feature.resolver ---
[INFO]
[INFO] --- maven-enforcer-plugin:3.0.0-M1:enforce (ban-maven-scr-plugin) @ org.apache.sling.feature.resolver ---
[INFO]
[INFO] --- maven-remote-resources-plugin:1.5:process (process-resource-bundles) @ org.apache.sling.feature.resolver ---
[INFO]
[INFO] --- maven-remote-resources-plugin:1.5:process (default) @ org.apache.sling.feature.resolver ---
[INFO]
[INFO] --- maven-resources-plugin:2.7:resources (default-resources) @ org.apache.sling.feature.resolver ---
[INFO] Using 'UTF-8' encoding to copy filtered resources.
[INFO] skip non existing resourceDirectory <https://builds.apache.org/job/sling-org-apache-sling-feature-resolver-1.8/ws/src/main/resources>
[INFO] Copying 3 resources
[INFO] Copying 3 resources
[INFO]
[INFO] --- maven-compiler-plugin:3.7.0:compile (default-compile) @ org.apache.sling.feature.resolver ---
[INFO] Changes detected - recompiling the module!
[INFO] Compiling 11 source files to <https://builds.apache.org/job/sling-org-apache-sling-feature-resolver-1.8/ws/target/classes>
[INFO] -------------------------------------------------------------
[ERROR] COMPILATION ERROR :
[INFO] -------------------------------------------------------------
[ERROR] <https://builds.apache.org/job/sling-org-apache-sling-feature-resolver-1.8/ws/src/main/java/org/apache/sling/feature/resolver/ApplicationResolverAssembler.java>:[19,32] cannot find symbol
symbol: class Application
location: package org.apache.sling.feature
[ERROR] <https://builds.apache.org/job/sling-org-apache-sling-feature-resolver-1.8/ws/src/main/java/org/apache/sling/feature/resolver/ApplicationResolverAssembler.java>:[22,40] cannot find symbol
symbol: class ApplicationBuilder
location: package org.apache.sling.feature.builder
[ERROR] <https://builds.apache.org/job/sling-org-apache-sling-feature-resolver-1.8/ws/src/main/java/org/apache/sling/feature/resolver/ApplicationResolverAssembler.java>:[29,58] cannot find symbol
symbol: class SubstituteVariables
location: class org.apache.sling.feature.io.json.FeatureJSONReader
[ERROR] <https://builds.apache.org/job/sling-org-apache-sling-feature-resolver-1.8/ws/src/main/java/org/apache/sling/feature/resolver/ApplicationResolverAssembler.java>:[50,13] cannot find symbol
symbol: class Application
location: class org.apache.sling.feature.resolver.ApplicationResolverAssembler
[ERROR] <https://builds.apache.org/job/sling-org-apache-sling-feature-resolver-1.8/ws/src/main/java/org/apache/sling/feature/resolver/ApplicationResolverAssembler.java>:[49,19] cannot find symbol
symbol: class Application
location: class org.apache.sling.feature.resolver.ApplicationResolverAssembler
[ERROR] <https://builds.apache.org/job/sling-org-apache-sling-feature-resolver-1.8/ws/src/main/java/org/apache/sling/feature/resolver/ApplicationResolverAssembler.java>:[95,13] cannot find symbol
symbol: class Application
location: class org.apache.sling.feature.resolver.ApplicationResolverAssembler
[ERROR] <https://builds.apache.org/job/sling-org-apache-sling-feature-resolver-1.8/ws/src/main/java/org/apache/sling/feature/resolver/ApplicationResolverAssembler.java>:[94,19] cannot find symbol
symbol: class Application
location: class org.apache.sling.feature.resolver.ApplicationResolverAssembler
[ERROR] <https://builds.apache.org/job/sling-org-apache-sling-feature-resolver-1.8/ws/src/main/java/org/apache/sling/feature/resolver/ApplicationResolverAssembler.java>:[58,81] cannot find symbol
symbol: variable SubstituteVariables
location: class org.apache.sling.feature.resolver.ApplicationResolverAssembler
[ERROR] <https://builds.apache.org/job/sling-org-apache-sling-feature-resolver-1.8/ws/src/main/java/org/apache/sling/feature/resolver/ApplicationResolverAssembler.java>:[111,87] cannot find symbol
symbol: variable SubstituteVariables
[ERROR] <https://builds.apache.org/job/sling-org-apache-sling-feature-resolver-1.8/ws/src/main/java/org/apache/sling/feature/resolver/ApplicationResolverAssembler.java>:[104,15] cannot find symbol
symbol: variable ApplicationBuilder
location: class org.apache.sling.feature.resolver.ApplicationResolverAssembler
[INFO] 10 errors
[INFO] -------------------------------------------------------------
[WARNING] Attempt to (de-)serialize anonymous class hudson.maven.reporters.MavenArtifactArchiver$2; see: https://jenkins.io/redirect/serialization-of-anonymous-classes/
[JENKINS] Archiving disabled
[WARNING] Attempt to (de-)serialize anonymous class hudson.maven.reporters.MavenFingerprinter$1; see: https://jenkins.io/redirect/serialization-of-anonymous-classes/
[JENKINS] Archiving disabled
[INFO] ------------------------------------------------------------------------
[INFO] BUILD FAILURE
[INFO] ------------------------------------------------------------------------
[INFO] Total time: 18.497 s
[INFO] Finished at: 2018-08-16T06:29:44+00:00
[INFO] Final Memory: 49M/3925M
[INFO] ------------------------------------------------------------------------
Waiting for Jenkins to finish collecting data
[ERROR] Failed to execute goal org.apache.maven.plugins:maven-compiler-plugin:3.7.0:compile (default-compile) on project org.apache.sling.feature.resolver: Compilation failure: Compilation failure:
[ERROR] <https://builds.apache.org/job/sling-org-apache-sling-feature-resolver-1.8/ws/src/main/java/org/apache/sling/feature/resolver/ApplicationResolverAssembler.java>:[19,32] cannot find symbol
[ERROR] symbol: class Application
[ERROR] location: package org.apache.sling.feature
[ERROR] <https://builds.apache.org/job/sling-org-apache-sling-feature-resolver-1.8/ws/src/main/java/org/apache/sling/feature/resolver/ApplicationResolverAssembler.java>:[22,40] cannot find symbol
[ERROR] symbol: class ApplicationBuilder
[ERROR] location: package org.apache.sling.feature.builder
[ERROR] <https://builds.apache.org/job/sling-org-apache-sling-feature-resolver-1.8/ws/src/main/java/org/apache/sling/feature/resolver/ApplicationResolverAssembler.java>:[29,58] cannot find symbol
[ERROR] symbol: class SubstituteVariables
[ERROR] location: class org.apache.sling.feature.io.json.FeatureJSONReader
[ERROR] <https://builds.apache.org/job/sling-org-apache-sling-feature-resolver-1.8/ws/src/main/java/org/apache/sling/feature/resolver/ApplicationResolverAssembler.java>:[50,13] cannot find symbol
[ERROR] symbol: class Application
[ERROR] location: class org.apache.sling.feature.resolver.ApplicationResolverAssembler
[ERROR] <https://builds.apache.org/job/sling-org-apache-sling-feature-resolver-1.8/ws/src/main/java/org/apache/sling/feature/resolver/ApplicationResolverAssembler.java>:[49,19] cannot find symbol
[ERROR] symbol: class Application
[ERROR] location: class org.apache.sling.feature.resolver.ApplicationResolverAssembler
[ERROR] <https://builds.apache.org/job/sling-org-apache-sling-feature-resolver-1.8/ws/src/main/java/org/apache/sling/feature/resolver/ApplicationResolverAssembler.java>:[95,13] cannot find symbol
[ERROR] symbol: class Application
[ERROR] location: class org.apache.sling.feature.resolver.ApplicationResolverAssembler
[ERROR] <https://builds.apache.org/job/sling-org-apache-sling-feature-resolver-1.8/ws/src/main/java/org/apache/sling/feature/resolver/ApplicationResolverAssembler.java>:[94,19] cannot find symbol
[ERROR] symbol: class Application
[ERROR] location: class org.apache.sling.feature.resolver.ApplicationResolverAssembler
[ERROR] <https://builds.apache.org/job/sling-org-apache-sling-feature-resolver-1.8/ws/src/main/java/org/apache/sling/feature/resolver/ApplicationResolverAssembler.java>:[58,81] cannot find symbol
[ERROR] symbol: variable SubstituteVariables
[ERROR] location: class org.apache.sling.feature.resolver.ApplicationResolverAssembler
[ERROR] <https://builds.apache.org/job/sling-org-apache-sling-feature-resolver-1.8/ws/src/main/java/org/apache/sling/feature/resolver/ApplicationResolverAssembler.java>:[111,87] cannot find symbol
[ERROR] symbol: variable SubstituteVariables
[ERROR] <https://builds.apache.org/job/sling-org-apache-sling-feature-resolver-1.8/ws/src/main/java/org/apache/sling/feature/resolver/ApplicationResolverAssembler.java>:[104,15] cannot find symbol
[ERROR] symbol: variable ApplicationBuilder
[ERROR] location: class org.apache.sling.feature.resolver.ApplicationResolverAssembler
[ERROR] -> [Help 1]
[ERROR]
[ERROR] To see the full stack trace of the errors, re-run Maven with the -e switch.
[ERROR] Re-run Maven using the -X switch to enable full debug logging.
[ERROR]
[ERROR] For more information about the errors and possible solutions, please read the following articles:
[ERROR] [Help 1] http://cwiki.apache.org/confluence/display/MAVEN/MojoFailureException
channel stopped
Recording test results
Build failed in Jenkins:
sling-org-apache-sling-feature-resolver-1.8 #54
Posted by Apache Jenkins Server <je...@builds.apache.org>.
See <https://builds.apache.org/job/sling-org-apache-sling-feature-resolver-1.8/54/display/redirect>
------------------------------------------
Started by upstream project "sling-org-apache-sling-feature-analyser-1.8" build number 52
originally caused by:
Started by an SCM change
[EnvInject] - Loading node environment variables.
Building remotely on ubuntu-1 (ubuntu trusty) in workspace <https://builds.apache.org/job/sling-org-apache-sling-feature-resolver-1.8/ws/>
Cloning the remote Git repository
Cloning repository https://github.com/apache/sling-org-apache-sling-feature-resolver.git
> git init <https://builds.apache.org/job/sling-org-apache-sling-feature-resolver-1.8/ws/> # timeout=10
Fetching upstream changes from https://github.com/apache/sling-org-apache-sling-feature-resolver.git
> git --version # timeout=10
> git fetch --tags --progress https://github.com/apache/sling-org-apache-sling-feature-resolver.git +refs/heads/*:refs/remotes/origin/*
> git config remote.origin.url https://github.com/apache/sling-org-apache-sling-feature-resolver.git # timeout=10
> git config --add remote.origin.fetch +refs/heads/*:refs/remotes/origin/* # timeout=10
> git config remote.origin.url https://github.com/apache/sling-org-apache-sling-feature-resolver.git # timeout=10
Fetching upstream changes from https://github.com/apache/sling-org-apache-sling-feature-resolver.git
> git fetch --tags --progress https://github.com/apache/sling-org-apache-sling-feature-resolver.git +refs/heads/*:refs/remotes/origin/*
> git rev-parse origin/master^{commit} # timeout=10
Checking out Revision f52d6465fa38070398787727e1a5ea9de69d8b8d (origin/master)
> git config core.sparsecheckout # timeout=10
> git checkout -f f52d6465fa38070398787727e1a5ea9de69d8b8d
Commit message: "Update to Configurator 1.0.4"
> git rev-list --no-walk f52d6465fa38070398787727e1a5ea9de69d8b8d # timeout=10
Parsing POMs
Established TCP socket on 48410
maven33-agent.jar already up to date
maven33-interceptor.jar already up to date
maven3-interceptor-commons.jar already up to date
[sling-org-apache-sling-feature-resolver-1.8] $ /home/jenkins/tools/java/latest1.8/bin/java -Xmx4g -Xms4g -cp /home/jenkins/jenkins-slave/maven33-agent.jar:/home/jenkins/tools/maven/apache-maven-3.3.9/boot/plexus-classworlds-2.5.2.jar:/home/jenkins/tools/maven/apache-maven-3.3.9/conf/logging jenkins.maven3.agent.Maven33Main /home/jenkins/tools/maven/apache-maven-3.3.9 /home/jenkins/jenkins-slave/slave.jar /home/jenkins/jenkins-slave/maven33-interceptor.jar /home/jenkins/jenkins-slave/maven3-interceptor-commons.jar 48410
<===[JENKINS REMOTING CAPACITY]===> channel started
Executing Maven: -B -f <https://builds.apache.org/job/sling-org-apache-sling-feature-resolver-1.8/ws/pom.xml> -Dmaven.repo.local=/home/jenkins/jenkins-slave/maven-repositories/0 -U clean deploy
[INFO] Scanning for projects...
[INFO]
[INFO] ------------------------------------------------------------------------
[INFO] Building Apache Sling Feature Resolver 0.1.0-SNAPSHOT
[INFO] ------------------------------------------------------------------------
[INFO] Downloading: https://repo.maven.apache.org/maven2/org/osgi/org.osgi.service.resolver/1.1.0/org.osgi.service.resolver-1.1.0.pom
[INFO] Downloaded: https://repo.maven.apache.org/maven2/org/osgi/org.osgi.service.resolver/1.1.0/org.osgi.service.resolver-1.1.0.pom (2 KB at 2.6 KB/sec)
[INFO] Downloading: http://repository.apache.org/snapshots/org/apache/sling/org.apache.sling.feature/0.1.3-SNAPSHOT/maven-metadata.xml
[INFO] Downloaded: http://repository.apache.org/snapshots/org/apache/sling/org.apache.sling.feature/0.1.3-SNAPSHOT/maven-metadata.xml (1008 B at 3.2 KB/sec)
[INFO] Downloading: http://repository.apache.org/snapshots/org/apache/sling/org.apache.sling.feature.analyser/0.1.3-SNAPSHOT/maven-metadata.xml
[INFO] Downloaded: http://repository.apache.org/snapshots/org/apache/sling/org.apache.sling.feature.analyser/0.1.3-SNAPSHOT/maven-metadata.xml (1017 B at 3.3 KB/sec)
[INFO] Downloading: http://repository.apache.org/snapshots/org/apache/sling/org.apache.sling.feature.analyser/0.1.3-SNAPSHOT/org.apache.sling.feature.analyser-0.1.3-20180815.153532-41.pom
[INFO] Downloaded: http://repository.apache.org/snapshots/org/apache/sling/org.apache.sling.feature.analyser/0.1.3-SNAPSHOT/org.apache.sling.feature.analyser-0.1.3-20180815.153532-41.pom (7 KB at 24.5 KB/sec)
[INFO] Downloading: http://repository.apache.org/snapshots/org/apache/sling/org.apache.sling.feature.io/0.1.3-SNAPSHOT/maven-metadata.xml
[INFO] Downloaded: http://repository.apache.org/snapshots/org/apache/sling/org.apache.sling.feature.io/0.1.3-SNAPSHOT/maven-metadata.xml (1011 B at 3.5 KB/sec)
[INFO] Downloading: https://repo.maven.apache.org/maven2/org/osgi/org.osgi.service.resolver/1.1.0/org.osgi.service.resolver-1.1.0.jar
[INFO] Downloaded: https://repo.maven.apache.org/maven2/org/osgi/org.osgi.service.resolver/1.1.0/org.osgi.service.resolver-1.1.0.jar (23 KB at 129.3 KB/sec)
[INFO] Downloading: http://repository.apache.org/snapshots/org/apache/sling/org.apache.sling.feature.analyser/0.1.3-SNAPSHOT/org.apache.sling.feature.analyser-0.1.3-20180815.153532-41.jar
[INFO] Downloaded: http://repository.apache.org/snapshots/org/apache/sling/org.apache.sling.feature.analyser/0.1.3-SNAPSHOT/org.apache.sling.feature.analyser-0.1.3-20180815.153532-41.jar (1386 KB at 2005.3 KB/sec)
[INFO]
[INFO] --- maven-clean-plugin:3.0.0:clean (default-clean) @ org.apache.sling.feature.resolver ---
[INFO]
[INFO] --- maven-enforcer-plugin:3.0.0-M1:enforce (enforce-property-values) @ org.apache.sling.feature.resolver ---
[INFO]
[INFO] --- maven-enforcer-plugin:3.0.0-M1:enforce (enforce-java) @ org.apache.sling.feature.resolver ---
[INFO]
[INFO] --- maven-enforcer-plugin:3.0.0-M1:enforce (ban-maven-scr-plugin) @ org.apache.sling.feature.resolver ---
[INFO]
[INFO] --- maven-remote-resources-plugin:1.5:process (process-resource-bundles) @ org.apache.sling.feature.resolver ---
[INFO]
[INFO] --- maven-remote-resources-plugin:1.5:process (default) @ org.apache.sling.feature.resolver ---
[INFO]
[INFO] --- maven-resources-plugin:2.7:resources (default-resources) @ org.apache.sling.feature.resolver ---
[INFO] Using 'UTF-8' encoding to copy filtered resources.
[INFO] skip non existing resourceDirectory <https://builds.apache.org/job/sling-org-apache-sling-feature-resolver-1.8/ws/src/main/resources>
[INFO] Copying 3 resources
[INFO] Copying 3 resources
[INFO]
[INFO] --- maven-compiler-plugin:3.7.0:compile (default-compile) @ org.apache.sling.feature.resolver ---
[INFO] Changes detected - recompiling the module!
[INFO] Compiling 11 source files to <https://builds.apache.org/job/sling-org-apache-sling-feature-resolver-1.8/ws/target/classes>
[INFO] -------------------------------------------------------------
[ERROR] COMPILATION ERROR :
[INFO] -------------------------------------------------------------
[ERROR] <https://builds.apache.org/job/sling-org-apache-sling-feature-resolver-1.8/ws/src/main/java/org/apache/sling/feature/resolver/ApplicationResolverAssembler.java>:[19,32] cannot find symbol
symbol: class Application
location: package org.apache.sling.feature
[ERROR] <https://builds.apache.org/job/sling-org-apache-sling-feature-resolver-1.8/ws/src/main/java/org/apache/sling/feature/resolver/ApplicationResolverAssembler.java>:[22,40] cannot find symbol
symbol: class ApplicationBuilder
location: package org.apache.sling.feature.builder
[ERROR] <https://builds.apache.org/job/sling-org-apache-sling-feature-resolver-1.8/ws/src/main/java/org/apache/sling/feature/resolver/ApplicationResolverAssembler.java>:[29,58] cannot find symbol
symbol: class SubstituteVariables
location: class org.apache.sling.feature.io.json.FeatureJSONReader
[ERROR] <https://builds.apache.org/job/sling-org-apache-sling-feature-resolver-1.8/ws/src/main/java/org/apache/sling/feature/resolver/ApplicationResolverAssembler.java>:[50,13] cannot find symbol
symbol: class Application
location: class org.apache.sling.feature.resolver.ApplicationResolverAssembler
[ERROR] <https://builds.apache.org/job/sling-org-apache-sling-feature-resolver-1.8/ws/src/main/java/org/apache/sling/feature/resolver/ApplicationResolverAssembler.java>:[49,19] cannot find symbol
symbol: class Application
location: class org.apache.sling.feature.resolver.ApplicationResolverAssembler
[ERROR] <https://builds.apache.org/job/sling-org-apache-sling-feature-resolver-1.8/ws/src/main/java/org/apache/sling/feature/resolver/ApplicationResolverAssembler.java>:[95,13] cannot find symbol
symbol: class Application
location: class org.apache.sling.feature.resolver.ApplicationResolverAssembler
[ERROR] <https://builds.apache.org/job/sling-org-apache-sling-feature-resolver-1.8/ws/src/main/java/org/apache/sling/feature/resolver/ApplicationResolverAssembler.java>:[94,19] cannot find symbol
symbol: class Application
location: class org.apache.sling.feature.resolver.ApplicationResolverAssembler
[ERROR] <https://builds.apache.org/job/sling-org-apache-sling-feature-resolver-1.8/ws/src/main/java/org/apache/sling/feature/resolver/ApplicationResolverAssembler.java>:[58,81] cannot find symbol
symbol: variable SubstituteVariables
location: class org.apache.sling.feature.resolver.ApplicationResolverAssembler
[ERROR] <https://builds.apache.org/job/sling-org-apache-sling-feature-resolver-1.8/ws/src/main/java/org/apache/sling/feature/resolver/ApplicationResolverAssembler.java>:[111,87] cannot find symbol
symbol: variable SubstituteVariables
[ERROR] <https://builds.apache.org/job/sling-org-apache-sling-feature-resolver-1.8/ws/src/main/java/org/apache/sling/feature/resolver/ApplicationResolverAssembler.java>:[104,15] cannot find symbol
symbol: variable ApplicationBuilder
location: class org.apache.sling.feature.resolver.ApplicationResolverAssembler
[INFO] 10 errors
[INFO] -------------------------------------------------------------
[WARNING] Attempt to (de-)serialize anonymous class hudson.maven.reporters.MavenArtifactArchiver$2; see: https://jenkins.io/redirect/serialization-of-anonymous-classes/
[JENKINS] Archiving disabled
[WARNING] Attempt to (de-)serialize anonymous class hudson.maven.reporters.MavenFingerprinter$1; see: https://jenkins.io/redirect/serialization-of-anonymous-classes/
[JENKINS] Archiving disabled
[INFO] ------------------------------------------------------------------------
[INFO] BUILD FAILURE
[INFO] ------------------------------------------------------------------------
[INFO] Total time: 16.896 s
[INFO] Finished at: 2018-08-15T15:36:38+00:00
[INFO] Final Memory: 49M/3925M
[INFO] ------------------------------------------------------------------------
Waiting for Jenkins to finish collecting data
[ERROR] Failed to execute goal org.apache.maven.plugins:maven-compiler-plugin:3.7.0:compile (default-compile) on project org.apache.sling.feature.resolver: Compilation failure: Compilation failure:
[ERROR] <https://builds.apache.org/job/sling-org-apache-sling-feature-resolver-1.8/ws/src/main/java/org/apache/sling/feature/resolver/ApplicationResolverAssembler.java>:[19,32] cannot find symbol
[ERROR] symbol: class Application
[ERROR] location: package org.apache.sling.feature
[ERROR] <https://builds.apache.org/job/sling-org-apache-sling-feature-resolver-1.8/ws/src/main/java/org/apache/sling/feature/resolver/ApplicationResolverAssembler.java>:[22,40] cannot find symbol
[ERROR] symbol: class ApplicationBuilder
[ERROR] location: package org.apache.sling.feature.builder
[ERROR] <https://builds.apache.org/job/sling-org-apache-sling-feature-resolver-1.8/ws/src/main/java/org/apache/sling/feature/resolver/ApplicationResolverAssembler.java>:[29,58] cannot find symbol
[ERROR] symbol: class SubstituteVariables
[ERROR] location: class org.apache.sling.feature.io.json.FeatureJSONReader
[ERROR] <https://builds.apache.org/job/sling-org-apache-sling-feature-resolver-1.8/ws/src/main/java/org/apache/sling/feature/resolver/ApplicationResolverAssembler.java>:[50,13] cannot find symbol
[ERROR] symbol: class Application
[ERROR] location: class org.apache.sling.feature.resolver.ApplicationResolverAssembler
[ERROR] <https://builds.apache.org/job/sling-org-apache-sling-feature-resolver-1.8/ws/src/main/java/org/apache/sling/feature/resolver/ApplicationResolverAssembler.java>:[49,19] cannot find symbol
[ERROR] symbol: class Application
[ERROR] location: class org.apache.sling.feature.resolver.ApplicationResolverAssembler
[ERROR] <https://builds.apache.org/job/sling-org-apache-sling-feature-resolver-1.8/ws/src/main/java/org/apache/sling/feature/resolver/ApplicationResolverAssembler.java>:[95,13] cannot find symbol
[ERROR] symbol: class Application
[ERROR] location: class org.apache.sling.feature.resolver.ApplicationResolverAssembler
[ERROR] <https://builds.apache.org/job/sling-org-apache-sling-feature-resolver-1.8/ws/src/main/java/org/apache/sling/feature/resolver/ApplicationResolverAssembler.java>:[94,19] cannot find symbol
[ERROR] symbol: class Application
[ERROR] location: class org.apache.sling.feature.resolver.ApplicationResolverAssembler
[ERROR] <https://builds.apache.org/job/sling-org-apache-sling-feature-resolver-1.8/ws/src/main/java/org/apache/sling/feature/resolver/ApplicationResolverAssembler.java>:[58,81] cannot find symbol
[ERROR] symbol: variable SubstituteVariables
[ERROR] location: class org.apache.sling.feature.resolver.ApplicationResolverAssembler
[ERROR] <https://builds.apache.org/job/sling-org-apache-sling-feature-resolver-1.8/ws/src/main/java/org/apache/sling/feature/resolver/ApplicationResolverAssembler.java>:[111,87] cannot find symbol
[ERROR] symbol: variable SubstituteVariables
[ERROR] <https://builds.apache.org/job/sling-org-apache-sling-feature-resolver-1.8/ws/src/main/java/org/apache/sling/feature/resolver/ApplicationResolverAssembler.java>:[104,15] cannot find symbol
[ERROR] symbol: variable ApplicationBuilder
[ERROR] location: class org.apache.sling.feature.resolver.ApplicationResolverAssembler
[ERROR] -> [Help 1]
[ERROR]
[ERROR] To see the full stack trace of the errors, re-run Maven with the -e switch.
[ERROR] Re-run Maven using the -X switch to enable full debug logging.
[ERROR]
[ERROR] For more information about the errors and possible solutions, please read the following articles:
[ERROR] [Help 1] http://cwiki.apache.org/confluence/display/MAVEN/MojoFailureException
channel stopped
Recording test results