You are viewing a plain text version of this content. The canonical link for it is here.
Posted to dev@curator.apache.org by Apache Jenkins Server <je...@builds.apache.org> on 2017/01/12 00:53:33 UTC
Build failed in Jenkins: Curator #1006
See <https://builds.apache.org/job/Curator/1006/changes>
Changes:
[randgalt] Move to latest TestNg and try to improve test retries
------------------------------------------
Started by user randgalt
[EnvInject] - Loading node environment variables.
Building remotely on H13 (ubuntu) in workspace <https://builds.apache.org/job/Curator/ws/>
Wiping out workspace first.
Cloning the remote Git repository
Cloning repository https://git-wip-us.apache.org/repos/asf/curator.git
> git init <https://builds.apache.org/job/Curator/ws/> # timeout=10
Fetching upstream changes from https://git-wip-us.apache.org/repos/asf/curator.git
> git --version # timeout=10
> git -c core.askpass=true fetch --tags --progress https://git-wip-us.apache.org/repos/asf/curator.git +refs/heads/*:refs/remotes/origin/*
> git config remote.origin.url https://git-wip-us.apache.org/repos/asf/curator.git # timeout=10
> git config --add remote.origin.fetch +refs/heads/*:refs/remotes/origin/* # timeout=10
> git config remote.origin.url https://git-wip-us.apache.org/repos/asf/curator.git # timeout=10
Fetching upstream changes from https://git-wip-us.apache.org/repos/asf/curator.git
> git -c core.askpass=true fetch --tags --progress https://git-wip-us.apache.org/repos/asf/curator.git +refs/heads/*:refs/remotes/origin/*
> git rev-parse refs/remotes/origin/master^{commit} # timeout=10
> git rev-parse refs/remotes/origin/origin/master^{commit} # timeout=10
Checking out Revision 2342578f424230ee9dd0abfd47f0042f9c422343 (refs/remotes/origin/master)
> git config core.sparsecheckout # timeout=10
> git checkout -f 2342578f424230ee9dd0abfd47f0042f9c422343
> git rev-list 0ad09eb4657861fece9fa4c12c87991a710eaac1 # timeout=10
Parsing POMs
Modules changed, recalculating dependency graph
Established TCP socket on 34823
maven32-agent.jar already up to date
maven32-interceptor.jar already up to date
maven3-interceptor-commons.jar already up to date
[Curator] $ /usr/lib/jvm/java-7-openjdk-amd64//bin/java -Xmx2g -Xms256m -XX:MaxPermSize=512m -cp /home/jenkins/jenkins-slave/maven32-agent.jar:/home/jenkins/tools/maven/apache-maven-3.2.5/boot/plexus-classworlds-2.5.2.jar:/home/jenkins/tools/maven/apache-maven-3.2.5/conf/logging jenkins.maven3.agent.Maven32Main /home/jenkins/tools/maven/apache-maven-3.2.5 /home/jenkins/jenkins-slave/slave.jar /home/jenkins/jenkins-slave/maven32-interceptor.jar /home/jenkins/jenkins-slave/maven3-interceptor-commons.jar 34823
ERROR: Failed to parse POMs
java.io.IOException: Cannot run program "/usr/lib/jvm/java-7-openjdk-amd64//bin/java" (in directory "<https://builds.apache.org/job/Curator/ws/")>: error=2, No such file or directory
at java.lang.ProcessBuilder.start(ProcessBuilder.java:1047)
at hudson.Proc$LocalProc.<init>(Proc.java:240)
at hudson.Proc$LocalProc.<init>(Proc.java:212)
at hudson.Launcher$LocalLauncher.launch(Launcher.java:815)
at hudson.Launcher$ProcStarter.start(Launcher.java:381)
at hudson.Launcher$RemoteLaunchCallable.call(Launcher.java:1148)
at hudson.Launcher$RemoteLaunchCallable.call(Launcher.java:1113)
at hudson.remoting.UserRequest.perform(UserRequest.java:153)
at hudson.remoting.UserRequest.perform(UserRequest.java:50)
at hudson.remoting.Request$2.run(Request.java:332)
at hudson.remoting.InterceptingExecutorService$1.call(InterceptingExecutorService.java:68)
at java.util.concurrent.FutureTask.run(FutureTask.java:262)
at java.util.concurrent.ThreadPoolExecutor.runWorker(ThreadPoolExecutor.java:1145)
at java.util.concurrent.ThreadPoolExecutor$Worker.run(ThreadPoolExecutor.java:615)
at java.lang.Thread.run(Thread.java:745)
at ......remote call to H13(Native Method)
at hudson.remoting.Channel.attachCallSiteStackTrace(Channel.java:1416)
at hudson.remoting.UserResponse.retrieve(UserRequest.java:253)
at hudson.remoting.Channel.call(Channel.java:781)
at hudson.Launcher$RemoteLauncher.launch(Launcher.java:928)
at hudson.Launcher$ProcStarter.start(Launcher.java:381)
at hudson.maven.AbstractMavenProcessFactory.newProcess(AbstractMavenProcessFactory.java:281)
at hudson.maven.ProcessCache.get(ProcessCache.java:236)
at hudson.maven.MavenModuleSetBuild$MavenModuleSetBuildExecution.doRun(MavenModuleSetBuild.java:778)
at hudson.model.AbstractBuild$AbstractBuildExecution.run(AbstractBuild.java:534)
at hudson.model.Run.execute(Run.java:1741)
at hudson.maven.MavenModuleSetBuild.run(MavenModuleSetBuild.java:531)
at hudson.model.ResourceController.execute(ResourceController.java:98)
at hudson.model.Executor.run(Executor.java:410)
Caused by: java.io.IOException: error=2, No such file or directory
at java.lang.UNIXProcess.forkAndExec(Native Method)
at java.lang.UNIXProcess.<init>(UNIXProcess.java:187)
at java.lang.ProcessImpl.start(ProcessImpl.java:130)
at java.lang.ProcessBuilder.start(ProcessBuilder.java:1028)
at hudson.Proc$LocalProc.<init>(Proc.java:240)
at hudson.Proc$LocalProc.<init>(Proc.java:212)
at hudson.Launcher$LocalLauncher.launch(Launcher.java:815)
at hudson.Launcher$ProcStarter.start(Launcher.java:381)
at hudson.Launcher$RemoteLaunchCallable.call(Launcher.java:1148)
at hudson.Launcher$RemoteLaunchCallable.call(Launcher.java:1113)
at hudson.remoting.UserRequest.perform(UserRequest.java:153)
at hudson.remoting.UserRequest.perform(UserRequest.java:50)
at hudson.remoting.Request$2.run(Request.java:332)
at hudson.remoting.InterceptingExecutorService$1.call(InterceptingExecutorService.java:68)
at java.util.concurrent.FutureTask.run(FutureTask.java:262)
at java.util.concurrent.ThreadPoolExecutor.runWorker(ThreadPoolExecutor.java:1145)
at java.util.concurrent.ThreadPoolExecutor$Worker.run(ThreadPoolExecutor.java:615)
at java.lang.Thread.run(Thread.java:745)
Jenkins build is back to stable : Curator #1009
Posted by Apache Jenkins Server <je...@builds.apache.org>.
See <https://builds.apache.org/job/Curator/1009/changes>
Jenkins build is unstable: Curator #1008
Posted by Apache Jenkins Server <je...@builds.apache.org>.
See <https://builds.apache.org/job/Curator/1008/>
Build failed in Jenkins: Curator #1007
Posted by Apache Jenkins Server <je...@builds.apache.org>.
See <https://builds.apache.org/job/Curator/1007/>
------------------------------------------
Started by user randgalt
[EnvInject] - Loading node environment variables.
Building remotely on H13 (ubuntu) in workspace <https://builds.apache.org/job/Curator/ws/>
Wiping out workspace first.
Cloning the remote Git repository
Cloning repository https://git-wip-us.apache.org/repos/asf/curator.git
> git init <https://builds.apache.org/job/Curator/ws/> # timeout=10
Fetching upstream changes from https://git-wip-us.apache.org/repos/asf/curator.git
> git --version # timeout=10
> git -c core.askpass=true fetch --tags --progress https://git-wip-us.apache.org/repos/asf/curator.git +refs/heads/*:refs/remotes/origin/*
> git config remote.origin.url https://git-wip-us.apache.org/repos/asf/curator.git # timeout=10
> git config --add remote.origin.fetch +refs/heads/*:refs/remotes/origin/* # timeout=10
> git config remote.origin.url https://git-wip-us.apache.org/repos/asf/curator.git # timeout=10
Fetching upstream changes from https://git-wip-us.apache.org/repos/asf/curator.git
> git -c core.askpass=true fetch --tags --progress https://git-wip-us.apache.org/repos/asf/curator.git +refs/heads/*:refs/remotes/origin/*
> git rev-parse refs/remotes/origin/master^{commit} # timeout=10
> git rev-parse refs/remotes/origin/origin/master^{commit} # timeout=10
Checking out Revision 2342578f424230ee9dd0abfd47f0042f9c422343 (refs/remotes/origin/master)
> git config core.sparsecheckout # timeout=10
> git checkout -f 2342578f424230ee9dd0abfd47f0042f9c422343
> git rev-list 2342578f424230ee9dd0abfd47f0042f9c422343 # timeout=10
Parsing POMs
Established TCP socket on 43507
maven32-agent.jar already up to date
maven32-interceptor.jar already up to date
maven3-interceptor-commons.jar already up to date
[Curator] $ /usr/lib/jvm/java-7-openjdk-amd64//bin/java -Xmx2g -Xms256m -XX:MaxPermSize=512m -cp /home/jenkins/jenkins-slave/maven32-agent.jar:/home/jenkins/tools/maven/apache-maven-3.2.5/boot/plexus-classworlds-2.5.2.jar:/home/jenkins/tools/maven/apache-maven-3.2.5/conf/logging jenkins.maven3.agent.Maven32Main /home/jenkins/tools/maven/apache-maven-3.2.5 /home/jenkins/jenkins-slave/slave.jar /home/jenkins/jenkins-slave/maven32-interceptor.jar /home/jenkins/jenkins-slave/maven3-interceptor-commons.jar 43507
ERROR: Failed to parse POMs
java.io.IOException: Cannot run program "/usr/lib/jvm/java-7-openjdk-amd64//bin/java" (in directory "<https://builds.apache.org/job/Curator/ws/")>: error=2, No such file or directory
at java.lang.ProcessBuilder.start(ProcessBuilder.java:1047)
at hudson.Proc$LocalProc.<init>(Proc.java:240)
at hudson.Proc$LocalProc.<init>(Proc.java:212)
at hudson.Launcher$LocalLauncher.launch(Launcher.java:815)
at hudson.Launcher$ProcStarter.start(Launcher.java:381)
at hudson.Launcher$RemoteLaunchCallable.call(Launcher.java:1148)
at hudson.Launcher$RemoteLaunchCallable.call(Launcher.java:1113)
at hudson.remoting.UserRequest.perform(UserRequest.java:153)
at hudson.remoting.UserRequest.perform(UserRequest.java:50)
at hudson.remoting.Request$2.run(Request.java:332)
at hudson.remoting.InterceptingExecutorService$1.call(InterceptingExecutorService.java:68)
at java.util.concurrent.FutureTask.run(FutureTask.java:262)
at java.util.concurrent.ThreadPoolExecutor.runWorker(ThreadPoolExecutor.java:1145)
at java.util.concurrent.ThreadPoolExecutor$Worker.run(ThreadPoolExecutor.java:615)
at java.lang.Thread.run(Thread.java:745)
at ......remote call to H13(Native Method)
at hudson.remoting.Channel.attachCallSiteStackTrace(Channel.java:1416)
at hudson.remoting.UserResponse.retrieve(UserRequest.java:253)
at hudson.remoting.Channel.call(Channel.java:781)
at hudson.Launcher$RemoteLauncher.launch(Launcher.java:928)
at hudson.Launcher$ProcStarter.start(Launcher.java:381)
at hudson.maven.AbstractMavenProcessFactory.newProcess(AbstractMavenProcessFactory.java:281)
at hudson.maven.ProcessCache.get(ProcessCache.java:236)
at hudson.maven.MavenModuleSetBuild$MavenModuleSetBuildExecution.doRun(MavenModuleSetBuild.java:778)
at hudson.model.AbstractBuild$AbstractBuildExecution.run(AbstractBuild.java:534)
at hudson.model.Run.execute(Run.java:1741)
at hudson.maven.MavenModuleSetBuild.run(MavenModuleSetBuild.java:531)
at hudson.model.ResourceController.execute(ResourceController.java:98)
at hudson.model.Executor.run(Executor.java:410)
Caused by: java.io.IOException: error=2, No such file or directory
at java.lang.UNIXProcess.forkAndExec(Native Method)
at java.lang.UNIXProcess.<init>(UNIXProcess.java:187)
at java.lang.ProcessImpl.start(ProcessImpl.java:130)
at java.lang.ProcessBuilder.start(ProcessBuilder.java:1028)
at hudson.Proc$LocalProc.<init>(Proc.java:240)
at hudson.Proc$LocalProc.<init>(Proc.java:212)
at hudson.Launcher$LocalLauncher.launch(Launcher.java:815)
at hudson.Launcher$ProcStarter.start(Launcher.java:381)
at hudson.Launcher$RemoteLaunchCallable.call(Launcher.java:1148)
at hudson.Launcher$RemoteLaunchCallable.call(Launcher.java:1113)
at hudson.remoting.UserRequest.perform(UserRequest.java:153)
at hudson.remoting.UserRequest.perform(UserRequest.java:50)
at hudson.remoting.Request$2.run(Request.java:332)
at hudson.remoting.InterceptingExecutorService$1.call(InterceptingExecutorService.java:68)
at java.util.concurrent.FutureTask.run(FutureTask.java:262)
at java.util.concurrent.ThreadPoolExecutor.runWorker(ThreadPoolExecutor.java:1145)
at java.util.concurrent.ThreadPoolExecutor$Worker.run(ThreadPoolExecutor.java:615)
at java.lang.Thread.run(Thread.java:745)