You are viewing a plain text version of this content. The canonical link for it is here.
Posted to notifications@maven.apache.org by Apache Jenkins Server <je...@builds.apache.org> on 2014/11/20 18:50:55 UTC

Build failed in Jenkins: maven-enforcer #200

See <https://builds.apache.org/job/maven-enforcer/200/changes>

Changes:

[khmarbaise] - Added more debug output for analysis.

------------------------------------------
[...truncated 146 lines...]
[INFO] Compiling 33 source files to <https://builds.apache.org/job/maven-enforcer/ws/enforcer-rules/target/test-classes>
[WARNING] Note: Some input files use or override a deprecated API.
[WARNING] Note: Recompile with -Xlint:deprecation for details.
[WARNING] Note: Some input files use unchecked or unsafe operations.
[WARNING] Note: Recompile with -Xlint:unchecked for details.
[INFO] 
[INFO] --- maven-surefire-plugin:2.17:test (default-test) @ enforcer-rules ---
[INFO] Surefire report directory: <https://builds.apache.org/job/maven-enforcer/ws/enforcer-rules/target/surefire-reports>

-------------------------------------------------------
 T E S T S
-------------------------------------------------------
Running org.apache.maven.plugins.enforcer.TestRequireNoRepositories
Tests run: 15, Failures: 0, Errors: 0, Skipped: 0, Time elapsed: 0.662 sec - in org.apache.maven.plugins.enforcer.TestRequireNoRepositories
Running org.apache.maven.plugins.enforcer.RequirePrerequisiteTest
Tests run: 9, Failures: 0, Errors: 0, Skipped: 0, Time elapsed: 0.414 sec - in org.apache.maven.plugins.enforcer.RequirePrerequisiteTest
Running org.apache.maven.plugins.enforcer.TestRequireReleaseVersion
[debug] This project cannot be a snapshot:testGroupId:snapshot:jar:2.0-SNAPSHOT
[debug] Parent Cannot be a snapshot: testGroupId:snapshot:jar:2.0-SNAPSHOT
Tests run: 2, Failures: 0, Errors: 0, Skipped: 0, Time elapsed: 0.006 sec - in org.apache.maven.plugins.enforcer.TestRequireReleaseVersion
Running org.apache.maven.plugins.enforcer.ReactorModuleConvergenceTest
Tests run: 9, Failures: 0, Errors: 0, Skipped: 0, Time elapsed: 0.556 sec - in org.apache.maven.plugins.enforcer.ReactorModuleConvergenceTest
Running org.apache.maven.plugins.enforcer.TestEvaluateBeanshell
[debug] Echo condition : ${env} == null
[debug] Echo script : "This is a test." == null
[debug] Echo evaluating : false
[debug] Echo condition : this is not valid beanshell
[debug] Echo script : this is not valid beanshell
[debug] Echo condition : ${env} == null
[debug] Echo condition : ${env} == null
[debug] Echo script : "This is a test." == null
[debug] Echo evaluating : false
[debug] Echo condition : ${env} == "This is a test."
[debug] Echo script : "This is a test." == "This is a test."
[debug] Echo evaluating : true
Tests run: 5, Failures: 0, Errors: 0, Skipped: 0, Time elapsed: 0.06 sec - in org.apache.maven.plugins.enforcer.TestEvaluateBeanshell
Running org.apache.maven.plugins.enforcer.TestNoSnapshots
[warn] The "NoSnapshots" rule is deprecated. Use "requireReleaseDeps" instead
[warn] The "NoSnapshots" rule is deprecated. Use "requireReleaseDeps" instead
[debug] Found Banned Dependency: testGroupId:snapshot:jar:2.0-SNAPSHOT
Use 'mvn dependency:tree' to locate the source of the banned dependencies.
[warn] The "NoSnapshots" rule is deprecated. Use "requireReleaseDeps" instead
[debug] Found Banned Dependency: testGroupId:snapshot:jar:2.0-SNAPSHOT
Use 'mvn dependency:tree' to locate the source of the banned dependencies.
Tests run: 2, Failures: 0, Errors: 0, Skipped: 0, Time elapsed: 0.002 sec - in org.apache.maven.plugins.enforcer.TestNoSnapshots
Running org.apache.maven.plugins.enforcer.TestRequireOS
[info] OS Info: Arch: i386 Family: unix Name: linux Version: 3.2.0-68-generic
[info] Testing Mojo Using Valid Family: unix Invalid Family: win9x
[debug] OS Info: Arch: i386 Family: unix Name: linux Version: 3.2.0-68-generic
[info] Caught Expected Exception:Invalid Family type used. Valid family types are: win9x, tandem, os/400, z/os, netware, mac, windows, os/2, unix, openvms, dos,
Tests run: 2, Failures: 0, Errors: 0, Skipped: 0, Time elapsed: 0.006 sec - in org.apache.maven.plugins.enforcer.TestRequireOS
Running org.apache.maven.plugins.enforcer.TestRequireReleaseDeps
[debug] Found Banned Dependency: testGroupId:snapshot:jar:2.0-SNAPSHOT
Use 'mvn dependency:tree' to locate the source of the banned dependencies.
[debug] Found Banned Dependency: testGroupId:snapshot:jar:2.0-SNAPSHOT
Use 'mvn dependency:tree' to locate the source of the banned dependencies.
[debug] Found Banned Dependency: testGroupId:snapshot:jar:2.0-SNAPSHOT
Use 'mvn dependency:tree' to locate the source of the banned dependencies.
[debug] Parent Cannot be a snapshot: testGroupId:snapshot:jar:2.0-SNAPSHOT
Tests run: 2, Failures: 0, Errors: 0, Skipped: 0, Time elapsed: 0 sec - in org.apache.maven.plugins.enforcer.TestRequireReleaseDeps
Running org.apache.maven.plugins.enforcer.RequireActiveProfileTest
Tests run: 9, Failures: 0, Errors: 0, Skipped: 0, Time elapsed: 0.072 sec - in org.apache.maven.plugins.enforcer.RequireActiveProfileTest
Running org.apache.maven.plugins.enforcer.TestAlwaysPass
[info] Always pass!
Tests run: 1, Failures: 0, Errors: 0, Skipped: 0, Time elapsed: 0.001 sec - in org.apache.maven.plugins.enforcer.TestAlwaysPass
Running org.apache.maven.plugins.enforcer.TestRequireJavaVersion
[debug] Detected Java String: 1.6.0_45
[debug] Normalized Java String: 1.6.0-45
[debug] Parsed Version: Major: 1 Minor: 6 Incremental: 0 Build: 45 Qualifier: null
[debug] Detected JDK Version: 1.6.0-45 is allowed in the range 1.6.0-45.
[debug] Detected Java String: 1.6.0_45
[debug] Normalized Java String: 1.6.0-45
[debug] Parsed Version: Major: 1 Minor: 6 Incremental: 0 Build: 45 Qualifier: null
[debug] Detected Java String: 1.6.0_45
[debug] Normalized Java String: 1.6.0-45
[debug] Parsed Version: Major: 1 Minor: 6 Incremental: 0 Build: 45 Qualifier: null
[debug] Detected JDK Version: 1.6.0-45 is allowed in the range 1.6.0_45.
Tests run: 3, Failures: 0, Errors: 0, Skipped: 0, Time elapsed: 0.002 sec - in org.apache.maven.plugins.enforcer.TestRequireJavaVersion
Running org.apache.maven.plugins.enforcer.BanDistributionManagementTest
Tests run: 9, Failures: 0, Errors: 0, Skipped: 0, Time elapsed: 0.101 sec - in org.apache.maven.plugins.enforcer.BanDistributionManagementTest
Running org.apache.maven.plugins.enforcer.TestRequireFilesSize
[debug] /tmp/enforcer1818538510672227504tmp size (0) is OK (max. 10000 byte).
[debug] /tmp/enforcer4751337042013318806tmp size (0) is OK (max. 10000 byte).
Tests run: 8, Failures: 0, Errors: 0, Skipped: 0, Time elapsed: 0.01 sec - in org.apache.maven.plugins.enforcer.TestRequireFilesSize
Running org.apache.maven.plugins.enforcer.TestAlwaysFail
Tests run: 1, Failures: 0, Errors: 0, Skipped: 0, Time elapsed: 0 sec - in org.apache.maven.plugins.enforcer.TestAlwaysFail
Running org.apache.maven.plugins.enforcer.TestBannedRepositories
Tests run: 4, Failures: 0, Errors: 0, Skipped: 0, Time elapsed: 0.087 sec - in org.apache.maven.plugins.enforcer.TestBannedRepositories
Running org.apache.maven.plugins.enforcer.TestBannedDependencies
Tests run: 21, Failures: 0, Errors: 0, Skipped: 0, Time elapsed: 0.035 sec - in org.apache.maven.plugins.enforcer.TestBannedDependencies
Running org.apache.maven.plugins.enforcer.utils.TestEnforcerRuleUtils
Tests run: 6, Failures: 0, Errors: 0, Skipped: 0, Time elapsed: 0.132 sec - in org.apache.maven.plugins.enforcer.utils.TestEnforcerRuleUtils
Running org.apache.maven.plugins.enforcer.utils.TestMockEnforcerExpressionEvaluator
Tests run: 1, Failures: 0, Errors: 0, Skipped: 0, Time elapsed: 0 sec - in org.apache.maven.plugins.enforcer.utils.TestMockEnforcerExpressionEvaluator
Running org.apache.maven.plugins.enforcer.utils.TestArtifactMatcher
Tests run: 3, Failures: 0, Errors: 0, Skipped: 0, Time elapsed: 0.004 sec - in org.apache.maven.plugins.enforcer.utils.TestArtifactMatcher
Running org.apache.maven.plugins.enforcer.TestRequireFilesDontExist
Tests run: 7, Failures: 0, Errors: 0, Skipped: 0, Time elapsed: 0.002 sec - in org.apache.maven.plugins.enforcer.TestRequireFilesDontExist
Running org.apache.maven.plugins.enforcer.TestRequirePluginVersions
Tests run: 15, Failures: 0, Errors: 0, Skipped: 0, Time elapsed: 0.24 sec - in org.apache.maven.plugins.enforcer.TestRequirePluginVersions
Running org.apache.maven.plugins.enforcer.TestRequireFilesExist
Tests run: 7, Failures: 0, Errors: 0, Skipped: 0, Time elapsed: 0.001 sec - in org.apache.maven.plugins.enforcer.TestRequireFilesExist
Running org.apache.maven.plugins.enforcer.TestAbstractVersionEnforcer
[debug] Detected test Version: 2.0.5 is allowed in the range [2.0.5,).
[debug] Detected test Version: 2.0.5 is allowed in the range [2.0.4,).
[debug] Detected test Version: 2.0.5 is allowed in the range [2.0.4,2.0.5].
[debug] Detected test Version: 2.0.5 is allowed in the range [2.0.4,2.0.6].
[debug] Detected test Version: 2.0.5 is allowed in the range [2.0.4,2.0.6).
[debug] Detected test Version: 2.0.5 is allowed in the range [2.0,).
[debug] Detected test Version: 2.0.5 is allowed in the range [2.0.0,).
[debug] Detected test Version: 2.0.5 is allowed in the range 2.0.
[debug] Detected test Version: 2.0.5 is allowed in the range 2.0.4.
[debug] Detected test Version: 2.0.5 is allowed in the range 2.0.5.
Tests run: 2, Failures: 0, Errors: 0, Skipped: 0, Time elapsed: 0.001 sec - in org.apache.maven.plugins.enforcer.TestAbstractVersionEnforcer
Running org.apache.maven.plugins.enforcer.TestRequireProperty
Tests run: 3, Failures: 0, Errors: 0, Skipped: 0, Time elapsed: 0.001 sec - in org.apache.maven.plugins.enforcer.TestRequireProperty
Running org.apache.maven.plugins.enforcer.TestRequireEnvironmentVariable
Tests run: 2, Failures: 0, Errors: 0, Skipped: 0, Time elapsed: 0.001 sec - in org.apache.maven.plugins.enforcer.TestRequireEnvironmentVariable
Running org.apache.maven.plugins.enforcer.TestMavenVersion
[debug] Detected Maven Version: 2.0.5
[debug] Detected Maven Version: 2.0.5 is allowed in the range 2.0.5.
[debug] Detected Maven Version: 2.0.5
[debug] Detected Maven Version: 2.0.5
[debug] Detected Maven Version: 2.0.5 is allowed in the range 1.6.0_45.
Tests run: 2, Failures: 0, Errors: 0, Skipped: 0, Time elapsed: 0 sec - in org.apache.maven.plugins.enforcer.TestMavenVersion

Results :

Tests run: 150, Failures: 0, Errors: 0, Skipped: 0

[JENKINS] Recording test results
log4j:WARN No appenders could be found for logger (org.apache.commons.beanutils.converters.BooleanConverter).
log4j:WARN Please initialize the log4j system properly.
[INFO] 
[INFO] --- maven-jar-plugin:2.5:jar (default-jar) @ enforcer-rules ---
[INFO] Building jar: <https://builds.apache.org/job/maven-enforcer/ws/enforcer-rules/target/enforcer-rules-2.0-SNAPSHOT.jar>
[INFO] 
[INFO] --- maven-site-plugin:3.4:attach-descriptor (attach-descriptor) @ enforcer-rules ---
[INFO] 
[INFO] --- maven-jar-plugin:2.5:test-jar (default) @ enforcer-rules ---
[INFO] Building jar: <https://builds.apache.org/job/maven-enforcer/ws/enforcer-rules/target/enforcer-rules-2.0-SNAPSHOT-tests.jar>
[INFO] 
[INFO] --- maven-checkstyle-plugin:2.13:check (checkstyle-check) @ enforcer-rules ---
[INFO] 
[INFO] There are 4 checkstyle errors.
[ERROR] ReactorModuleConvergence.java[389] (sizes) LineLength: Line is longer than 120 characters (found 138).
[ERROR] ReactorModuleConvergence.java[389:73] (whitespace) WhitespaceAround: '+' is not followed by whitespace.
[ERROR] ReactorModuleConvergence.java[389:137] (whitespace) ParenPad: ')' is not preceded with whitespace.
[INFO]                                                                         
[INFO] ------------------------------------------------------------------------
[INFO] Skipping Apache Maven Enforcer Plugin
[INFO] This project has been banned from the build due to previous failures.
[INFO] ------------------------------------------------------------------------
[INFO] ------------------------------------------------------------------------
[INFO] Reactor Summary:
[INFO] 
[INFO] Apache Maven Enforcer ............................. SUCCESS [9.221s]
[INFO] Apache Maven Enforcer API ......................... SUCCESS [5.346s]
[INFO] Apache Maven Enforcer Rules ....................... FAILURE [15.909s]
[INFO] Apache Maven Enforcer Plugin ...................... SKIPPED
[INFO] ------------------------------------------------------------------------
[INFO] BUILD FAILURE
[INFO] ------------------------------------------------------------------------
[INFO] Total time: 34.876s
[INFO] Finished at: Thu Nov 20 17:50:52 UTC 2014
[INFO] Final Memory: 21M/240M
[INFO] ------------------------------------------------------------------------
Waiting for Jenkins to finish collecting data
[ERROR] Failed to execute goal org.apache.maven.plugins:maven-checkstyle-plugin:2.13:check (checkstyle-check) on project enforcer-rules: You have 3 Checkstyle violations. -> [Help 1]
org.apache.maven.lifecycle.LifecycleExecutionException: Failed to execute goal org.apache.maven.plugins:maven-checkstyle-plugin:2.13:check (checkstyle-check) on project enforcer-rules: You have 3 Checkstyle violations.
	at org.apache.maven.lifecycle.internal.MojoExecutor.execute(MojoExecutor.java:213)
	at org.apache.maven.lifecycle.internal.MojoExecutor.execute(MojoExecutor.java:153)
	at org.apache.maven.lifecycle.internal.MojoExecutor.execute(MojoExecutor.java:145)
	at org.apache.maven.lifecycle.internal.LifecycleModuleBuilder.buildProject(LifecycleModuleBuilder.java:84)
	at org.apache.maven.lifecycle.internal.LifecycleModuleBuilder.buildProject(LifecycleModuleBuilder.java:59)
	at org.apache.maven.lifecycle.internal.LifecycleStarter.singleThreadedBuild(LifecycleStarter.java:183)
	at org.apache.maven.lifecycle.internal.LifecycleStarter.execute(LifecycleStarter.java:161)
	at org.apache.maven.DefaultMaven.doExecute(DefaultMaven.java:320)
	at org.apache.maven.DefaultMaven.execute(DefaultMaven.java:156)
	at org.jvnet.hudson.maven3.launcher.Maven3Launcher.main(Maven3Launcher.java:117)
	at sun.reflect.NativeMethodAccessorImpl.invoke0(Native Method)
	at sun.reflect.NativeMethodAccessorImpl.invoke(NativeMethodAccessorImpl.java:39)
	at sun.reflect.DelegatingMethodAccessorImpl.invoke(DelegatingMethodAccessorImpl.java:25)
	at java.lang.reflect.Method.invoke(Method.java:597)
	at org.codehaus.plexus.classworlds.launcher.Launcher.launchStandard(Launcher.java:329)
	at org.codehaus.plexus.classworlds.launcher.Launcher.launch(Launcher.java:239)
	at org.jvnet.hudson.maven3.agent.Maven3Main.launch(Maven3Main.java:178)
	at sun.reflect.NativeMethodAccessorImpl.invoke0(Native Method)
	at sun.reflect.NativeMethodAccessorImpl.invoke(NativeMethodAccessorImpl.java:39)
	at sun.reflect.DelegatingMethodAccessorImpl.invoke(DelegatingMethodAccessorImpl.java:25)
	at java.lang.reflect.Method.invoke(Method.java:597)
	at hudson.maven.Maven3Builder.call(Maven3Builder.java:134)
	at hudson.maven.Maven3Builder.call(Maven3Builder.java:69)
	at hudson.remoting.UserRequest.perform(UserRequest.java:118)
	at hudson.remoting.UserRequest.perform(UserRequest.java:48)
	at hudson.remoting.Request$2.run(Request.java:328)
	at hudson.remoting.InterceptingExecutorService$1.call(InterceptingExecutorService.java:72)
	at java.util.concurrent.FutureTask$Sync.innerRun(FutureTask.java:303)
	at java.util.concurrent.FutureTask.run(FutureTask.java:138)
	at java.util.concurrent.ThreadPoolExecutor$Worker.runTask(ThreadPoolExecutor.java:895)
	at java.util.concurrent.ThreadPoolExecutor$Worker.run(ThreadPoolExecutor.java:918)
	at java.lang.Thread.run(Thread.java:662)
Caused by: org.apache.maven.plugin.MojoFailureException: You have 3 Checkstyle violations.
	at org.apache.maven.plugin.checkstyle.CheckstyleViolationCheckMojo.execute(CheckstyleViolationCheckMojo.java:582)
	at org.apache.maven.plugin.DefaultBuildPluginManager.executeMojo(DefaultBuildPluginManager.java:101)
	at org.apache.maven.lifecycle.internal.MojoExecutor.execute(MojoExecutor.java:209)
	... 31 more
[ERROR] 
[ERROR] Re-run Maven using the -X switch to enable full debug logging.
[ERROR] 
[ERROR] For more information about the errors and possible solutions, please read the following articles:
[ERROR] [Help 1] http://cwiki.apache.org/confluence/display/MAVEN/MojoFailureException
[ERROR] 
[ERROR] After correcting the problems, you can resume the build with the command
[ERROR]   mvn <goals> -rf :enforcer-rules
[JENKINS] Archiving <https://builds.apache.org/job/maven-enforcer/ws/enforcer-rules/pom.xml> to org.apache.maven.enforcer/enforcer-rules/2.0-SNAPSHOT/enforcer-rules-2.0-SNAPSHOT.pom
[JENKINS] Archiving <https://builds.apache.org/job/maven-enforcer/ws/enforcer-rules/target/enforcer-rules-2.0-SNAPSHOT.jar> to org.apache.maven.enforcer/enforcer-rules/2.0-SNAPSHOT/enforcer-rules-2.0-SNAPSHOT.jar
[JENKINS] Archiving <https://builds.apache.org/job/maven-enforcer/ws/enforcer-rules/target/enforcer-rules-2.0-SNAPSHOT-tests.jar> to org.apache.maven.enforcer/enforcer-rules/2.0-SNAPSHOT/enforcer-rules-2.0-SNAPSHOT-tests.jar
Sending artifact delta relative to maven-enforcer ? Apache Maven Enforcer Rules #199
Archived 3 artifacts
Archive block size is 32768
Received 0 blocks and 201003 bytes
Compression is 0.0%
Took 0.13 sec
[JENKINS] Archiving <https://builds.apache.org/job/maven-enforcer/ws/enforcer-api/pom.xml> to org.apache.maven.enforcer/enforcer-api/2.0-SNAPSHOT/enforcer-api-2.0-SNAPSHOT.pom
[JENKINS] Archiving <https://builds.apache.org/job/maven-enforcer/ws/enforcer-api/target/enforcer-api-2.0-SNAPSHOT.jar> to org.apache.maven.enforcer/enforcer-api/2.0-SNAPSHOT/enforcer-api-2.0-SNAPSHOT.jar
Sending artifact delta relative to maven-enforcer ? Apache Maven Enforcer API #199
Archived 2 artifacts
Archive block size is 32768
Received 0 blocks and 13835 bytes
Compression is 0.0%
Took 44 ms
[JENKINS] Archiving <https://builds.apache.org/job/maven-enforcer/ws/pom.xml> to org.apache.maven.enforcer/enforcer/2.0-SNAPSHOT/enforcer-2.0-SNAPSHOT.pom
[JENKINS] Archiving <https://builds.apache.org/job/maven-enforcer/ws/target/enforcer-2.0-SNAPSHOT-site.xml> to org.apache.maven.enforcer/enforcer/2.0-SNAPSHOT/enforcer-2.0-SNAPSHOT-site.xml
Sending artifact delta relative to maven-enforcer ? Apache Maven Enforcer #199
Archived 2 artifacts
Archive block size is 32768
Received 0 blocks and 9065 bytes
Compression is 0.0%
Took 27 ms
[JENKINS] Archiving <https://builds.apache.org/job/maven-enforcer/ws/maven-enforcer-plugin/pom.xml> to org.apache.maven.plugins/maven-enforcer-plugin/2.0-SNAPSHOT/maven-enforcer-plugin-2.0-SNAPSHOT.pom
Sending artifact delta relative to maven-enforcer ? Apache Maven Enforcer Plugin #199
Archived 1 artifacts
Archive block size is 32768
Received 0 blocks and 7066 bytes
Compression is 0.0%
Took 72 ms
Sending e-mails to: notifications@maven.apache.org khmarbaise@apache.org
channel stopped

Jenkins build is back to normal : maven-enforcer #201

Posted by Apache Jenkins Server <je...@builds.apache.org>.
See <https://builds.apache.org/job/maven-enforcer/201/changes>