You are viewing a plain text version of this content. The canonical link for it is here.
Posted to builds@beam.apache.org by Apache Jenkins Server <je...@builds.apache.org> on 2022/04/13 11:22:17 UTC

Build failed in Jenkins: beam_PostCommit_Java_DataflowV2 #1491

See <https://ci-beam.apache.org/job/beam_PostCommit_Java_DataflowV2/1491/display/redirect>

Changes:


------------------------------------------
[...truncated 45.12 KB...]
> Task :sdks:java:extensions:google-cloud-platform-core:testClasses UP-TO-DATE
> Task :sdks:java:extensions:google-cloud-platform-core:testJar
> Task :sdks:java:io:kafka:jar
> Task :runners:direct-java:shadowJar FROM-CACHE
> Task :sdks:java:extensions:ml:compileJava FROM-CACHE
> Task :sdks:java:extensions:ml:classes UP-TO-DATE
> Task :sdks:java:extensions:ml:jar
> Task :runners:core-java:compileTestJava FROM-CACHE
> Task :runners:core-java:testClasses UP-TO-DATE
> Task :runners:core-java:testJar
> Task :runners:direct-java:compileTestJava FROM-CACHE
> Task :runners:direct-java:testClasses UP-TO-DATE
> Task :sdks:java:io:google-cloud-platform:compileJava FROM-CACHE
> Task :sdks:java:io:google-cloud-platform:classes UP-TO-DATE
> Task :runners:direct-java:shadowTestJar FROM-CACHE
> Task :sdks:java:io:google-cloud-platform:jar
> Task :sdks:java:extensions:protobuf:extractIncludeTestProto
> Task :sdks:java:extensions:protobuf:generateTestProto FROM-CACHE
> Task :sdks:java:extensions:protobuf:compileTestJava FROM-CACHE
> Task :sdks:java:extensions:protobuf:testClasses
> Task :runners:google-cloud-dataflow-java:compileJava FROM-CACHE
> Task :runners:google-cloud-dataflow-java:classes
> Task :examples:java:compileJava FROM-CACHE
> Task :examples:java:classes UP-TO-DATE
> Task :sdks:java:extensions:protobuf:testJar
> Task :runners:google-cloud-dataflow-java:jar
> Task :examples:java:jar
> Task :sdks:java:harness:shadowJar FROM-CACHE
> Task :examples:java:compileTestJava FROM-CACHE
> Task :examples:java:testClasses
> Task :examples:java:testJar

> Task :sdks:java:container:pullLicenses
Copying already-fetched licenses from <https://ci-beam.apache.org/job/beam_PostCommit_Java_DataflowV2/ws/src/sdks/java/container/build/reports/dependency-license> to <https://ci-beam.apache.org/job/beam_PostCommit_Java_DataflowV2/ws/src/sdks/java/container/build/target/java_third_party_licenses>

> Task :sdks:java:io:google-cloud-platform:compileTestJava FROM-CACHE
> Task :sdks:java:io:google-cloud-platform:testClasses
> Task :sdks:java:io:google-cloud-platform:testJar
> Task :sdks:java:container:java8:copyDockerfileDependencies

> Task :sdks:java:container:pullLicenses
Collecting pip
  Using cached pip-22.0.4-py3-none-any.whl (2.1 MB)
Collecting setuptools
  Using cached setuptools-62.1.0-py3-none-any.whl (1.1 MB)
Collecting wheel
  Using cached wheel-0.37.1-py2.py3-none-any.whl (35 kB)
Installing collected packages: pip, setuptools, wheel
  Attempting uninstall: pip
    Found existing installation: pip 20.0.2
    Uninstalling pip-20.0.2:
      Successfully uninstalled pip-20.0.2
  Attempting uninstall: setuptools
    Found existing installation: setuptools 44.0.0
    Uninstalling setuptools-44.0.0:
      Successfully uninstalled setuptools-44.0.0
Successfully installed pip-22.0.4 setuptools-62.1.0 wheel-0.37.1
Collecting beautifulsoup4<5.0,>=4.9.0
  Using cached beautifulsoup4-4.11.1-py3-none-any.whl (128 kB)
Collecting pyyaml<6.0.0,>=3.12
  Using cached PyYAML-5.4.1-cp38-cp38-manylinux1_x86_64.whl (662 kB)
Collecting tenacity<6.0,>=5.0.2
  Using cached tenacity-5.1.5-py2.py3-none-any.whl (34 kB)
Collecting soupsieve>1.2
  Using cached soupsieve-2.3.2-py3-none-any.whl (37 kB)
Collecting six>=1.9.0
  Using cached six-1.16.0-py2.py3-none-any.whl (11 kB)
Installing collected packages: soupsieve, six, pyyaml, tenacity, beautifulsoup4
Successfully installed beautifulsoup4-4.11.1 pyyaml-5.4.1 six-1.16.0 soupsieve-2.3.2 tenacity-5.1.5
Executing python <https://ci-beam.apache.org/job/beam_PostCommit_Java_DataflowV2/ws/src/sdks/java/container/license_scripts/pull_licenses_java.py> --license_index=<https://ci-beam.apache.org/job/beam_PostCommit_Java_DataflowV2/ws/src/sdks/java/container/build/reports/dependency-license/index.json>        --output_dir=<https://ci-beam.apache.org/job/beam_PostCommit_Java_DataflowV2/ws/src/sdks/java/container/build/target/java_third_party_licenses>        --dep_url_yaml=<https://ci-beam.apache.org/job/beam_PostCommit_Java_DataflowV2/ws/src/sdks/java/container/license_scripts/dep_urls_java.yaml>        --manual_license_path=<https://ci-beam.apache.org/job/beam_PostCommit_Java_DataflowV2/ws/src/sdks/java/container/license_scripts/manual_licenses>
INFO:root:Pulling license for 225 dependencies using 16 threads.
INFO:root:Replaced local file URL with file://<https://ci-beam.apache.org/job/beam_PostCommit_Java_DataflowV2/ws/src/sdks/java/container/license_scripts/manual_licenses/xz/COPYING> for xz-1.5
INFO:root:pull_licenses_java.py succeed. It took 8.379552 seconds with 16 threads.
Copying licenses from <https://ci-beam.apache.org/job/beam_PostCommit_Java_DataflowV2/ws/src/sdks/java/container/build/target/java_third_party_licenses> to <https://ci-beam.apache.org/job/beam_PostCommit_Java_DataflowV2/ws/src/sdks/java/container/build/target/third_party_licenses.>
Finished license_scripts.sh

> Task :sdks:java:container:java8:copyJavaThirdPartyLicenses

> Task :release:go-licenses:java:dockerRun
+ go-licenses save github.com/apache/beam/sdks/java/container --save_path=/output/licenses
+ go-licenses csv github.com/apache/beam/sdks/java/container
+ tee /output/licenses/list.csv
github.com/apache/beam/sdks/java/container,https://github.com/apache/beam/blob/master/LICENSE,Apache-2.0
google.golang.org/grpc,https://github.com/grpc/grpc-go/blob/master/LICENSE,Apache-2.0
google.golang.org/protobuf,https://go.googlesource.com/protobuf/+/refs/heads/master/LICENSE,BSD-3-Clause
golang.org/x/text,https://go.googlesource.com/text/+/refs/heads/master/LICENSE,BSD-3-Clause
github.com/apache/beam/sdks/go/pkg/beam,https://github.com/apache/beam/blob/master/sdks/go/README.md,Apache-2.0
golang.org/x/net,https://go.googlesource.com/net/+/refs/heads/master/LICENSE,BSD-3-Clause
golang.org/x/sys,https://go.googlesource.com/sys/+/refs/heads/master/LICENSE,BSD-3-Clause
github.com/golang/protobuf,https://github.com/golang/protobuf/blob/master/LICENSE,BSD-3-Clause
google.golang.org/genproto/googleapis/rpc/status,https://github.com/googleapis/go-genproto/blob/master/LICENSE,Apache-2.0
+ chmod -R a+w /output/licenses

> Task :release:go-licenses:java:createLicenses
> Task :sdks:java:container:java8:copyGolangLicenses
> Task :sdks:java:container:java8:dockerPrepare
> Task :sdks:java:container:java8:docker

> Task :runners:google-cloud-dataflow-java:buildAndPushDockerJavaContainer
WARNING: `gcloud docker` will not be supported for Docker client versions above 18.03.

As an alternative, use `gcloud auth configure-docker` to configure `docker` to
use `gcloud` as a credential helper, then use `docker` as you would for non-GCR
registries, e.g. `docker pull gcr.io/project-id/my-image`. Add
`--verbosity=error` to silence this warning: `gcloud docker
--verbosity=error -- pull gcr.io/project-id/my-image`.

See: https://cloud.google.com/container-registry/docs/support/deprecation-notices#gcloud-docker

The push refers to repository [us.gcr.io/apache-beam-testing/java-postcommit-it/java]
b3640e60cab9: Preparing
fc42abf240ac: Preparing
fa6a26e81cb7: Preparing
aec392186f93: Preparing
68fe887fe563: Preparing
148a1021ac41: Preparing
c836f49f5353: Preparing
94f0f43d5641: Preparing
e62a58e94adc: Preparing
375bd58b7d06: Preparing
0965b12e3bd3: Preparing
90d98473e7ee: Preparing
9b8972a80aa1: Preparing
fbcefe97835f: Preparing
1c3738cfc6cf: Preparing
7494d840ea88: Preparing
357cc1947e95: Preparing
b0dc1a441986: Preparing
7a7698da17f2: Preparing
d59769727d80: Preparing
348622fdcc61: Preparing
4ac8bc2cd0be: Preparing
148a1021ac41: Waiting
c836f49f5353: Waiting
1c3738cfc6cf: Waiting
0965b12e3bd3: Waiting
94f0f43d5641: Waiting
7494d840ea88: Waiting
d59769727d80: Waiting
357cc1947e95: Waiting
348622fdcc61: Waiting
fbcefe97835f: Waiting
90d98473e7ee: Waiting
9b8972a80aa1: Waiting
7a7698da17f2: Waiting
375bd58b7d06: Waiting
e62a58e94adc: Waiting
b0dc1a441986: Waiting
4ac8bc2cd0be: Waiting
fc42abf240ac: Pushed
fa6a26e81cb7: Pushed
68fe887fe563: Pushed
aec392186f93: Pushed
b3640e60cab9: Pushed
c836f49f5353: Pushed
94f0f43d5641: Pushed
148a1021ac41: Pushed
e62a58e94adc: Pushed
375bd58b7d06: Pushed
90d98473e7ee: Pushed
7494d840ea88: Layer already exists
0965b12e3bd3: Pushed
357cc1947e95: Layer already exists
b0dc1a441986: Layer already exists
7a7698da17f2: Layer already exists
d59769727d80: Layer already exists
348622fdcc61: Layer already exists
4ac8bc2cd0be: Layer already exists
1c3738cfc6cf: Pushed
fbcefe97835f: Pushed
9b8972a80aa1: Pushed
20220413095736: digest: sha256:c6fe72ec69c1ee97a8d002bd3feb2f1e5f3065792dbdd4915537124f9f052cea size: 4935

> Task :runners:google-cloud-dataflow-java:coreSDKJavaRunnerV2IntegrationTest NO-SOURCE
> Task :runners:google-cloud-dataflow-java:examplesJavaRunnerV2IntegrationTest

***********************************************************
***********************************************************
**********************Set Up Pubsub************************
The Pub/Sub topic has been set up for this example: projects/apache-beam-testing/topics/testpipeline-jenkins-0413095945-f429bea3
The Pub/Sub subscription has been set up for this example: projects/apache-beam-testing/subscriptions/testpipeline-jenkins-0413095945-f429bea3
*************************Tear Down*************************
The Pub/Sub topic has been deleted: projects/apache-beam-testing/topics/testpipeline-jenkins-0413095945-f429bea3
The Pub/Sub subscription has been deleted: projects/apache-beam-testing/subscriptions/testpipeline-jenkins-0413095945-f429bea3
***********************************************************
***********************************************************

***********************************************************
***********************************************************
**********************Set Up Pubsub************************
The Pub/Sub topic has been set up for this example: projects/apache-beam-testing/topics/testpipeline-jenkins-0413095945-8c0ffbdd
The Pub/Sub subscription has been set up for this example: projects/apache-beam-testing/subscriptions/testpipeline-jenkins-0413095945-8c0ffbdd
*************************Tear Down*************************
The Pub/Sub topic has been deleted: projects/apache-beam-testing/topics/testpipeline-jenkins-0413095945-8c0ffbdd
The Pub/Sub subscription has been deleted: projects/apache-beam-testing/subscriptions/testpipeline-jenkins-0413095945-8c0ffbdd
***********************************************************
***********************************************************

> Task :runners:google-cloud-dataflow-java:googleCloudPlatformRunnerV2IntegrationTest

org.apache.beam.sdk.io.gcp.pubsublite.ReadWriteIT > testReadWrite FAILED
    java.lang.AssertionError at ReadWriteIT.java:264

47 tests completed, 1 failed, 5 skipped

> Task :runners:google-cloud-dataflow-java:googleCloudPlatformRunnerV2IntegrationTest FAILED

> Task :runners:google-cloud-dataflow-java:cleanUpDockerJavaImages
Untagged: us.gcr.io/apache-beam-testing/java-postcommit-it/java:20220413095736
Untagged: us.gcr.io/apache-beam-testing/java-postcommit-it/java@sha256:c6fe72ec69c1ee97a8d002bd3feb2f1e5f3065792dbdd4915537124f9f052cea
Tag: [us.gcr.io/apache-beam-testing/java-postcommit-it/java:20220413095736]
- referencing digest: [us.gcr.io/apache-beam-testing/java-postcommit-it/java@sha256:c6fe72ec69c1ee97a8d002bd3feb2f1e5f3065792dbdd4915537124f9f052cea]

Deleted [[us.gcr.io/apache-beam-testing/java-postcommit-it/java:20220413095736] (referencing [us.gcr.io/apache-beam-testing/java-postcommit-it/java@sha256:c6fe72ec69c1ee97a8d002bd3feb2f1e5f3065792dbdd4915537124f9f052cea])].
Removing untagged image us.gcr.io/apache-beam-testing/java-postcommit-it/java@sha256:c6fe72ec69c1ee97a8d002bd3feb2f1e5f3065792dbdd4915537124f9f052cea
Digests:
- us.gcr.io/apache-beam-testing/java-postcommit-it/java@sha256:c6fe72ec69c1ee97a8d002bd3feb2f1e5f3065792dbdd4915537124f9f052cea
Deleted [us.gcr.io/apache-beam-testing/java-postcommit-it/java@sha256:c6fe72ec69c1ee97a8d002bd3feb2f1e5f3065792dbdd4915537124f9f052cea].

FAILURE: Build failed with an exception.

* What went wrong:
Execution failed for task ':runners:google-cloud-dataflow-java:googleCloudPlatformRunnerV2IntegrationTest'.
> There were failing tests. See the report at: file://<https://ci-beam.apache.org/job/beam_PostCommit_Java_DataflowV2/ws/src/runners/google-cloud-dataflow-java/build/reports/tests/googleCloudPlatformRunnerV2IntegrationTest/index.html>

* Try:
> Run with --stacktrace option to get the stack trace.
> Run with --info or --debug option to get more log output.
> Run with --scan to get full insights.

* Get more help at https://help.gradle.org

Deprecated Gradle features were used in this build, making it incompatible with Gradle 8.0.

You can use '--warning-mode all' to show the individual deprecation warnings and determine if they come from your own scripts or plugins.

See https://docs.gradle.org/7.3.2/userguide/command_line_interface.html#sec:command_line_warnings

Execution optimizations have been disabled for 1 invalid unit(s) of work during this build to ensure correctness.
Please consult deprecation warnings for more details.

BUILD FAILED in 1h 24m 51s
141 actionable tasks: 90 executed, 47 from cache, 4 up-to-date

Publishing build scan...
https://gradle.com/s/keeaobzqznnaq

Build step 'Invoke Gradle script' changed build result to FAILURE
Build step 'Invoke Gradle script' marked build as failure

---------------------------------------------------------------------
To unsubscribe, e-mail: builds-unsubscribe@beam.apache.org
For additional commands, e-mail: builds-help@beam.apache.org


Jenkins build is back to normal : beam_PostCommit_Java_DataflowV2 #1500

Posted by Apache Jenkins Server <je...@builds.apache.org>.
See <https://ci-beam.apache.org/job/beam_PostCommit_Java_DataflowV2/1500/display/redirect>


---------------------------------------------------------------------
To unsubscribe, e-mail: builds-unsubscribe@beam.apache.org
For additional commands, e-mail: builds-help@beam.apache.org


Build failed in Jenkins: beam_PostCommit_Java_DataflowV2 #1499

Posted by Apache Jenkins Server <je...@builds.apache.org>.
See <https://ci-beam.apache.org/job/beam_PostCommit_Java_DataflowV2/1499/display/redirect>

Changes:


------------------------------------------
[...truncated 53.12 KB...]
    Uninstalling pip-20.0.2:
      Successfully uninstalled pip-20.0.2
  Attempting uninstall: setuptools
    Found existing installation: setuptools 44.0.0
    Uninstalling setuptools-44.0.0:
      Successfully uninstalled setuptools-44.0.0
Successfully installed pip-22.0.4 setuptools-62.1.0 wheel-0.37.1
Collecting beautifulsoup4<5.0,>=4.9.0
  Using cached beautifulsoup4-4.11.1-py3-none-any.whl (128 kB)
Collecting pyyaml<6.0.0,>=3.12
  Using cached PyYAML-5.4.1-cp38-cp38-manylinux1_x86_64.whl (662 kB)
Collecting tenacity<6.0,>=5.0.2
  Using cached tenacity-5.1.5-py2.py3-none-any.whl (34 kB)
Collecting soupsieve>1.2
  Using cached soupsieve-2.3.2.post1-py3-none-any.whl (37 kB)
Collecting six>=1.9.0
  Using cached six-1.16.0-py2.py3-none-any.whl (11 kB)
Installing collected packages: soupsieve, six, pyyaml, tenacity, beautifulsoup4
Successfully installed beautifulsoup4-4.11.1 pyyaml-5.4.1 six-1.16.0 soupsieve-2.3.2.post1 tenacity-5.1.5
Executing python <https://ci-beam.apache.org/job/beam_PostCommit_Java_DataflowV2/ws/src/sdks/java/container/license_scripts/pull_licenses_java.py> --license_index=<https://ci-beam.apache.org/job/beam_PostCommit_Java_DataflowV2/ws/src/sdks/java/container/build/reports/dependency-license/index.json>        --output_dir=<https://ci-beam.apache.org/job/beam_PostCommit_Java_DataflowV2/ws/src/sdks/java/container/build/target/java_third_party_licenses>        --dep_url_yaml=<https://ci-beam.apache.org/job/beam_PostCommit_Java_DataflowV2/ws/src/sdks/java/container/license_scripts/dep_urls_java.yaml>        --manual_license_path=<https://ci-beam.apache.org/job/beam_PostCommit_Java_DataflowV2/ws/src/sdks/java/container/license_scripts/manual_licenses>
INFO:root:Pulling license for 225 dependencies using 16 threads.
INFO:root:Replaced local file URL with file://<https://ci-beam.apache.org/job/beam_PostCommit_Java_DataflowV2/ws/src/sdks/java/container/license_scripts/manual_licenses/xz/COPYING> for xz-1.5
INFO:root:pull_licenses_java.py succeed. It took 8.110877 seconds with 16 threads.
Copying licenses from <https://ci-beam.apache.org/job/beam_PostCommit_Java_DataflowV2/ws/src/sdks/java/container/build/target/java_third_party_licenses> to <https://ci-beam.apache.org/job/beam_PostCommit_Java_DataflowV2/ws/src/sdks/java/container/build/target/third_party_licenses.>
Finished license_scripts.sh

> Task :sdks:java:container:goPrepare UP-TO-DATE

> Task :release:go-licenses:java:dockerRun
+ rm -rf '/output/*'
+ export GO111MODULE=off
+ GO111MODULE=off
+ go get github.com/apache/beam/sdks/java/container

> Task :sdks:java:container:java8:copyJavaThirdPartyLicenses

> Task :sdks:java:container:goBuild
/home/jenkins/go/bin/go1.16.12 build -o ./build/target/linux_amd64/boot boot.go

> Task :sdks:java:container:java8:copySdkHarnessLauncher
Execution optimizations have been disabled for task ':sdks:java:container:java8:copySdkHarnessLauncher' to ensure correctness due to the following reasons:
  - Gradle detected a problem with the following location: '<https://ci-beam.apache.org/job/beam_PostCommit_Java_DataflowV2/ws/src/sdks/java/container/build/target'.> Reason: Task ':sdks:java:container:java8:copySdkHarnessLauncher' uses this output of task ':sdks:java:container:downloadCloudProfilerAgent' without declaring an explicit or implicit dependency. This can lead to incorrect results being produced, depending on what order the tasks are executed. Please refer to https://docs.gradle.org/7.4/userguide/validation_problems.html#implicit_dependency for more details about this problem.
  - Gradle detected a problem with the following location: '<https://ci-beam.apache.org/job/beam_PostCommit_Java_DataflowV2/ws/src/sdks/java/container/build/target'.> Reason: Task ':sdks:java:container:java8:copySdkHarnessLauncher' uses this output of task ':sdks:java:container:pullLicenses' without declaring an explicit or implicit dependency. This can lead to incorrect results being produced, depending on what order the tasks are executed. Please refer to https://docs.gradle.org/7.4/userguide/validation_problems.html#implicit_dependency for more details about this problem.

> Task :release:go-licenses:java:dockerRun
+ go-licenses save github.com/apache/beam/sdks/java/container --save_path=/output/licenses
+ go-licenses csv github.com/apache/beam/sdks/java/container
+ tee /output/licenses/list.csv
github.com/apache/beam/sdks/go/pkg/beam,https://github.com/apache/beam/blob/master/sdks/go/README.md,Apache-2.0
github.com/golang/protobuf,https://github.com/golang/protobuf/blob/master/LICENSE,BSD-3-Clause
golang.org/x/text,https://go.googlesource.com/text/+/refs/heads/master/LICENSE,BSD-3-Clause
github.com/apache/beam/sdks/java/container,https://github.com/apache/beam/blob/master/LICENSE,Apache-2.0
golang.org/x/net,https://go.googlesource.com/net/+/refs/heads/master/LICENSE,BSD-3-Clause
golang.org/x/sys,https://go.googlesource.com/sys/+/refs/heads/master/LICENSE,BSD-3-Clause
google.golang.org/protobuf,https://go.googlesource.com/protobuf/+/refs/heads/master/LICENSE,BSD-3-Clause
google.golang.org/genproto/googleapis/rpc/status,https://github.com/googleapis/go-genproto/blob/master/LICENSE,Apache-2.0
google.golang.org/grpc,https://github.com/grpc/grpc-go/blob/master/LICENSE,Apache-2.0
+ chmod -R a+w /output/licenses

> Task :release:go-licenses:java:createLicenses
> Task :sdks:java:container:java8:copyGolangLicenses
> Task :sdks:java:container:java8:dockerPrepare
> Task :sdks:java:container:java8:docker

> Task :runners:google-cloud-dataflow-java:buildAndPushDockerJavaContainer
WARNING: `gcloud docker` will not be supported for Docker client versions above 18.03.

As an alternative, use `gcloud auth configure-docker` to configure `docker` to
use `gcloud` as a credential helper, then use `docker` as you would for non-GCR
registries, e.g. `docker pull gcr.io/project-id/my-image`. Add
`--verbosity=error` to silence this warning: `gcloud docker
--verbosity=error -- pull gcr.io/project-id/my-image`.

See: https://cloud.google.com/container-registry/docs/support/deprecation-notices#gcloud-docker

The push refers to repository [us.gcr.io/apache-beam-testing/java-postcommit-it/java]
aeccdb203bf1: Preparing
b621cffde654: Preparing
24c5bcdb7099: Preparing
9f9a0c675d91: Preparing
94411b7ec9d8: Preparing
61749de78c3a: Preparing
c89345ec3f27: Preparing
6f47f0aa97e0: Preparing
c3f8651812d6: Preparing
4ec7f8fc8bde: Preparing
61b43e04926b: Preparing
a355382600c0: Preparing
f46ffeea169b: Preparing
55fcf9f43515: Preparing
2a79411858a2: Preparing
7494d840ea88: Preparing
357cc1947e95: Preparing
b0dc1a441986: Preparing
7a7698da17f2: Preparing
d59769727d80: Preparing
348622fdcc61: Preparing
4ac8bc2cd0be: Preparing
2a79411858a2: Waiting
7494d840ea88: Waiting
c89345ec3f27: Waiting
357cc1947e95: Waiting
61749de78c3a: Waiting
b0dc1a441986: Waiting
f46ffeea169b: Waiting
a355382600c0: Waiting
7a7698da17f2: Waiting
61b43e04926b: Waiting
4ec7f8fc8bde: Waiting
6f47f0aa97e0: Waiting
4ac8bc2cd0be: Waiting
55fcf9f43515: Waiting
d59769727d80: Waiting
348622fdcc61: Waiting
c3f8651812d6: Waiting
b621cffde654: Pushed
94411b7ec9d8: Pushed
9f9a0c675d91: Pushed
24c5bcdb7099: Pushed
aeccdb203bf1: Pushed
4ec7f8fc8bde: Pushed
c89345ec3f27: Pushed
6f47f0aa97e0: Pushed
61749de78c3a: Pushed
c3f8651812d6: Pushed
61b43e04926b: Pushed
a355382600c0: Pushed
55fcf9f43515: Pushed
2a79411858a2: Pushed
7494d840ea88: Layer already exists
357cc1947e95: Layer already exists
b0dc1a441986: Layer already exists
7a7698da17f2: Layer already exists
d59769727d80: Layer already exists
348622fdcc61: Layer already exists
4ac8bc2cd0be: Layer already exists
f46ffeea169b: Pushed
20220415095728: digest: sha256:11428b379183db4a6793bf2c77b3077707969e84dc1b8077e001f5ba881b3b0a size: 4935

> Task :runners:google-cloud-dataflow-java:coreSDKJavaRunnerV2IntegrationTest NO-SOURCE
> Task :runners:google-cloud-dataflow-java:examplesJavaRunnerV2IntegrationTest

***********************************************************
***********************************************************
**********************Set Up Pubsub************************
The Pub/Sub topic has been set up for this example: projects/apache-beam-testing/topics/testpipeline-jenkins-0415095947-9be8cd51
The Pub/Sub subscription has been set up for this example: projects/apache-beam-testing/subscriptions/testpipeline-jenkins-0415095947-9be8cd51
*************************Tear Down*************************
The Pub/Sub topic has been deleted: projects/apache-beam-testing/topics/testpipeline-jenkins-0415095947-9be8cd51
The Pub/Sub subscription has been deleted: projects/apache-beam-testing/subscriptions/testpipeline-jenkins-0415095947-9be8cd51
***********************************************************
***********************************************************

***********************************************************
***********************************************************
**********************Set Up Pubsub************************
The Pub/Sub topic has been set up for this example: projects/apache-beam-testing/topics/testpipeline-jenkins-0415095946-5c6709f7
The Pub/Sub subscription has been set up for this example: projects/apache-beam-testing/subscriptions/testpipeline-jenkins-0415095946-5c6709f7
*************************Tear Down*************************
The Pub/Sub topic has been deleted: projects/apache-beam-testing/topics/testpipeline-jenkins-0415095946-5c6709f7
The Pub/Sub subscription has been deleted: projects/apache-beam-testing/subscriptions/testpipeline-jenkins-0415095946-5c6709f7
***********************************************************
***********************************************************

> Task :runners:google-cloud-dataflow-java:googleCloudPlatformRunnerV2IntegrationTest

org.apache.beam.sdk.io.gcp.pubsublite.ReadWriteIT > testReadWrite FAILED
    java.lang.AssertionError at ReadWriteIT.java:264

47 tests completed, 1 failed, 3 skipped

> Task :runners:google-cloud-dataflow-java:googleCloudPlatformRunnerV2IntegrationTest FAILED

> Task :runners:google-cloud-dataflow-java:cleanUpDockerJavaImages
Untagged: us.gcr.io/apache-beam-testing/java-postcommit-it/java:20220415095728
Untagged: us.gcr.io/apache-beam-testing/java-postcommit-it/java@sha256:11428b379183db4a6793bf2c77b3077707969e84dc1b8077e001f5ba881b3b0a
Deleted: sha256:eab333fe6cc2906a4d95144194531fc2630d504510ca6a7553f0b4bd41a2a21b
Deleted: sha256:0a5af55700785824df7ff0ebf16605b55090256523958721bac55d27f9c40ce1
Deleted: sha256:1c21320adf3096375d21fa288d69ff8aea6a6621be9b2e1302b7da31e513b57d
Deleted: sha256:f3d30f7bd2a67412ebcab96b7e340b33333186315180fc1bc3f2bee5a9f196d2
Deleted: sha256:fa7a500aa166d6c899fa4fc340ff796eabad8a47696dc868a65300ddf7a6e2dc
Deleted: sha256:cabd28f402edf9caf6927fea0a0ff97ca561c0dbfd028756f66a43a73d1ef848
Deleted: sha256:1bcf10490679c1d7d185b8067ea782c0bb055a9acd6f2152eff894ba328c63d4
Deleted: sha256:27024072de1b216492c013b41843cdd89822bf3a14ec9614d0b1c632864290df
Deleted: sha256:7f7ab30e88a6e2af88f0229a136821f57f357cd5ee07d8172bb2cb38b1666971
Deleted: sha256:fbe42a281df686ca2e3ae3e158763d1ef51f6ada12a47923a985b11f6eb2dc34
Deleted: sha256:60b80ca1be22183135ea9859f0e8deec1ae2d8c90456d8c86b40907e2e365f99
Deleted: sha256:82daafb660525349d8d169c910eab143eecb9d5f54880771222b5f228c27b0b5
Deleted: sha256:a89927d42bdd686c1d61f40ce2fe8f6f3c756ce0833396b06219eae149da00b3
Deleted: sha256:f328b193b9c5efd8f2fc6f85b3d4f07600995e429515514635f24dc85a1e5fce
Deleted: sha256:59106ef9cddd403ad2417e17d7240ec7475c160d08a8992a0f95a5dfbc9334be
Deleted: sha256:66e1dc0b9dde2f405a2bbaace93c273feb4aae4f5576a8b50bc43d413df419f3
Deleted: sha256:6d1cf2053a8c9fa40cbe1ad6c49d7c8d4b2b0a405f2d6ce97f922e4038c1ea80
Deleted: sha256:8c97206fe59ae94c0712f0d7b0e86e25c45f39f2d5aadac0ce7b73cfd5fe1a25
Deleted: sha256:f10009723750bc0103cd097cc74a0712d7a73ce6ecaae5c0b5185e0bc7a23f53
Deleted: sha256:fcbd154429133d930bbc8f64b045394bd1231cda0c58e2fee7c473474c8395b8
Deleted: sha256:e8f0f91978bb19c7558c301ef9d2cb9f527253e6f2d04801ec31b6078fda99fd
Deleted: sha256:2fd5edb90792617e66bc4dfb395ad1fd6340c5aa96733cb98ddd85135670e79f
Deleted: sha256:bbeb349026752823dcfd3963add4886991ace5d7ee64d43b279bd54dab1cd527
Deleted: sha256:ee82fac4a43b54fb6255b9387e2af01e5935b3d51f38d6557fbeebb286dd4b8d
Deleted: sha256:be2bf2a249213996d8e16cfd00a5c2338aad72902a298593fd85c52af6df64eb
Deleted: sha256:8fb362f5297a4666ea878eaaf11565832f06179b4299619b4fac8e84d75c19c8
Deleted: sha256:cc22fb53e9052b5a7759508cf5c43a78665ebd1b0b4d426e1801481e3277e3cd
Deleted: sha256:aaa145494742557f71936e7a27bcc21aef342ac12d1653454b3ac2c9d1cd1627
Deleted: sha256:af3019e0aa0f6df5fad37c76692569a34240699462cc7d417b6ca59ca51782d7
Deleted: sha256:2a7fe8e732a3b487a882ee8d8efd583676a933f0b7ae8ffb66c7be054891d21b
Deleted: sha256:e08dfd39b36e40a7d4ad35d4e39e187d96225b22ef3122eba4ab2d96bd9e5ed5
Deleted: sha256:5795e147d0c1626edc903f534db7f3bc87d26d41d1d2d7680aa788081d8d83b9
Deleted: sha256:030a892ed5a6788de697a8f3cabe836bba056eb888d4e35821ee3216ac4c466e
Deleted: sha256:ae0c38f1f9b761c42f6f3fbba30031475570987773df356c2809f221961f230f
Tag: [us.gcr.io/apache-beam-testing/java-postcommit-it/java:20220415095728]
- referencing digest: [us.gcr.io/apache-beam-testing/java-postcommit-it/java@sha256:11428b379183db4a6793bf2c77b3077707969e84dc1b8077e001f5ba881b3b0a]

Deleted [[us.gcr.io/apache-beam-testing/java-postcommit-it/java:20220415095728] (referencing [us.gcr.io/apache-beam-testing/java-postcommit-it/java@sha256:11428b379183db4a6793bf2c77b3077707969e84dc1b8077e001f5ba881b3b0a])].
Removing untagged image us.gcr.io/apache-beam-testing/java-postcommit-it/java@sha256:11428b379183db4a6793bf2c77b3077707969e84dc1b8077e001f5ba881b3b0a
Digests:
- us.gcr.io/apache-beam-testing/java-postcommit-it/java@sha256:11428b379183db4a6793bf2c77b3077707969e84dc1b8077e001f5ba881b3b0a
Deleted [us.gcr.io/apache-beam-testing/java-postcommit-it/java@sha256:11428b379183db4a6793bf2c77b3077707969e84dc1b8077e001f5ba881b3b0a].

FAILURE: Build failed with an exception.

* What went wrong:
Execution failed for task ':runners:google-cloud-dataflow-java:googleCloudPlatformRunnerV2IntegrationTest'.
> There were failing tests. See the report at: file://<https://ci-beam.apache.org/job/beam_PostCommit_Java_DataflowV2/ws/src/runners/google-cloud-dataflow-java/build/reports/tests/googleCloudPlatformRunnerV2IntegrationTest/index.html>

* Try:
> Run with --stacktrace option to get the stack trace.
> Run with --info or --debug option to get more log output.
> Run with --scan to get full insights.

* Get more help at https://help.gradle.org

Deprecated Gradle features were used in this build, making it incompatible with Gradle 8.0.

You can use '--warning-mode all' to show the individual deprecation warnings and determine if they come from your own scripts or plugins.

See https://docs.gradle.org/7.4/userguide/command_line_interface.html#sec:command_line_warnings

Execution optimizations have been disabled for 1 invalid unit(s) of work during this build to ensure correctness.
Please consult deprecation warnings for more details.

BUILD FAILED in 1h 21m 11s
141 actionable tasks: 90 executed, 47 from cache, 4 up-to-date

Publishing build scan...
https://gradle.com/s/r5c6moa5rjpxw

Build step 'Invoke Gradle script' changed build result to FAILURE
Build step 'Invoke Gradle script' marked build as failure

---------------------------------------------------------------------
To unsubscribe, e-mail: builds-unsubscribe@beam.apache.org
For additional commands, e-mail: builds-help@beam.apache.org


Build failed in Jenkins: beam_PostCommit_Java_DataflowV2 #1498

Posted by Apache Jenkins Server <je...@builds.apache.org>.
See <https://ci-beam.apache.org/job/beam_PostCommit_Java_DataflowV2/1498/display/redirect?page=changes>

Changes:

[noreply] [BEAM-17035] Call python3 directly when it is available. (#17366)

[noreply] Merge pull request #17375: [BEAM-8691] Declare newer


------------------------------------------
[...truncated 51.61 KB...]
INFO:root:pull_licenses_java.py succeed. It took 7.825997 seconds with 16 threads.
Copying licenses from <https://ci-beam.apache.org/job/beam_PostCommit_Java_DataflowV2/ws/src/sdks/java/container/build/target/java_third_party_licenses> to <https://ci-beam.apache.org/job/beam_PostCommit_Java_DataflowV2/ws/src/sdks/java/container/build/target/third_party_licenses.>

> Task :sdks:java:extensions:ml:compileJava
> Task :sdks:java:extensions:ml:classes
> Task :sdks:java:extensions:ml:jar

> Task :sdks:java:container:pullLicenses
Finished license_scripts.sh

> Task :sdks:java:container:goPrepare UP-TO-DATE
> Task :sdks:java:container:java8:copyJavaThirdPartyLicenses

> Task :sdks:java:container:goBuild
/home/jenkins/go/bin/go1.16.12 build -o ./build/target/linux_amd64/boot boot.go

> Task :sdks:java:container:java8:copySdkHarnessLauncher
Execution optimizations have been disabled for task ':sdks:java:container:java8:copySdkHarnessLauncher' to ensure correctness due to the following reasons:
  - Gradle detected a problem with the following location: '<https://ci-beam.apache.org/job/beam_PostCommit_Java_DataflowV2/ws/src/sdks/java/container/build/target'.> Reason: Task ':sdks:java:container:java8:copySdkHarnessLauncher' uses this output of task ':sdks:java:container:downloadCloudProfilerAgent' without declaring an explicit or implicit dependency. This can lead to incorrect results being produced, depending on what order the tasks are executed. Please refer to https://docs.gradle.org/7.4/userguide/validation_problems.html#implicit_dependency for more details about this problem.
  - Gradle detected a problem with the following location: '<https://ci-beam.apache.org/job/beam_PostCommit_Java_DataflowV2/ws/src/sdks/java/container/build/target'.> Reason: Task ':sdks:java:container:java8:copySdkHarnessLauncher' uses this output of task ':sdks:java:container:pullLicenses' without declaring an explicit or implicit dependency. This can lead to incorrect results being produced, depending on what order the tasks are executed. Please refer to https://docs.gradle.org/7.4/userguide/validation_problems.html#implicit_dependency for more details about this problem.

> Task :sdks:java:io:google-cloud-platform:compileTestJava
Note: Some input files use or override a deprecated API.
Note: Recompile with -Xlint:deprecation for details.
Note: Some input files use unchecked or unsafe operations.
Note: Recompile with -Xlint:unchecked for details.

> Task :sdks:java:io:google-cloud-platform:testClasses
> Task :sdks:java:io:google-cloud-platform:testJar
> Task :examples:java:compileJava
Note: Some input files use or override a deprecated API.
Note: Recompile with -Xlint:deprecation for details.
Note: Some input files use unchecked or unsafe operations.
Note: Recompile with -Xlint:unchecked for details.

> Task :examples:java:classes
> Task :examples:java:jar

> Task :examples:java:compileTestJava
Note: Some input files use or override a deprecated API.
Note: Recompile with -Xlint:deprecation for details.
Note: Some input files use unchecked or unsafe operations.
Note: Recompile with -Xlint:unchecked for details.

> Task :examples:java:testClasses
> Task :examples:java:testJar

> Task :release:go-licenses:java:dockerRun
+ go-licenses save github.com/apache/beam/sdks/java/container --save_path=/output/licenses
+ go-licenses csv github.com/apache/beam/sdks/java/container
+ tee /output/licenses/list.csv
golang.org/x/net,https://go.googlesource.com/net/+/refs/heads/master/LICENSE,BSD-3-Clause
golang.org/x/sys,https://go.googlesource.com/sys/+/refs/heads/master/LICENSE,BSD-3-Clause
github.com/golang/protobuf,https://github.com/golang/protobuf/blob/master/LICENSE,BSD-3-Clause
google.golang.org/genproto/googleapis/rpc/status,https://github.com/googleapis/go-genproto/blob/master/LICENSE,Apache-2.0
golang.org/x/text,https://go.googlesource.com/text/+/refs/heads/master/LICENSE,BSD-3-Clause
github.com/apache/beam/sdks/java/container,https://github.com/apache/beam/blob/master/LICENSE,Apache-2.0
google.golang.org/grpc,https://github.com/grpc/grpc-go/blob/master/LICENSE,Apache-2.0
github.com/apache/beam/sdks/go/pkg/beam,https://github.com/apache/beam/blob/master/sdks/go/README.md,Apache-2.0
google.golang.org/protobuf,https://go.googlesource.com/protobuf/+/refs/heads/master/LICENSE,BSD-3-Clause
+ chmod -R a+w /output/licenses

> Task :release:go-licenses:java:createLicenses
> Task :sdks:java:container:java8:copyGolangLicenses
> Task :sdks:java:container:java8:dockerPrepare
> Task :sdks:java:container:java8:docker

> Task :runners:google-cloud-dataflow-java:buildAndPushDockerJavaContainer
WARNING: `gcloud docker` will not be supported for Docker client versions above 18.03.

As an alternative, use `gcloud auth configure-docker` to configure `docker` to
use `gcloud` as a credential helper, then use `docker` as you would for non-GCR
registries, e.g. `docker pull gcr.io/project-id/my-image`. Add
`--verbosity=error` to silence this warning: `gcloud docker
--verbosity=error -- pull gcr.io/project-id/my-image`.

See: https://cloud.google.com/container-registry/docs/support/deprecation-notices#gcloud-docker

The push refers to repository [us.gcr.io/apache-beam-testing/java-postcommit-it/java]
6cf83c9cc658: Preparing
3a31d27f6efb: Preparing
52042dc2f43d: Preparing
dc867369af9f: Preparing
8a1bce71ea84: Preparing
73c595025f72: Preparing
98465f330a1d: Preparing
6a5fe35b8fa3: Preparing
c3574d2e8fa2: Preparing
e88a6f8feed1: Preparing
dbc677d62595: Preparing
6722def6136b: Preparing
48ac0544f66a: Preparing
3aa5bc1e2ca7: Preparing
196b4997a6c5: Preparing
7494d840ea88: Preparing
357cc1947e95: Preparing
b0dc1a441986: Preparing
7a7698da17f2: Preparing
d59769727d80: Preparing
348622fdcc61: Preparing
4ac8bc2cd0be: Preparing
98465f330a1d: Waiting
dbc677d62595: Waiting
e88a6f8feed1: Waiting
6a5fe35b8fa3: Waiting
c3574d2e8fa2: Waiting
73c595025f72: Waiting
3aa5bc1e2ca7: Waiting
7494d840ea88: Waiting
196b4997a6c5: Waiting
357cc1947e95: Waiting
348622fdcc61: Waiting
d59769727d80: Waiting
7a7698da17f2: Waiting
4ac8bc2cd0be: Waiting
8a1bce71ea84: Pushed
3a31d27f6efb: Pushed
6cf83c9cc658: Pushed
52042dc2f43d: Pushed
dc867369af9f: Pushed
6a5fe35b8fa3: Pushed
98465f330a1d: Pushed
e88a6f8feed1: Pushed
dbc677d62595: Pushed
c3574d2e8fa2: Pushed
6722def6136b: Pushed
7494d840ea88: Layer already exists
73c595025f72: Pushed
357cc1947e95: Layer already exists
b0dc1a441986: Layer already exists
7a7698da17f2: Layer already exists
d59769727d80: Layer already exists
348622fdcc61: Layer already exists
4ac8bc2cd0be: Layer already exists
196b4997a6c5: Pushed
3aa5bc1e2ca7: Pushed
48ac0544f66a: Pushed
20220415035729: digest: sha256:892e6b36fe2093adaf5dbc335da7a297aed8157532472c0a5d24ca4ce2cfd94b size: 4935

> Task :runners:google-cloud-dataflow-java:coreSDKJavaRunnerV2IntegrationTest NO-SOURCE
> Task :runners:google-cloud-dataflow-java:examplesJavaRunnerV2IntegrationTest

***********************************************************
***********************************************************
**********************Set Up Pubsub************************
The Pub/Sub topic has been set up for this example: projects/apache-beam-testing/topics/testpipeline-jenkins-0415035950-e33c86d0
The Pub/Sub subscription has been set up for this example: projects/apache-beam-testing/subscriptions/testpipeline-jenkins-0415035950-e33c86d0
*************************Tear Down*************************
The Pub/Sub topic has been deleted: projects/apache-beam-testing/topics/testpipeline-jenkins-0415035950-e33c86d0
The Pub/Sub subscription has been deleted: projects/apache-beam-testing/subscriptions/testpipeline-jenkins-0415035950-e33c86d0
***********************************************************
***********************************************************

***********************************************************
***********************************************************
**********************Set Up Pubsub************************
The Pub/Sub topic has been set up for this example: projects/apache-beam-testing/topics/testpipeline-jenkins-0415035950-9e2eef3e
The Pub/Sub subscription has been set up for this example: projects/apache-beam-testing/subscriptions/testpipeline-jenkins-0415035950-9e2eef3e
*************************Tear Down*************************
The Pub/Sub topic has been deleted: projects/apache-beam-testing/topics/testpipeline-jenkins-0415035950-9e2eef3e
The Pub/Sub subscription has been deleted: projects/apache-beam-testing/subscriptions/testpipeline-jenkins-0415035950-9e2eef3e
***********************************************************
***********************************************************

> Task :runners:google-cloud-dataflow-java:googleCloudPlatformRunnerV2IntegrationTest

org.apache.beam.sdk.io.gcp.pubsublite.ReadWriteIT > testReadWrite FAILED
    java.lang.AssertionError at ReadWriteIT.java:264

47 tests completed, 1 failed, 3 skipped

> Task :runners:google-cloud-dataflow-java:googleCloudPlatformRunnerV2IntegrationTest FAILED

> Task :runners:google-cloud-dataflow-java:cleanUpDockerJavaImages
Untagged: us.gcr.io/apache-beam-testing/java-postcommit-it/java:20220415035729
Untagged: us.gcr.io/apache-beam-testing/java-postcommit-it/java@sha256:892e6b36fe2093adaf5dbc335da7a297aed8157532472c0a5d24ca4ce2cfd94b
Deleted: sha256:c20a3f9a5b9d58e2d36f6a7ab5cacbada3bb47937585736d836222449e0a734e
Deleted: sha256:1bedfc612d4add914e6a5da192c4d3d140f898d64793c70d1bbd7a751d877eb0
Deleted: sha256:545a21efa169287abbd027e981a5322f678d964287a87c7e9a13a5c071416a1a
Deleted: sha256:55c73854d2422ad3451826ee0f9cbf8ae54418586df00eaf8daea9a9f1afcfc2
Deleted: sha256:675e1cd6f22625d09b2549ece39295fbf55beadf64fb7722a2bbdb95e782306e
Deleted: sha256:c296c9b877cf1eae7786340c8b5d86eb2283258420e33e353d31d2c9446cf07b
Deleted: sha256:4a375abe3b753dfeb5f009a61512d576912f13a4e01857e4db865f31187274aa
Deleted: sha256:786d747792f256725f8729dcf18c7cf811008e7415e2a9729ae0b769f651a3c2
Deleted: sha256:368f61e2981ff72ab65826177f775622eaf8cc86915cfe8fe4f8b0d1cc0c4a26
Deleted: sha256:fbd693bedf7fe840cb4b6b610377229828914039412d175f044fd2014e97f35a
Deleted: sha256:a3488621c6f7abd82c0add6a9761db9f88bef7342b2921f97e6cfa8bbad6fe3b
Deleted: sha256:410dcd0dbca4d2672087f4b043d52ad4b5bb8765cb75d5de0eef9f559c4d77c0
Deleted: sha256:c6038bcc387fedb3df1312439ac23de95f903227eccb6a8feaebd96f8b355e8a
Deleted: sha256:dcc363573b7d832deac9e4782b19be31fd3051d88d0d0d66682451b9fa94d738
Deleted: sha256:09dea2b87a87018f533ec558d07c2fbbdb2712d223003aaf9f99d8a112ac3d3b
Deleted: sha256:7bf9c0396bdcdf11cebe0fa3a17679c98b9bc393986187dfbb17e0bbbe2d9496
Deleted: sha256:841314f8522dedbed92b26c33267465bdb652087d3e06257710ed001ef7c9149
Deleted: sha256:6b0b606a4b5b2ab44641ff969868987a852f66c6303396b890d0d3a056b00c33
Deleted: sha256:cb4fda385bdf198596cab03d8d5fae4afc1b7f1b40ed6de7443ba47bf18539f5
Deleted: sha256:692793372fd42424e7391397d35fa76ae7fcd95a0a4a8e03c4072edbe2a1e64c
Deleted: sha256:c748c55a8339c6b81c90de85b2913d08b03f8112b1438b064717f5d5c6201448
Deleted: sha256:300b401c538a44b4d5c75f44d4479fcc485cc909f0c5daec51d7c56e490825a5
Deleted: sha256:b1373aa0f6c3f33f743a1a7b3697ec8d944e026d28f4ad17c2070d450ce45947
Deleted: sha256:6eb7507ff6442604c54e377f7cec768032721450c9eac7f1bc84be185da1616a
Deleted: sha256:a277ca440530276b8c73b625033f28413c97eb5b47c703ec3496d27fcbba081e
Deleted: sha256:cca4d6344b2f9842e71b67d6324abfa7f6f9b15abf4b11c9e3b3609e332409ea
Deleted: sha256:4586adfa1a8a1768d0e7c56f2c051eb15c0e4ae22da442769f5d6315dfdd6808
Deleted: sha256:8d04076075e941004ad70bf9468e15957dc0f33ec15491de64dfaf8f5f97ecd1
Deleted: sha256:17dcb6be09e60d6871cd9b75690910b7093885d4c83b11f9cf0820e4f5c4e751
Deleted: sha256:03009e6c816af3c040329c2be76be4edb9a1c550715c8426b532c97b153d1f07
Deleted: sha256:586e3470c874bbe27168026830b997c55b400846252412461fa57b5fd9a27d85
Deleted: sha256:056a6aefede83094fa4af63b6e0bae68025b7cacfc87ba7710514f54ec6a480f
Deleted: sha256:f2abc9e8f205f7670fbed5c4bd5904c51306d234fd0a620e89731a407fd09147
Deleted: sha256:14ee997881cf90c875df8e58eb1d715f038c1647519845e2daa014aef1c2b6b8
Tag: [us.gcr.io/apache-beam-testing/java-postcommit-it/java:20220415035729]
- referencing digest: [us.gcr.io/apache-beam-testing/java-postcommit-it/java@sha256:892e6b36fe2093adaf5dbc335da7a297aed8157532472c0a5d24ca4ce2cfd94b]

Deleted [[us.gcr.io/apache-beam-testing/java-postcommit-it/java:20220415035729] (referencing [us.gcr.io/apache-beam-testing/java-postcommit-it/java@sha256:892e6b36fe2093adaf5dbc335da7a297aed8157532472c0a5d24ca4ce2cfd94b])].
Removing untagged image us.gcr.io/apache-beam-testing/java-postcommit-it/java@sha256:892e6b36fe2093adaf5dbc335da7a297aed8157532472c0a5d24ca4ce2cfd94b
Digests:
- us.gcr.io/apache-beam-testing/java-postcommit-it/java@sha256:892e6b36fe2093adaf5dbc335da7a297aed8157532472c0a5d24ca4ce2cfd94b
Deleted [us.gcr.io/apache-beam-testing/java-postcommit-it/java@sha256:892e6b36fe2093adaf5dbc335da7a297aed8157532472c0a5d24ca4ce2cfd94b].

FAILURE: Build failed with an exception.

* What went wrong:
Execution failed for task ':runners:google-cloud-dataflow-java:googleCloudPlatformRunnerV2IntegrationTest'.
> There were failing tests. See the report at: file://<https://ci-beam.apache.org/job/beam_PostCommit_Java_DataflowV2/ws/src/runners/google-cloud-dataflow-java/build/reports/tests/googleCloudPlatformRunnerV2IntegrationTest/index.html>

* Try:
> Run with --stacktrace option to get the stack trace.
> Run with --info or --debug option to get more log output.
> Run with --scan to get full insights.

* Get more help at https://help.gradle.org

Deprecated Gradle features were used in this build, making it incompatible with Gradle 8.0.

You can use '--warning-mode all' to show the individual deprecation warnings and determine if they come from your own scripts or plugins.

See https://docs.gradle.org/7.4/userguide/command_line_interface.html#sec:command_line_warnings

Execution optimizations have been disabled for 1 invalid unit(s) of work during this build to ensure correctness.
Please consult deprecation warnings for more details.

BUILD FAILED in 1h 22m 16s
141 actionable tasks: 94 executed, 43 from cache, 4 up-to-date

Publishing build scan...
https://gradle.com/s/hnyb5wcawzzbo

Build step 'Invoke Gradle script' changed build result to FAILURE
Build step 'Invoke Gradle script' marked build as failure

---------------------------------------------------------------------
To unsubscribe, e-mail: builds-unsubscribe@beam.apache.org
For additional commands, e-mail: builds-help@beam.apache.org


Build failed in Jenkins: beam_PostCommit_Java_DataflowV2 #1497

Posted by Apache Jenkins Server <je...@builds.apache.org>.
See <https://ci-beam.apache.org/job/beam_PostCommit_Java_DataflowV2/1497/display/redirect?page=changes>

Changes:

[Kenneth Knowles] Upgrade to Gradle 7.4

[Kenneth Knowles] Remove Python module dependency on Dataflow worker

[noreply] [BEAM-11104] Pipe Continuation to DataSource level (#17334)

[noreply] [BEAM-11105] Basic Watermark Estimation (Wall Clock Observing) (#17267)

[noreply] Respect output coder for TextIO. (#17367)

[noreply] Merge pull request #17200 from [BEAM-12164]: fix the autoscaling backlog


------------------------------------------
[...truncated 49.70 KB...]
+ GO111MODULE=off
+ go get github.com/apache/beam/sdks/java/container

> Task :sdks:java:io:google-cloud-platform:compileJava FROM-CACHE
> Task :sdks:java:io:google-cloud-platform:classes UP-TO-DATE
> Task :sdks:java:io:google-cloud-platform:jar
> Task :runners:google-cloud-dataflow-java:compileJava FROM-CACHE
> Task :runners:google-cloud-dataflow-java:classes
> Task :runners:google-cloud-dataflow-java:jar

> Task :sdks:java:container:pullLicenses
Collecting setuptools
  Using cached setuptools-62.1.0-py3-none-any.whl (1.1 MB)
Collecting wheel
  Using cached wheel-0.37.1-py2.py3-none-any.whl (35 kB)
Installing collected packages: pip, setuptools, wheel
  Attempting uninstall: pip
    Found existing installation: pip 20.0.2
    Uninstalling pip-20.0.2:
      Successfully uninstalled pip-20.0.2
  Attempting uninstall: setuptools
    Found existing installation: setuptools 44.0.0
    Uninstalling setuptools-44.0.0:
      Successfully uninstalled setuptools-44.0.0
Successfully installed pip-22.0.4 setuptools-62.1.0 wheel-0.37.1
Collecting beautifulsoup4<5.0,>=4.9.0
  Using cached beautifulsoup4-4.11.1-py3-none-any.whl (128 kB)
Collecting pyyaml<6.0.0,>=3.12
  Using cached PyYAML-5.4.1-cp38-cp38-manylinux1_x86_64.whl (662 kB)
Collecting tenacity<6.0,>=5.0.2
  Using cached tenacity-5.1.5-py2.py3-none-any.whl (34 kB)
Collecting soupsieve>1.2
  Using cached soupsieve-2.3.2.post1-py3-none-any.whl (37 kB)
Collecting six>=1.9.0
  Using cached six-1.16.0-py2.py3-none-any.whl (11 kB)
Installing collected packages: soupsieve, six, pyyaml, tenacity, beautifulsoup4
Successfully installed beautifulsoup4-4.11.1 pyyaml-5.4.1 six-1.16.0 soupsieve-2.3.2.post1 tenacity-5.1.5
Executing python <https://ci-beam.apache.org/job/beam_PostCommit_Java_DataflowV2/ws/src/sdks/java/container/license_scripts/pull_licenses_java.py> --license_index=<https://ci-beam.apache.org/job/beam_PostCommit_Java_DataflowV2/ws/src/sdks/java/container/build/reports/dependency-license/index.json>        --output_dir=<https://ci-beam.apache.org/job/beam_PostCommit_Java_DataflowV2/ws/src/sdks/java/container/build/target/java_third_party_licenses>        --dep_url_yaml=<https://ci-beam.apache.org/job/beam_PostCommit_Java_DataflowV2/ws/src/sdks/java/container/license_scripts/dep_urls_java.yaml>        --manual_license_path=<https://ci-beam.apache.org/job/beam_PostCommit_Java_DataflowV2/ws/src/sdks/java/container/license_scripts/manual_licenses>
INFO:root:Pulling license for 225 dependencies using 16 threads.
INFO:root:Replaced local file URL with file://<https://ci-beam.apache.org/job/beam_PostCommit_Java_DataflowV2/ws/src/sdks/java/container/license_scripts/manual_licenses/xz/COPYING> for xz-1.5
INFO:root:pull_licenses_java.py succeed. It took 7.707052 seconds with 16 threads.
Copying licenses from <https://ci-beam.apache.org/job/beam_PostCommit_Java_DataflowV2/ws/src/sdks/java/container/build/target/java_third_party_licenses> to <https://ci-beam.apache.org/job/beam_PostCommit_Java_DataflowV2/ws/src/sdks/java/container/build/target/third_party_licenses.>
Finished license_scripts.sh

> Task :sdks:java:container:goPrepare UP-TO-DATE
> Task :sdks:java:container:java8:copyJavaThirdPartyLicenses

> Task :sdks:java:container:goBuild
/home/jenkins/go/bin/go1.16.12 build -o ./build/target/linux_amd64/boot boot.go

> Task :sdks:java:container:java8:copySdkHarnessLauncher
Execution optimizations have been disabled for task ':sdks:java:container:java8:copySdkHarnessLauncher' to ensure correctness due to the following reasons:
  - Gradle detected a problem with the following location: '<https://ci-beam.apache.org/job/beam_PostCommit_Java_DataflowV2/ws/src/sdks/java/container/build/target'.> Reason: Task ':sdks:java:container:java8:copySdkHarnessLauncher' uses this output of task ':sdks:java:container:downloadCloudProfilerAgent' without declaring an explicit or implicit dependency. This can lead to incorrect results being produced, depending on what order the tasks are executed. Please refer to https://docs.gradle.org/7.4/userguide/validation_problems.html#implicit_dependency for more details about this problem.
  - Gradle detected a problem with the following location: '<https://ci-beam.apache.org/job/beam_PostCommit_Java_DataflowV2/ws/src/sdks/java/container/build/target'.> Reason: Task ':sdks:java:container:java8:copySdkHarnessLauncher' uses this output of task ':sdks:java:container:pullLicenses' without declaring an explicit or implicit dependency. This can lead to incorrect results being produced, depending on what order the tasks are executed. Please refer to https://docs.gradle.org/7.4/userguide/validation_problems.html#implicit_dependency for more details about this problem.

> Task :sdks:java:io:google-cloud-platform:compileTestJava
Note: Some input files use or override a deprecated API.
Note: Recompile with -Xlint:deprecation for details.
Note: Some input files use unchecked or unsafe operations.
Note: Recompile with -Xlint:unchecked for details.

> Task :sdks:java:io:google-cloud-platform:testClasses
> Task :sdks:java:io:google-cloud-platform:testJar
> Task :examples:java:compileJava
Note: Some input files use or override a deprecated API.
Note: Recompile with -Xlint:deprecation for details.
Note: Some input files use unchecked or unsafe operations.
Note: Recompile with -Xlint:unchecked for details.

> Task :examples:java:classes
> Task :examples:java:jar

> Task :examples:java:compileTestJava
Note: Some input files use or override a deprecated API.
Note: Recompile with -Xlint:deprecation for details.
Note: Some input files use unchecked or unsafe operations.
Note: Recompile with -Xlint:unchecked for details.

> Task :examples:java:testClasses
> Task :examples:java:testJar

> Task :release:go-licenses:java:dockerRun
+ go-licenses save github.com/apache/beam/sdks/java/container --save_path=/output/licenses
+ go-licenses csv github.com/apache/beam/sdks/java/container
+ tee /output/licenses/list.csv
github.com/golang/protobuf,https://github.com/golang/protobuf/blob/master/LICENSE,BSD-3-Clause
google.golang.org/protobuf,https://go.googlesource.com/protobuf/+/refs/heads/master/LICENSE,BSD-3-Clause
google.golang.org/genproto/googleapis/rpc/status,https://github.com/googleapis/go-genproto/blob/master/LICENSE,Apache-2.0
github.com/apache/beam/sdks/java/container,https://github.com/apache/beam/blob/master/LICENSE,Apache-2.0
github.com/apache/beam/sdks/go/pkg/beam,https://github.com/apache/beam/blob/master/sdks/go/README.md,Apache-2.0
google.golang.org/grpc,https://github.com/grpc/grpc-go/blob/master/LICENSE,Apache-2.0
golang.org/x/sys,https://go.googlesource.com/sys/+/refs/heads/master/LICENSE,BSD-3-Clause
golang.org/x/net,https://go.googlesource.com/net/+/refs/heads/master/LICENSE,BSD-3-Clause
golang.org/x/text,https://go.googlesource.com/text/+/refs/heads/master/LICENSE,BSD-3-Clause
+ chmod -R a+w /output/licenses

> Task :release:go-licenses:java:createLicenses
> Task :sdks:java:container:java8:copyGolangLicenses
> Task :sdks:java:container:java8:dockerPrepare
> Task :sdks:java:container:java8:docker

> Task :runners:google-cloud-dataflow-java:buildAndPushDockerJavaContainer
WARNING: `gcloud docker` will not be supported for Docker client versions above 18.03.

As an alternative, use `gcloud auth configure-docker` to configure `docker` to
use `gcloud` as a credential helper, then use `docker` as you would for non-GCR
registries, e.g. `docker pull gcr.io/project-id/my-image`. Add
`--verbosity=error` to silence this warning: `gcloud docker
--verbosity=error -- pull gcr.io/project-id/my-image`.

See: https://cloud.google.com/container-registry/docs/support/deprecation-notices#gcloud-docker

The push refers to repository [us.gcr.io/apache-beam-testing/java-postcommit-it/java]
8e226e967a50: Preparing
e1d45b6a1f89: Preparing
ece123ca9867: Preparing
f3d6d19fcd88: Preparing
786a306547f2: Preparing
def65a96b623: Preparing
66ce7f5d228b: Preparing
a0f36c3a5eaf: Preparing
60c25e8e43b6: Preparing
187574635cf7: Preparing
b0760062b19d: Preparing
dc0f7a15ce20: Preparing
f62a5f42bb82: Preparing
cb3d8cc3633e: Preparing
9cde3212910e: Preparing
7494d840ea88: Preparing
357cc1947e95: Preparing
b0dc1a441986: Preparing
7a7698da17f2: Preparing
d59769727d80: Preparing
348622fdcc61: Preparing
4ac8bc2cd0be: Preparing
b0dc1a441986: Waiting
4ac8bc2cd0be: Waiting
348622fdcc61: Waiting
7a7698da17f2: Waiting
60c25e8e43b6: Waiting
66ce7f5d228b: Waiting
def65a96b623: Waiting
187574635cf7: Waiting
dc0f7a15ce20: Waiting
f62a5f42bb82: Waiting
cb3d8cc3633e: Waiting
9cde3212910e: Waiting
7494d840ea88: Waiting
357cc1947e95: Waiting
f3d6d19fcd88: Pushed
786a306547f2: Pushed
ece123ca9867: Pushed
e1d45b6a1f89: Pushed
8e226e967a50: Pushed
66ce7f5d228b: Pushed
a0f36c3a5eaf: Pushed
187574635cf7: Pushed
def65a96b623: Pushed
60c25e8e43b6: Pushed
dc0f7a15ce20: Pushed
7494d840ea88: Layer already exists
357cc1947e95: Layer already exists
b0dc1a441986: Layer already exists
7a7698da17f2: Layer already exists
d59769727d80: Layer already exists
348622fdcc61: Layer already exists
b0760062b19d: Pushed
4ac8bc2cd0be: Layer already exists
cb3d8cc3633e: Pushed
9cde3212910e: Pushed
f62a5f42bb82: Pushed
20220414215738: digest: sha256:2021501f9c8de11af4901e736f70cdbaa7f8d29fe7191e305858f367ea4518bd size: 4935

> Task :runners:google-cloud-dataflow-java:coreSDKJavaRunnerV2IntegrationTest NO-SOURCE
> Task :runners:google-cloud-dataflow-java:examplesJavaRunnerV2IntegrationTest

***********************************************************
***********************************************************
**********************Set Up Pubsub************************
The Pub/Sub topic has been set up for this example: projects/apache-beam-testing/topics/testpipeline-jenkins-0414220004-d07f84f8
The Pub/Sub subscription has been set up for this example: projects/apache-beam-testing/subscriptions/testpipeline-jenkins-0414220004-d07f84f8
*************************Tear Down*************************
The Pub/Sub topic has been deleted: projects/apache-beam-testing/topics/testpipeline-jenkins-0414220004-d07f84f8
The Pub/Sub subscription has been deleted: projects/apache-beam-testing/subscriptions/testpipeline-jenkins-0414220004-d07f84f8
***********************************************************
***********************************************************

***********************************************************
***********************************************************
**********************Set Up Pubsub************************
The Pub/Sub topic has been set up for this example: projects/apache-beam-testing/topics/testpipeline-jenkins-0414220003-d0828ba1
The Pub/Sub subscription has been set up for this example: projects/apache-beam-testing/subscriptions/testpipeline-jenkins-0414220003-d0828ba1
*************************Tear Down*************************
The Pub/Sub topic has been deleted: projects/apache-beam-testing/topics/testpipeline-jenkins-0414220003-d0828ba1
The Pub/Sub subscription has been deleted: projects/apache-beam-testing/subscriptions/testpipeline-jenkins-0414220003-d0828ba1
***********************************************************
***********************************************************

> Task :runners:google-cloud-dataflow-java:googleCloudPlatformRunnerV2IntegrationTest

org.apache.beam.sdk.io.gcp.pubsublite.ReadWriteIT > testReadWrite FAILED
    java.lang.AssertionError at ReadWriteIT.java:264

47 tests completed, 1 failed, 3 skipped

> Task :runners:google-cloud-dataflow-java:googleCloudPlatformRunnerV2IntegrationTest FAILED

> Task :runners:google-cloud-dataflow-java:cleanUpDockerJavaImages
Untagged: us.gcr.io/apache-beam-testing/java-postcommit-it/java:20220414215738
Untagged: us.gcr.io/apache-beam-testing/java-postcommit-it/java@sha256:2021501f9c8de11af4901e736f70cdbaa7f8d29fe7191e305858f367ea4518bd
Tag: [us.gcr.io/apache-beam-testing/java-postcommit-it/java:20220414215738]
- referencing digest: [us.gcr.io/apache-beam-testing/java-postcommit-it/java@sha256:2021501f9c8de11af4901e736f70cdbaa7f8d29fe7191e305858f367ea4518bd]

Deleted [[us.gcr.io/apache-beam-testing/java-postcommit-it/java:20220414215738] (referencing [us.gcr.io/apache-beam-testing/java-postcommit-it/java@sha256:2021501f9c8de11af4901e736f70cdbaa7f8d29fe7191e305858f367ea4518bd])].
Removing untagged image us.gcr.io/apache-beam-testing/java-postcommit-it/java@sha256:2021501f9c8de11af4901e736f70cdbaa7f8d29fe7191e305858f367ea4518bd
Digests:
- us.gcr.io/apache-beam-testing/java-postcommit-it/java@sha256:2021501f9c8de11af4901e736f70cdbaa7f8d29fe7191e305858f367ea4518bd
Deleted [us.gcr.io/apache-beam-testing/java-postcommit-it/java@sha256:2021501f9c8de11af4901e736f70cdbaa7f8d29fe7191e305858f367ea4518bd].

FAILURE: Build failed with an exception.

* What went wrong:
Execution failed for task ':runners:google-cloud-dataflow-java:googleCloudPlatformRunnerV2IntegrationTest'.
> There were failing tests. See the report at: file://<https://ci-beam.apache.org/job/beam_PostCommit_Java_DataflowV2/ws/src/runners/google-cloud-dataflow-java/build/reports/tests/googleCloudPlatformRunnerV2IntegrationTest/index.html>

* Try:
> Run with --stacktrace option to get the stack trace.
> Run with --info or --debug option to get more log output.
> Run with --scan to get full insights.

* Get more help at https://help.gradle.org

Deprecated Gradle features were used in this build, making it incompatible with Gradle 8.0.

You can use '--warning-mode all' to show the individual deprecation warnings and determine if they come from your own scripts or plugins.

See https://docs.gradle.org/7.4/userguide/command_line_interface.html#sec:command_line_warnings

Execution optimizations have been disabled for 1 invalid unit(s) of work during this build to ensure correctness.
Please consult deprecation warnings for more details.

BUILD FAILED in 1h 22m 54s
141 actionable tasks: 93 executed, 44 from cache, 4 up-to-date

Publishing build scan...
https://gradle.com/s/fuzz6fx3qbprc

Build step 'Invoke Gradle script' changed build result to FAILURE
Build step 'Invoke Gradle script' marked build as failure

---------------------------------------------------------------------
To unsubscribe, e-mail: builds-unsubscribe@beam.apache.org
For additional commands, e-mail: builds-help@beam.apache.org


Build failed in Jenkins: beam_PostCommit_Java_DataflowV2 #1496

Posted by Apache Jenkins Server <je...@builds.apache.org>.
See <https://ci-beam.apache.org/job/beam_PostCommit_Java_DataflowV2/1496/display/redirect?page=changes>

Changes:

[noreply] [BEAM-13925] Dont double assign committers if author or other reviewer

[noreply] [BEAM-13739] Remove deprecated shallow clone funcs (#17362)


------------------------------------------
[...truncated 52.57 KB...]
> Task :sdks:java:io:google-cloud-platform:compileTestJava FROM-CACHE
> Task :sdks:java:io:google-cloud-platform:testClasses

> Task :sdks:java:container:pullLicenses
Copying already-fetched licenses from <https://ci-beam.apache.org/job/beam_PostCommit_Java_DataflowV2/ws/src/sdks/java/container/build/reports/dependency-license> to <https://ci-beam.apache.org/job/beam_PostCommit_Java_DataflowV2/ws/src/sdks/java/container/build/target/java_third_party_licenses>

> Task :sdks:java:io:google-cloud-platform:testJar
> Task :sdks:java:container:java8:copyDockerfileDependencies

> Task :sdks:java:container:pullLicenses
Collecting pip
  Using cached pip-22.0.4-py3-none-any.whl (2.1 MB)
Collecting setuptools
  Using cached setuptools-62.1.0-py3-none-any.whl (1.1 MB)
Collecting wheel
  Using cached wheel-0.37.1-py2.py3-none-any.whl (35 kB)
Installing collected packages: pip, setuptools, wheel
  Attempting uninstall: pip
    Found existing installation: pip 20.0.2
    Uninstalling pip-20.0.2:
      Successfully uninstalled pip-20.0.2
  Attempting uninstall: setuptools
    Found existing installation: setuptools 44.0.0
    Uninstalling setuptools-44.0.0:
      Successfully uninstalled setuptools-44.0.0
Successfully installed pip-22.0.4 setuptools-62.1.0 wheel-0.37.1
Collecting beautifulsoup4<5.0,>=4.9.0
  Using cached beautifulsoup4-4.11.1-py3-none-any.whl (128 kB)
Collecting pyyaml<6.0.0,>=3.12
  Using cached PyYAML-5.4.1-cp38-cp38-manylinux1_x86_64.whl (662 kB)
Collecting tenacity<6.0,>=5.0.2
  Using cached tenacity-5.1.5-py2.py3-none-any.whl (34 kB)
Collecting soupsieve>1.2
  Using cached soupsieve-2.3.2.post1-py3-none-any.whl (37 kB)
Collecting six>=1.9.0
  Using cached six-1.16.0-py2.py3-none-any.whl (11 kB)
Installing collected packages: soupsieve, six, pyyaml, tenacity, beautifulsoup4
Successfully installed beautifulsoup4-4.11.1 pyyaml-5.4.1 six-1.16.0 soupsieve-2.3.2.post1 tenacity-5.1.5
Executing python <https://ci-beam.apache.org/job/beam_PostCommit_Java_DataflowV2/ws/src/sdks/java/container/license_scripts/pull_licenses_java.py> --license_index=<https://ci-beam.apache.org/job/beam_PostCommit_Java_DataflowV2/ws/src/sdks/java/container/build/reports/dependency-license/index.json>        --output_dir=<https://ci-beam.apache.org/job/beam_PostCommit_Java_DataflowV2/ws/src/sdks/java/container/build/target/java_third_party_licenses>        --dep_url_yaml=<https://ci-beam.apache.org/job/beam_PostCommit_Java_DataflowV2/ws/src/sdks/java/container/license_scripts/dep_urls_java.yaml>        --manual_license_path=<https://ci-beam.apache.org/job/beam_PostCommit_Java_DataflowV2/ws/src/sdks/java/container/license_scripts/manual_licenses>
INFO:root:Pulling license for 225 dependencies using 16 threads.
INFO:root:Replaced local file URL with file://<https://ci-beam.apache.org/job/beam_PostCommit_Java_DataflowV2/ws/src/sdks/java/container/license_scripts/manual_licenses/xz/COPYING> for xz-1.5
INFO:root:pull_licenses_java.py succeed. It took 9.717561 seconds with 16 threads.
Copying licenses from <https://ci-beam.apache.org/job/beam_PostCommit_Java_DataflowV2/ws/src/sdks/java/container/build/target/java_third_party_licenses> to <https://ci-beam.apache.org/job/beam_PostCommit_Java_DataflowV2/ws/src/sdks/java/container/build/target/third_party_licenses.>
Finished license_scripts.sh

> Task :sdks:java:container:java8:copyJavaThirdPartyLicenses

> Task :release:go-licenses:java:dockerRun
+ go-licenses save github.com/apache/beam/sdks/java/container --save_path=/output/licenses
+ go-licenses csv github.com/apache/beam/sdks/java/container
+ tee /output/licenses/list.csv
github.com/apache/beam/sdks/java/container,https://github.com/apache/beam/blob/master/LICENSE,Apache-2.0
github.com/apache/beam/sdks/go/pkg/beam,https://github.com/apache/beam/blob/master/sdks/go/README.md,Apache-2.0
golang.org/x/sys,https://go.googlesource.com/sys/+/refs/heads/master/LICENSE,BSD-3-Clause
google.golang.org/protobuf,https://go.googlesource.com/protobuf/+/refs/heads/master/LICENSE,BSD-3-Clause
google.golang.org/genproto/googleapis/rpc/status,https://github.com/googleapis/go-genproto/blob/master/LICENSE,Apache-2.0
google.golang.org/grpc,https://github.com/grpc/grpc-go/blob/master/LICENSE,Apache-2.0
golang.org/x/net,https://go.googlesource.com/net/+/refs/heads/master/LICENSE,BSD-3-Clause
github.com/golang/protobuf,https://github.com/golang/protobuf/blob/master/LICENSE,BSD-3-Clause
golang.org/x/text,https://go.googlesource.com/text/+/refs/heads/master/LICENSE,BSD-3-Clause
+ chmod -R a+w /output/licenses

> Task :release:go-licenses:java:createLicenses
> Task :sdks:java:container:java8:copyGolangLicenses
> Task :sdks:java:container:java8:dockerPrepare
> Task :sdks:java:container:java8:docker

> Task :runners:google-cloud-dataflow-java:buildAndPushDockerJavaContainer
WARNING: `gcloud docker` will not be supported for Docker client versions above 18.03.

As an alternative, use `gcloud auth configure-docker` to configure `docker` to
use `gcloud` as a credential helper, then use `docker` as you would for non-GCR
registries, e.g. `docker pull gcr.io/project-id/my-image`. Add
`--verbosity=error` to silence this warning: `gcloud docker
--verbosity=error -- pull gcr.io/project-id/my-image`.

See: https://cloud.google.com/container-registry/docs/support/deprecation-notices#gcloud-docker

The push refers to repository [us.gcr.io/apache-beam-testing/java-postcommit-it/java]
57c860e0ab04: Preparing
c8869bab7450: Preparing
5197219da494: Preparing
2507592caa36: Preparing
c652c0cff3d0: Preparing
8c993a0127af: Preparing
612e21b88b8a: Preparing
f3eab56ceed5: Preparing
7995c8a6d703: Preparing
156cadf3a2ac: Preparing
03f97b1589d6: Preparing
775038a75ddc: Preparing
c36144b6d27e: Preparing
46ef570eb001: Preparing
d17ae9fda382: Preparing
7494d840ea88: Preparing
357cc1947e95: Preparing
b0dc1a441986: Preparing
7a7698da17f2: Preparing
d59769727d80: Preparing
348622fdcc61: Preparing
8c993a0127af: Waiting
4ac8bc2cd0be: Preparing
612e21b88b8a: Waiting
7995c8a6d703: Waiting
7494d840ea88: Waiting
4ac8bc2cd0be: Waiting
357cc1947e95: Waiting
c36144b6d27e: Waiting
d59769727d80: Waiting
03f97b1589d6: Waiting
b0dc1a441986: Waiting
46ef570eb001: Waiting
775038a75ddc: Waiting
d17ae9fda382: Waiting
348622fdcc61: Waiting
5197219da494: Pushed
2507592caa36: Pushed
c652c0cff3d0: Pushed
c8869bab7450: Pushed
57c860e0ab04: Pushed
f3eab56ceed5: Pushed
612e21b88b8a: Pushed
156cadf3a2ac: Pushed
8c993a0127af: Pushed
7995c8a6d703: Pushed
775038a75ddc: Pushed
7494d840ea88: Layer already exists
357cc1947e95: Layer already exists
b0dc1a441986: Layer already exists
7a7698da17f2: Layer already exists
d59769727d80: Layer already exists
348622fdcc61: Layer already exists
4ac8bc2cd0be: Layer already exists
46ef570eb001: Pushed
03f97b1589d6: Pushed
d17ae9fda382: Pushed
c36144b6d27e: Pushed
20220414155737: digest: sha256:de9a2cd5f9f3a5702425b7e380f4d304abfafb323ebd3be0040f928c6c813a5a size: 4935

> Task :runners:google-cloud-dataflow-java:coreSDKJavaRunnerV2IntegrationTest NO-SOURCE
> Task :runners:google-cloud-dataflow-java:examplesJavaRunnerV2IntegrationTest

***********************************************************
***********************************************************
**********************Set Up Pubsub************************
The Pub/Sub topic has been set up for this example: projects/apache-beam-testing/topics/testpipeline-jenkins-0414160011-6ffeff5a
The Pub/Sub subscription has been set up for this example: projects/apache-beam-testing/subscriptions/testpipeline-jenkins-0414160011-6ffeff5a
*************************Tear Down*************************
The Pub/Sub topic has been deleted: projects/apache-beam-testing/topics/testpipeline-jenkins-0414160011-6ffeff5a
The Pub/Sub subscription has been deleted: projects/apache-beam-testing/subscriptions/testpipeline-jenkins-0414160011-6ffeff5a
***********************************************************
***********************************************************

***********************************************************
***********************************************************
**********************Set Up Pubsub************************
The Pub/Sub topic has been set up for this example: projects/apache-beam-testing/topics/testpipeline-jenkins-0414160011-e39ed408
The Pub/Sub subscription has been set up for this example: projects/apache-beam-testing/subscriptions/testpipeline-jenkins-0414160011-e39ed408
*************************Tear Down*************************
The Pub/Sub topic has been deleted: projects/apache-beam-testing/topics/testpipeline-jenkins-0414160011-e39ed408
The Pub/Sub subscription has been deleted: projects/apache-beam-testing/subscriptions/testpipeline-jenkins-0414160011-e39ed408
***********************************************************
***********************************************************

> Task :runners:google-cloud-dataflow-java:googleCloudPlatformRunnerV2IntegrationTest

org.apache.beam.sdk.io.gcp.pubsublite.ReadWriteIT > testReadWrite FAILED
    java.lang.AssertionError at ReadWriteIT.java:264

47 tests completed, 1 failed, 5 skipped

> Task :runners:google-cloud-dataflow-java:googleCloudPlatformRunnerV2IntegrationTest FAILED

> Task :runners:google-cloud-dataflow-java:cleanUpDockerJavaImages
Untagged: us.gcr.io/apache-beam-testing/java-postcommit-it/java:20220414155737
Untagged: us.gcr.io/apache-beam-testing/java-postcommit-it/java@sha256:de9a2cd5f9f3a5702425b7e380f4d304abfafb323ebd3be0040f928c6c813a5a
Deleted: sha256:92f03fcddef7d8f885c280d1e9b1d4527faab05da34349ad8a1d49251cd610a8
Deleted: sha256:c3c4fada9d5d05360e9d6d92c19167f58590f8c0e097d067a861eb58ae69f901
Deleted: sha256:4304bdea27a1157a9aab885bbd42371c15a7b939869399fc57f9832a6099d74a
Deleted: sha256:da6d0ef7a8872e2091a21a0a0093bc44459a69b9f6faa1941813b0dd2ab3ccae
Deleted: sha256:3b31628ced68433879fa6b09a4bdc738527e4fd6b433d17cceba889cef666f16
Deleted: sha256:fff643c95251c3f604d167ed17e61324d57ef8c46311fdc08006473e4b7cfdd8
Deleted: sha256:85a52c5c7d1ad5344aaa0d1fc1920ba2e84e2b1940ce2ccf15b2ebc6e83d05ad
Deleted: sha256:e2d5a0fb3ddd3d76d6324bf631d406fd13836a37dbd8beb4b6b3350fa2dcd30e
Deleted: sha256:f3112f780d1219798f5faad7a54c9d95bbab4c20ebe395f045fb065a8cce9928
Deleted: sha256:4c46db73d07ddb7976eab293879f67ffab44a7f531aa40789122058c8c74eee0
Deleted: sha256:195ef404c094d6e1d3193adf06a6d57a90fc0220956913ff09643a6bbbdc99df
Deleted: sha256:1364d2a3054a393293faab6eb151e2b9acf7df1e2e432711d64620bb9741e001
Deleted: sha256:dda989f9e4244481739ba54fc6dfdf62505422e55f483000644ac07a54d79896
Deleted: sha256:6418f87087a571914d11cf9bb8f73b70811fa2cab2585cdb368ca542f7e728bb
Deleted: sha256:6b18bf073ad925f235d6c6fc195e7d197bfb283ea3b546bc51c1dc4c8fef5551
Deleted: sha256:bbfc0e46ffc521bc8f5002c6facba465dd41ab0f4bee2974bc1900d7f33c29dc
Deleted: sha256:49a78a5b052596c0e2047daea712d53c2938a45783de166c734b26968f35a51e
Deleted: sha256:09e8d21d7a15ba188a3780a10ca1fb95f4f1ff05258159ce9fcf2853cadaeb96
Deleted: sha256:7be8934523fc1d8c91511179e06aec79e51b7e7e44e1ef57197cd7bb5a611e7d
Deleted: sha256:c937cf4bf5d3888e5d0aa7734252ba9bd0d6e549463c8bcf4e3aafb093d82a4f
Deleted: sha256:01f965209994b4af30c92b051cebe26b90c70567b4264325a9febae062665269
Deleted: sha256:0f5e97b45250fa80c4b72bba2ddc331bc261afeb186de4a8d1981938a2b53f61
Deleted: sha256:05cb9b90921023ae30e0d42e798a3b86913d50c319f91bad62bf2c9c448952d0
Deleted: sha256:7f24dd4d0c7ef25a53d92a5ebbf420ff501daa537448cad0c3d90d67f64307d6
Deleted: sha256:548710dfe6f711443d4f4ea29bbc5afbebc1a27217e66f35b408c831f9557d82
Deleted: sha256:9d2e127535d332f18a368e5676609a356cff8d9a35380c76d3ee13a8a8f4f406
Deleted: sha256:a7d19955fcc94cf252d28ba3fecc5ffe5269cae1e743ce44af2b0f0bd4f4cc22
Deleted: sha256:fa0f9be89e1445a3e0df000d70adc2e97201b6a1f1a827326ceda9c8532d6cc7
Deleted: sha256:4e887f3e3019a1ffa0a1fede7fcbae044ca04883c7673a269287efa8fb29bae4
Deleted: sha256:69ffd069302b7e66c1343adb83bbc8e89310239f01ac3c7eb9d1d85c13a1883c
Deleted: sha256:e8769ce47059f8c30c8ce34bb234d85b3672bfe6b0bfd0db5e98bb9cd29d02e6
Deleted: sha256:72871b89d3d4d8718c7866de6c96be91e3d070b5fec2967da942954b9991326d
Deleted: sha256:514a7bf526fe0b029eea13534d685b11b745f71b7e29c12455fe1ea21a3fdc79
Deleted: sha256:a8ed84d4cefc1440577df7c6d60c31bb9100ba9064bc2fac06b7cce00dd06d1a
Tag: [us.gcr.io/apache-beam-testing/java-postcommit-it/java:20220414155737]
- referencing digest: [us.gcr.io/apache-beam-testing/java-postcommit-it/java@sha256:de9a2cd5f9f3a5702425b7e380f4d304abfafb323ebd3be0040f928c6c813a5a]

Deleted [[us.gcr.io/apache-beam-testing/java-postcommit-it/java:20220414155737] (referencing [us.gcr.io/apache-beam-testing/java-postcommit-it/java@sha256:de9a2cd5f9f3a5702425b7e380f4d304abfafb323ebd3be0040f928c6c813a5a])].
Removing untagged image us.gcr.io/apache-beam-testing/java-postcommit-it/java@sha256:de9a2cd5f9f3a5702425b7e380f4d304abfafb323ebd3be0040f928c6c813a5a
Digests:
- us.gcr.io/apache-beam-testing/java-postcommit-it/java@sha256:de9a2cd5f9f3a5702425b7e380f4d304abfafb323ebd3be0040f928c6c813a5a
Deleted [us.gcr.io/apache-beam-testing/java-postcommit-it/java@sha256:de9a2cd5f9f3a5702425b7e380f4d304abfafb323ebd3be0040f928c6c813a5a].

FAILURE: Build failed with an exception.

* What went wrong:
Execution failed for task ':runners:google-cloud-dataflow-java:googleCloudPlatformRunnerV2IntegrationTest'.
> There were failing tests. See the report at: file://<https://ci-beam.apache.org/job/beam_PostCommit_Java_DataflowV2/ws/src/runners/google-cloud-dataflow-java/build/reports/tests/googleCloudPlatformRunnerV2IntegrationTest/index.html>

* Try:
> Run with --stacktrace option to get the stack trace.
> Run with --info or --debug option to get more log output.
> Run with --scan to get full insights.

* Get more help at https://help.gradle.org

Deprecated Gradle features were used in this build, making it incompatible with Gradle 8.0.

You can use '--warning-mode all' to show the individual deprecation warnings and determine if they come from your own scripts or plugins.

See https://docs.gradle.org/7.3.2/userguide/command_line_interface.html#sec:command_line_warnings

Execution optimizations have been disabled for 1 invalid unit(s) of work during this build to ensure correctness.
Please consult deprecation warnings for more details.

BUILD FAILED in 1h 24m 9s
141 actionable tasks: 90 executed, 47 from cache, 4 up-to-date

Publishing build scan...
https://gradle.com/s/ufd6ofdfe4dxu

Build step 'Invoke Gradle script' changed build result to FAILURE
Build step 'Invoke Gradle script' marked build as failure

---------------------------------------------------------------------
To unsubscribe, e-mail: builds-unsubscribe@beam.apache.org
For additional commands, e-mail: builds-help@beam.apache.org


Build failed in Jenkins: beam_PostCommit_Java_DataflowV2 #1495

Posted by Apache Jenkins Server <je...@builds.apache.org>.
See <https://ci-beam.apache.org/job/beam_PostCommit_Java_DataflowV2/1495/display/redirect>

Changes:


------------------------------------------
[...truncated 53.98 KB...]

> Task :release:go-licenses:java:dockerRun
+ rm -rf '/output/*'
+ export GO111MODULE=off
+ GO111MODULE=off
+ go get github.com/apache/beam/sdks/java/container

> Task :sdks:java:container:pullLicenses
Collecting pip
  Using cached pip-22.0.4-py3-none-any.whl (2.1 MB)
Collecting setuptools
  Using cached setuptools-62.1.0-py3-none-any.whl (1.1 MB)
Collecting wheel
  Using cached wheel-0.37.1-py2.py3-none-any.whl (35 kB)
Installing collected packages: pip, setuptools, wheel
  Attempting uninstall: pip
    Found existing installation: pip 20.0.2
    Uninstalling pip-20.0.2:
      Successfully uninstalled pip-20.0.2
  Attempting uninstall: setuptools
    Found existing installation: setuptools 44.0.0
    Uninstalling setuptools-44.0.0:
      Successfully uninstalled setuptools-44.0.0
Successfully installed pip-22.0.4 setuptools-62.1.0 wheel-0.37.1
Collecting beautifulsoup4<5.0,>=4.9.0
  Using cached beautifulsoup4-4.11.1-py3-none-any.whl (128 kB)
Collecting pyyaml<6.0.0,>=3.12
  Using cached PyYAML-5.4.1-cp38-cp38-manylinux1_x86_64.whl (662 kB)
Collecting tenacity<6.0,>=5.0.2
  Using cached tenacity-5.1.5-py2.py3-none-any.whl (34 kB)
Collecting soupsieve>1.2
  Using cached soupsieve-2.3.2-py3-none-any.whl (37 kB)
Collecting six>=1.9.0
  Using cached six-1.16.0-py2.py3-none-any.whl (11 kB)
Installing collected packages: soupsieve, six, pyyaml, tenacity, beautifulsoup4
Successfully installed beautifulsoup4-4.11.1 pyyaml-5.4.1 six-1.16.0 soupsieve-2.3.2 tenacity-5.1.5
Executing python <https://ci-beam.apache.org/job/beam_PostCommit_Java_DataflowV2/ws/src/sdks/java/container/license_scripts/pull_licenses_java.py> --license_index=<https://ci-beam.apache.org/job/beam_PostCommit_Java_DataflowV2/ws/src/sdks/java/container/build/reports/dependency-license/index.json>        --output_dir=<https://ci-beam.apache.org/job/beam_PostCommit_Java_DataflowV2/ws/src/sdks/java/container/build/target/java_third_party_licenses>        --dep_url_yaml=<https://ci-beam.apache.org/job/beam_PostCommit_Java_DataflowV2/ws/src/sdks/java/container/license_scripts/dep_urls_java.yaml>        --manual_license_path=<https://ci-beam.apache.org/job/beam_PostCommit_Java_DataflowV2/ws/src/sdks/java/container/license_scripts/manual_licenses>
INFO:root:Pulling license for 225 dependencies using 16 threads.
INFO:root:Replaced local file URL with file://<https://ci-beam.apache.org/job/beam_PostCommit_Java_DataflowV2/ws/src/sdks/java/container/license_scripts/manual_licenses/xz/COPYING> for xz-1.5
INFO:root:pull_licenses_java.py succeed. It took 10.736131 seconds with 16 threads.
Copying licenses from <https://ci-beam.apache.org/job/beam_PostCommit_Java_DataflowV2/ws/src/sdks/java/container/build/target/java_third_party_licenses> to <https://ci-beam.apache.org/job/beam_PostCommit_Java_DataflowV2/ws/src/sdks/java/container/build/target/third_party_licenses.>
Finished license_scripts.sh

> Task :sdks:java:container:java8:copyJavaThirdPartyLicenses

> Task :release:go-licenses:java:dockerRun
+ go-licenses save github.com/apache/beam/sdks/java/container --save_path=/output/licenses
+ go-licenses csv github.com/apache/beam/sdks/java/container
+ tee /output/licenses/list.csv
google.golang.org/protobuf,https://go.googlesource.com/protobuf/+/refs/heads/master/LICENSE,BSD-3-Clause
google.golang.org/genproto/googleapis/rpc/status,https://github.com/googleapis/go-genproto/blob/master/LICENSE,Apache-2.0
golang.org/x/text,https://go.googlesource.com/text/+/refs/heads/master/LICENSE,BSD-3-Clause
github.com/apache/beam/sdks/java/container,https://github.com/apache/beam/blob/master/LICENSE,Apache-2.0
github.com/apache/beam/sdks/go/pkg/beam,https://github.com/apache/beam/blob/master/sdks/go/README.md,Apache-2.0
golang.org/x/sys,https://go.googlesource.com/sys/+/refs/heads/master/LICENSE,BSD-3-Clause
github.com/golang/protobuf,https://github.com/golang/protobuf/blob/master/LICENSE,BSD-3-Clause
google.golang.org/grpc,https://github.com/grpc/grpc-go/blob/master/LICENSE,Apache-2.0
golang.org/x/net,https://go.googlesource.com/net/+/refs/heads/master/LICENSE,BSD-3-Clause
+ chmod -R a+w /output/licenses

> Task :release:go-licenses:java:createLicenses
> Task :sdks:java:container:java8:copyGolangLicenses
> Task :sdks:java:container:java8:dockerPrepare
> Task :sdks:java:container:java8:docker

> Task :runners:google-cloud-dataflow-java:buildAndPushDockerJavaContainer
WARNING: `gcloud docker` will not be supported for Docker client versions above 18.03.

As an alternative, use `gcloud auth configure-docker` to configure `docker` to
use `gcloud` as a credential helper, then use `docker` as you would for non-GCR
registries, e.g. `docker pull gcr.io/project-id/my-image`. Add
`--verbosity=error` to silence this warning: `gcloud docker
--verbosity=error -- pull gcr.io/project-id/my-image`.

See: https://cloud.google.com/container-registry/docs/support/deprecation-notices#gcloud-docker

The push refers to repository [us.gcr.io/apache-beam-testing/java-postcommit-it/java]
657ae28000b8: Preparing
37637c0058ef: Preparing
34e1afed8cbe: Preparing
c125b2c7d041: Preparing
31cc8b5e83ef: Preparing
4de4de5cd1c5: Preparing
41671f3684a7: Preparing
bd33f5de79a1: Preparing
3361e2788546: Preparing
0fa448e500c6: Preparing
ea9c24905f32: Preparing
6693583ec3e4: Preparing
a995179a265b: Preparing
300f46fed0e9: Preparing
ee80b3c7acd5: Preparing
7494d840ea88: Preparing
357cc1947e95: Preparing
b0dc1a441986: Preparing
7a7698da17f2: Preparing
d59769727d80: Preparing
348622fdcc61: Preparing
0fa448e500c6: Waiting
4ac8bc2cd0be: Preparing
ea9c24905f32: Waiting
300f46fed0e9: Waiting
6693583ec3e4: Waiting
4de4de5cd1c5: Waiting
7a7698da17f2: Waiting
ee80b3c7acd5: Waiting
a995179a265b: Waiting
41671f3684a7: Waiting
d59769727d80: Waiting
bd33f5de79a1: Waiting
7494d840ea88: Waiting
3361e2788546: Waiting
348622fdcc61: Waiting
357cc1947e95: Waiting
b0dc1a441986: Waiting
31cc8b5e83ef: Pushed
37637c0058ef: Pushed
c125b2c7d041: Pushed
34e1afed8cbe: Pushed
657ae28000b8: Pushed
41671f3684a7: Pushed
bd33f5de79a1: Pushed
0fa448e500c6: Pushed
3361e2788546: Pushed
6693583ec3e4: Pushed
4de4de5cd1c5: Pushed
7494d840ea88: Layer already exists
357cc1947e95: Layer already exists
b0dc1a441986: Layer already exists
7a7698da17f2: Layer already exists
d59769727d80: Layer already exists
ea9c24905f32: Pushed
4ac8bc2cd0be: Layer already exists
348622fdcc61: Layer already exists
300f46fed0e9: Pushed
ee80b3c7acd5: Pushed
a995179a265b: Pushed
20220414095737: digest: sha256:f945c1b6d6f0105c6e401b0e039195bf0214063003313483e3321df7a734cf89 size: 4935

> Task :runners:google-cloud-dataflow-java:coreSDKJavaRunnerV2IntegrationTest NO-SOURCE
> Task :runners:google-cloud-dataflow-java:examplesJavaRunnerV2IntegrationTest

***********************************************************
***********************************************************
**********************Set Up Pubsub************************
The Pub/Sub topic has been set up for this example: projects/apache-beam-testing/topics/testpipeline-jenkins-0414095953-a07bd9b7
The Pub/Sub subscription has been set up for this example: projects/apache-beam-testing/subscriptions/testpipeline-jenkins-0414095953-a07bd9b7
*************************Tear Down*************************
The Pub/Sub topic has been deleted: projects/apache-beam-testing/topics/testpipeline-jenkins-0414095953-a07bd9b7
The Pub/Sub subscription has been deleted: projects/apache-beam-testing/subscriptions/testpipeline-jenkins-0414095953-a07bd9b7
***********************************************************
***********************************************************

***********************************************************
***********************************************************
**********************Set Up Pubsub************************
The Pub/Sub topic has been set up for this example: projects/apache-beam-testing/topics/testpipeline-jenkins-0414095952-f8be77d
The Pub/Sub subscription has been set up for this example: projects/apache-beam-testing/subscriptions/testpipeline-jenkins-0414095952-f8be77d
*************************Tear Down*************************
The Pub/Sub topic has been deleted: projects/apache-beam-testing/topics/testpipeline-jenkins-0414095952-f8be77d
The Pub/Sub subscription has been deleted: projects/apache-beam-testing/subscriptions/testpipeline-jenkins-0414095952-f8be77d
***********************************************************
***********************************************************

> Task :runners:google-cloud-dataflow-java:googleCloudPlatformRunnerV2IntegrationTest

org.apache.beam.sdk.io.gcp.pubsublite.ReadWriteIT > testReadWrite FAILED
    java.lang.AssertionError at ReadWriteIT.java:264

47 tests completed, 1 failed, 5 skipped

> Task :runners:google-cloud-dataflow-java:googleCloudPlatformRunnerV2IntegrationTest FAILED

> Task :runners:google-cloud-dataflow-java:cleanUpDockerJavaImages
Untagged: us.gcr.io/apache-beam-testing/java-postcommit-it/java:20220414095737
Untagged: us.gcr.io/apache-beam-testing/java-postcommit-it/java@sha256:f945c1b6d6f0105c6e401b0e039195bf0214063003313483e3321df7a734cf89
Deleted: sha256:8a53b980a9291ac6d6b2da7160708796ec4af425697b4886bc615022e1ba5bb0
Deleted: sha256:04f6574cb14270e662c1016d20725d94270e32d7f8838734f6ba7fda9bdc5858
Deleted: sha256:6e880c005b776acef190064b916550ecb21b3a1d893aad64a0ad21790514e82f
Deleted: sha256:62e7eb5dc551bc29a6c344219fec8ff01292838fcc5950c234b5a304a89d1648
Deleted: sha256:bdd766fc34f27326221e7836dedeeaf454def174a8a4364940db8920dbae97bb
Deleted: sha256:9bd80b7bfe1b0486e2d64110998f71bd98d03b33f2c1c41d88f8f8a3f0e8faa9
Deleted: sha256:39c125773653072a29234f0a92c451617c5b292e9a75bb3608a24aa7edfe97d9
Deleted: sha256:96a7fc66791879229f8796b91f549bd32bf6c83b4012270dfdd5279e5792bc51
Deleted: sha256:fc6092eec2e2826c965121181a1b4e6cb14295fbaad59bca5278288c68fffadf
Deleted: sha256:4b40e4046988e23c8a21ceffdf9ab6a283888edbb0944ca47e2525826020e7ed
Deleted: sha256:dc6caee81070d3be60c73a173a4f3c1c2d7800face72132b6c412d5fc2bd6fee
Deleted: sha256:047ef7866487f9e9586e3e76a6b3f6511c8c274f9ac46eba7edbdf883c6324f9
Deleted: sha256:44988e5dc8c9e1ee03f274d299ac48efb93b6b566ce28fbdb164ad18f1262ccd
Deleted: sha256:6e796c9add600342666def5689d31784eaf7731595f945dba2fa0118f40f2c89
Deleted: sha256:dacc61fa700b98c9739ca3ffda587db87efa215d7c90919206cb1f2227d077c1
Deleted: sha256:f8fd7dca2bbdea1888e9137a58491ffa56aac6f486d924543b0dc6d80cd3e7de
Deleted: sha256:8b16cf58f7266afe2461e84437b55e432f7d85371c4f923069179ee2d7ee5900
Deleted: sha256:2c7e6bb75382cc18c4cd21d8517d648c8266e00d1bae613c71ba8293a34687a9
Deleted: sha256:da870d46e558fa6aea7a59c956426fb0cf963bbb009225a3f20b62fa8f37a714
Deleted: sha256:644e668c90d6baa80debb8dd3eb870026789b9b2bef853480f50c85cfeb5d7b1
Deleted: sha256:4693d6cab82eb573eb64dc17376149c24e424a187595abfa8e008cd0ccb26de9
Deleted: sha256:14afd1ce8b222a7e8b18a2806af3f52baab1d52271040cdb2ff88d487654c00d
Deleted: sha256:b2a778e3f32e2463c6e2e3a09d5098651fffcb1f4540e61304b7f003c01f1d83
Deleted: sha256:9e4295efe54603f8b8ca4dcf498c83c12e248f8b293208643fbb36787d2ca6a4
Deleted: sha256:215c94f491ed3fccba43f2486f74eb233eff287a1daccea7adfc60ce85d6eb04
Deleted: sha256:e98178c6dbc33d672b7c6fef6508b3c6a7cf70cc55d0bd485c244ca7c73b096b
Deleted: sha256:1551e72358ab44ffec194a1249aeaf0b33755dfba72c322064f5f5d9da5becbc
Deleted: sha256:729b5a7c43e5cbdd511706b25cae694277fbd27bcd0c24814d6eb8b853919f8d
Deleted: sha256:0be7440ecc0fe1217452053621f49a0db047072c73692385cb526d729544887a
Deleted: sha256:a6193eeca37bf745871b064feb38b3bb4236b18c3beca719abda59699b309a99
Deleted: sha256:0f4a968f875051d7fce032c5d0bb970ea93ca84dc1643a8621fc7cf3e99b45de
Deleted: sha256:5a99d602008e08ae24244e0ec93c1752a903413e0da7bb215d8f095db371af19
Deleted: sha256:2bdf6086490b036b3f4f6f028444fb4b4ce135b06afb104cd2e8dee80e4fc6fc
Deleted: sha256:4ef0b9854f385bb83a1271ef3e8c0d1d71fcbfb51e52ba5115a07aaf9ebcb83f
Tag: [us.gcr.io/apache-beam-testing/java-postcommit-it/java:20220414095737]
- referencing digest: [us.gcr.io/apache-beam-testing/java-postcommit-it/java@sha256:f945c1b6d6f0105c6e401b0e039195bf0214063003313483e3321df7a734cf89]

Deleted [[us.gcr.io/apache-beam-testing/java-postcommit-it/java:20220414095737] (referencing [us.gcr.io/apache-beam-testing/java-postcommit-it/java@sha256:f945c1b6d6f0105c6e401b0e039195bf0214063003313483e3321df7a734cf89])].
Removing untagged image us.gcr.io/apache-beam-testing/java-postcommit-it/java@sha256:f945c1b6d6f0105c6e401b0e039195bf0214063003313483e3321df7a734cf89
Digests:
- us.gcr.io/apache-beam-testing/java-postcommit-it/java@sha256:f945c1b6d6f0105c6e401b0e039195bf0214063003313483e3321df7a734cf89
Deleted [us.gcr.io/apache-beam-testing/java-postcommit-it/java@sha256:f945c1b6d6f0105c6e401b0e039195bf0214063003313483e3321df7a734cf89].

FAILURE: Build failed with an exception.

* What went wrong:
Execution failed for task ':runners:google-cloud-dataflow-java:googleCloudPlatformRunnerV2IntegrationTest'.
> There were failing tests. See the report at: file://<https://ci-beam.apache.org/job/beam_PostCommit_Java_DataflowV2/ws/src/runners/google-cloud-dataflow-java/build/reports/tests/googleCloudPlatformRunnerV2IntegrationTest/index.html>

* Try:
> Run with --stacktrace option to get the stack trace.
> Run with --info or --debug option to get more log output.
> Run with --scan to get full insights.

* Get more help at https://help.gradle.org

Deprecated Gradle features were used in this build, making it incompatible with Gradle 8.0.

You can use '--warning-mode all' to show the individual deprecation warnings and determine if they come from your own scripts or plugins.

See https://docs.gradle.org/7.3.2/userguide/command_line_interface.html#sec:command_line_warnings

Execution optimizations have been disabled for 1 invalid unit(s) of work during this build to ensure correctness.
Please consult deprecation warnings for more details.

BUILD FAILED in 1h 22m 15s
141 actionable tasks: 90 executed, 47 from cache, 4 up-to-date

Publishing build scan...
https://gradle.com/s/fsmdxpm5w2tpa

Build step 'Invoke Gradle script' changed build result to FAILURE
Build step 'Invoke Gradle script' marked build as failure

---------------------------------------------------------------------
To unsubscribe, e-mail: builds-unsubscribe@beam.apache.org
For additional commands, e-mail: builds-help@beam.apache.org


Build failed in Jenkins: beam_PostCommit_Java_DataflowV2 #1494

Posted by Apache Jenkins Server <je...@builds.apache.org>.
See <https://ci-beam.apache.org/job/beam_PostCommit_Java_DataflowV2/1494/display/redirect>

Changes:


------------------------------------------
[...truncated 43.97 KB...]
> Task :sdks:java:expansion-service:jar
> Task :sdks:java:extensions:google-cloud-platform-core:testJar
> Task :sdks:java:extensions:ml:compileJava FROM-CACHE
> Task :sdks:java:extensions:ml:classes UP-TO-DATE
> Task :sdks:java:io:kafka:compileJava FROM-CACHE
> Task :sdks:java:io:kafka:classes UP-TO-DATE
> Task :runners:direct-java:compileJava FROM-CACHE
> Task :runners:direct-java:classes UP-TO-DATE
> Task :runners:core-java:compileTestJava FROM-CACHE
> Task :runners:core-java:testClasses UP-TO-DATE
> Task :sdks:java:extensions:ml:jar
> Task :sdks:java:io:kafka:jar
> Task :runners:core-java:testJar
> Task :runners:direct-java:shadowJar FROM-CACHE
> Task :runners:direct-java:compileTestJava FROM-CACHE
> Task :runners:direct-java:testClasses UP-TO-DATE
> Task :sdks:java:io:google-cloud-platform:compileJava FROM-CACHE
> Task :sdks:java:io:google-cloud-platform:classes UP-TO-DATE
> Task :sdks:java:container:generateLicenseReport
> Task :runners:direct-java:shadowTestJar FROM-CACHE
> Task :sdks:java:extensions:protobuf:extractIncludeTestProto
> Task :sdks:java:extensions:protobuf:generateTestProto FROM-CACHE
> Task :sdks:java:extensions:protobuf:compileTestJava FROM-CACHE
> Task :sdks:java:extensions:protobuf:testClasses
> Task :sdks:java:io:google-cloud-platform:jar
> Task :sdks:java:extensions:protobuf:testJar
> Task :runners:google-cloud-dataflow-java:compileJava FROM-CACHE
> Task :runners:google-cloud-dataflow-java:classes
> Task :examples:java:compileJava FROM-CACHE
> Task :examples:java:classes UP-TO-DATE
> Task :runners:google-cloud-dataflow-java:jar
> Task :examples:java:jar
> Task :sdks:java:harness:shadowJar FROM-CACHE
> Task :examples:java:compileTestJava FROM-CACHE
> Task :examples:java:testClasses
> Task :examples:java:testJar
> Task :sdks:java:io:google-cloud-platform:compileTestJava FROM-CACHE
> Task :sdks:java:io:google-cloud-platform:testClasses
> Task :sdks:java:io:google-cloud-platform:testJar
> Task :sdks:java:container:java8:copyDockerfileDependencies

> Task :sdks:java:container:pullLicenses
Copying already-fetched licenses from <https://ci-beam.apache.org/job/beam_PostCommit_Java_DataflowV2/ws/src/sdks/java/container/build/reports/dependency-license> to <https://ci-beam.apache.org/job/beam_PostCommit_Java_DataflowV2/ws/src/sdks/java/container/build/target/java_third_party_licenses>
Collecting pip
  Using cached pip-22.0.4-py3-none-any.whl (2.1 MB)
Collecting setuptools
  Using cached setuptools-62.1.0-py3-none-any.whl (1.1 MB)
Collecting wheel
  Using cached wheel-0.37.1-py2.py3-none-any.whl (35 kB)
Installing collected packages: pip, setuptools, wheel
  Attempting uninstall: pip
    Found existing installation: pip 20.0.2
    Uninstalling pip-20.0.2:
      Successfully uninstalled pip-20.0.2
  Attempting uninstall: setuptools
    Found existing installation: setuptools 44.0.0
    Uninstalling setuptools-44.0.0:
      Successfully uninstalled setuptools-44.0.0
Successfully installed pip-22.0.4 setuptools-62.1.0 wheel-0.37.1
Collecting beautifulsoup4<5.0,>=4.9.0
  Using cached beautifulsoup4-4.11.1-py3-none-any.whl (128 kB)
Collecting pyyaml<6.0.0,>=3.12
  Using cached PyYAML-5.4.1-cp38-cp38-manylinux1_x86_64.whl (662 kB)
Collecting tenacity<6.0,>=5.0.2
  Using cached tenacity-5.1.5-py2.py3-none-any.whl (34 kB)
Collecting soupsieve>1.2
  Using cached soupsieve-2.3.2-py3-none-any.whl (37 kB)
Collecting six>=1.9.0
  Using cached six-1.16.0-py2.py3-none-any.whl (11 kB)
Installing collected packages: soupsieve, six, pyyaml, tenacity, beautifulsoup4
Successfully installed beautifulsoup4-4.11.1 pyyaml-5.4.1 six-1.16.0 soupsieve-2.3.2 tenacity-5.1.5
Executing python <https://ci-beam.apache.org/job/beam_PostCommit_Java_DataflowV2/ws/src/sdks/java/container/license_scripts/pull_licenses_java.py> --license_index=<https://ci-beam.apache.org/job/beam_PostCommit_Java_DataflowV2/ws/src/sdks/java/container/build/reports/dependency-license/index.json>        --output_dir=<https://ci-beam.apache.org/job/beam_PostCommit_Java_DataflowV2/ws/src/sdks/java/container/build/target/java_third_party_licenses>        --dep_url_yaml=<https://ci-beam.apache.org/job/beam_PostCommit_Java_DataflowV2/ws/src/sdks/java/container/license_scripts/dep_urls_java.yaml>        --manual_license_path=<https://ci-beam.apache.org/job/beam_PostCommit_Java_DataflowV2/ws/src/sdks/java/container/license_scripts/manual_licenses>
INFO:root:Pulling license for 225 dependencies using 16 threads.
INFO:root:Replaced local file URL with file://<https://ci-beam.apache.org/job/beam_PostCommit_Java_DataflowV2/ws/src/sdks/java/container/license_scripts/manual_licenses/xz/COPYING> for xz-1.5
INFO:root:pull_licenses_java.py succeed. It took 11.352967 seconds with 16 threads.
Copying licenses from <https://ci-beam.apache.org/job/beam_PostCommit_Java_DataflowV2/ws/src/sdks/java/container/build/target/java_third_party_licenses> to <https://ci-beam.apache.org/job/beam_PostCommit_Java_DataflowV2/ws/src/sdks/java/container/build/target/third_party_licenses.>
Finished license_scripts.sh

> Task :sdks:java:container:java8:copyJavaThirdPartyLicenses

> Task :release:go-licenses:java:dockerRun
+ go-licenses save github.com/apache/beam/sdks/java/container --save_path=/output/licenses
+ go-licenses csv github.com/apache/beam/sdks/java/container
+ tee /output/licenses/list.csv
golang.org/x/net,https://go.googlesource.com/net/+/refs/heads/master/LICENSE,BSD-3-Clause
github.com/golang/protobuf,https://github.com/golang/protobuf/blob/master/LICENSE,BSD-3-Clause
golang.org/x/text,https://go.googlesource.com/text/+/refs/heads/master/LICENSE,BSD-3-Clause
github.com/apache/beam/sdks/java/container,https://github.com/apache/beam/blob/master/LICENSE,Apache-2.0
github.com/apache/beam/sdks/go/pkg/beam,https://github.com/apache/beam/blob/master/sdks/go/README.md,Apache-2.0
google.golang.org/grpc,https://github.com/grpc/grpc-go/blob/master/LICENSE,Apache-2.0
golang.org/x/sys,https://go.googlesource.com/sys/+/refs/heads/master/LICENSE,BSD-3-Clause
google.golang.org/protobuf,https://go.googlesource.com/protobuf/+/refs/heads/master/LICENSE,BSD-3-Clause
google.golang.org/genproto/googleapis/rpc/status,https://github.com/googleapis/go-genproto/blob/master/LICENSE,Apache-2.0
+ chmod -R a+w /output/licenses

> Task :release:go-licenses:java:createLicenses
> Task :sdks:java:container:java8:copyGolangLicenses
> Task :sdks:java:container:java8:dockerPrepare
> Task :sdks:java:container:java8:docker

> Task :runners:google-cloud-dataflow-java:buildAndPushDockerJavaContainer
WARNING: `gcloud docker` will not be supported for Docker client versions above 18.03.

As an alternative, use `gcloud auth configure-docker` to configure `docker` to
use `gcloud` as a credential helper, then use `docker` as you would for non-GCR
registries, e.g. `docker pull gcr.io/project-id/my-image`. Add
`--verbosity=error` to silence this warning: `gcloud docker
--verbosity=error -- pull gcr.io/project-id/my-image`.

See: https://cloud.google.com/container-registry/docs/support/deprecation-notices#gcloud-docker

The push refers to repository [us.gcr.io/apache-beam-testing/java-postcommit-it/java]
5aa8d3e89b35: Preparing
ee4820de7188: Preparing
6e7ef4ad0eef: Preparing
ad45bf4bfbe7: Preparing
eeabafe563d4: Preparing
ac05068eeb4a: Preparing
33c2cb737016: Preparing
794dd24bce85: Preparing
1670e30fb070: Preparing
08ff0a84689b: Preparing
55a9d60c9f01: Preparing
dda0bcc3fa8a: Preparing
e416ca0ea252: Preparing
545cf6d03c4a: Preparing
be9309f6782b: Preparing
7494d840ea88: Preparing
357cc1947e95: Preparing
b0dc1a441986: Preparing
7a7698da17f2: Preparing
d59769727d80: Preparing
348622fdcc61: Preparing
4ac8bc2cd0be: Preparing
ac05068eeb4a: Waiting
be9309f6782b: Waiting
33c2cb737016: Waiting
7494d840ea88: Waiting
794dd24bce85: Waiting
357cc1947e95: Waiting
1670e30fb070: Waiting
08ff0a84689b: Waiting
b0dc1a441986: Waiting
55a9d60c9f01: Waiting
7a7698da17f2: Waiting
dda0bcc3fa8a: Waiting
545cf6d03c4a: Waiting
348622fdcc61: Waiting
e416ca0ea252: Waiting
ee4820de7188: Pushed
eeabafe563d4: Pushed
6e7ef4ad0eef: Pushed
ad45bf4bfbe7: Pushed
5aa8d3e89b35: Pushed
794dd24bce85: Pushed
33c2cb737016: Pushed
08ff0a84689b: Pushed
ac05068eeb4a: Pushed
1670e30fb070: Pushed
dda0bcc3fa8a: Pushed
55a9d60c9f01: Pushed
7494d840ea88: Layer already exists
357cc1947e95: Layer already exists
b0dc1a441986: Layer already exists
7a7698da17f2: Layer already exists
d59769727d80: Layer already exists
348622fdcc61: Layer already exists
4ac8bc2cd0be: Layer already exists
545cf6d03c4a: Pushed
be9309f6782b: Pushed
e416ca0ea252: Pushed
20220414035735: digest: sha256:9b8deecee146597e33f5a92b99f1c01668cc3ff97eec1bbae41b8a4590bcdd69 size: 4935

> Task :runners:google-cloud-dataflow-java:coreSDKJavaRunnerV2IntegrationTest NO-SOURCE
> Task :runners:google-cloud-dataflow-java:examplesJavaRunnerV2IntegrationTest

***********************************************************
***********************************************************
**********************Set Up Pubsub************************
The Pub/Sub topic has been set up for this example: projects/apache-beam-testing/topics/testpipeline-jenkins-0414035936-656f98f6
The Pub/Sub subscription has been set up for this example: projects/apache-beam-testing/subscriptions/testpipeline-jenkins-0414035936-656f98f6
*************************Tear Down*************************
The Pub/Sub topic has been deleted: projects/apache-beam-testing/topics/testpipeline-jenkins-0414035936-656f98f6
The Pub/Sub subscription has been deleted: projects/apache-beam-testing/subscriptions/testpipeline-jenkins-0414035936-656f98f6
***********************************************************
***********************************************************

***********************************************************
***********************************************************
**********************Set Up Pubsub************************
The Pub/Sub topic has been set up for this example: projects/apache-beam-testing/topics/testpipeline-jenkins-0414035936-808261d0
The Pub/Sub subscription has been set up for this example: projects/apache-beam-testing/subscriptions/testpipeline-jenkins-0414035936-808261d0
*************************Tear Down*************************
The Pub/Sub topic has been deleted: projects/apache-beam-testing/topics/testpipeline-jenkins-0414035936-808261d0
The Pub/Sub subscription has been deleted: projects/apache-beam-testing/subscriptions/testpipeline-jenkins-0414035936-808261d0
***********************************************************
***********************************************************

> Task :runners:google-cloud-dataflow-java:googleCloudPlatformRunnerV2IntegrationTest

org.apache.beam.sdk.io.gcp.pubsublite.ReadWriteIT > testReadWrite FAILED
    java.lang.AssertionError at ReadWriteIT.java:264

47 tests completed, 1 failed, 5 skipped

> Task :runners:google-cloud-dataflow-java:googleCloudPlatformRunnerV2IntegrationTest FAILED

> Task :runners:google-cloud-dataflow-java:cleanUpDockerJavaImages
Untagged: us.gcr.io/apache-beam-testing/java-postcommit-it/java:20220414035735
Untagged: us.gcr.io/apache-beam-testing/java-postcommit-it/java@sha256:9b8deecee146597e33f5a92b99f1c01668cc3ff97eec1bbae41b8a4590bcdd69
Tag: [us.gcr.io/apache-beam-testing/java-postcommit-it/java:20220414035735]
- referencing digest: [us.gcr.io/apache-beam-testing/java-postcommit-it/java@sha256:9b8deecee146597e33f5a92b99f1c01668cc3ff97eec1bbae41b8a4590bcdd69]

Deleted [[us.gcr.io/apache-beam-testing/java-postcommit-it/java:20220414035735] (referencing [us.gcr.io/apache-beam-testing/java-postcommit-it/java@sha256:9b8deecee146597e33f5a92b99f1c01668cc3ff97eec1bbae41b8a4590bcdd69])].
Removing untagged image us.gcr.io/apache-beam-testing/java-postcommit-it/java@sha256:9b8deecee146597e33f5a92b99f1c01668cc3ff97eec1bbae41b8a4590bcdd69
Digests:
- us.gcr.io/apache-beam-testing/java-postcommit-it/java@sha256:9b8deecee146597e33f5a92b99f1c01668cc3ff97eec1bbae41b8a4590bcdd69
Deleted [us.gcr.io/apache-beam-testing/java-postcommit-it/java@sha256:9b8deecee146597e33f5a92b99f1c01668cc3ff97eec1bbae41b8a4590bcdd69].

FAILURE: Build failed with an exception.

* What went wrong:
Execution failed for task ':runners:google-cloud-dataflow-java:googleCloudPlatformRunnerV2IntegrationTest'.
> There were failing tests. See the report at: file://<https://ci-beam.apache.org/job/beam_PostCommit_Java_DataflowV2/ws/src/runners/google-cloud-dataflow-java/build/reports/tests/googleCloudPlatformRunnerV2IntegrationTest/index.html>

* Try:
> Run with --stacktrace option to get the stack trace.
> Run with --info or --debug option to get more log output.
> Run with --scan to get full insights.

* Get more help at https://help.gradle.org

Deprecated Gradle features were used in this build, making it incompatible with Gradle 8.0.

You can use '--warning-mode all' to show the individual deprecation warnings and determine if they come from your own scripts or plugins.

See https://docs.gradle.org/7.3.2/userguide/command_line_interface.html#sec:command_line_warnings

Execution optimizations have been disabled for 1 invalid unit(s) of work during this build to ensure correctness.
Please consult deprecation warnings for more details.

BUILD FAILED in 1h 25m 27s
141 actionable tasks: 90 executed, 47 from cache, 4 up-to-date

Publishing build scan...
https://gradle.com/s/iv5akiotza664

Build step 'Invoke Gradle script' changed build result to FAILURE
Build step 'Invoke Gradle script' marked build as failure

---------------------------------------------------------------------
To unsubscribe, e-mail: builds-unsubscribe@beam.apache.org
For additional commands, e-mail: builds-help@beam.apache.org


Build failed in Jenkins: beam_PostCommit_Java_DataflowV2 #1493

Posted by Apache Jenkins Server <je...@builds.apache.org>.
See <https://ci-beam.apache.org/job/beam_PostCommit_Java_DataflowV2/1493/display/redirect?page=changes>

Changes:

[relax] handle changing schemas in Storage API sink

[noreply] Fix a couple style issues (#17361)

[noreply] [BEAM-14287] Clean up staticcheck warnings in graph/coder (#17337)

[noreply] Improvements to dataflow job service for non-Python jobs. (#17338)

[noreply] Bump minimist (#17290)

[noreply] Bump ansi-regex (#17291)

[noreply] Bump nanoid (#17292)

[noreply] Bump lodash (#17293)

[noreply] Bump url-parse (#17294)

[noreply] Bump moment (#17328)

[noreply] Merge pull request #15549 from [BEAM-11997] Changed RedisIO


------------------------------------------
[...truncated 53.94 KB...]

> Task :sdks:java:container:pullLicenses
Collecting pip
  Using cached pip-22.0.4-py3-none-any.whl (2.1 MB)
Collecting setuptools
  Using cached setuptools-62.1.0-py3-none-any.whl (1.1 MB)
Collecting wheel
  Using cached wheel-0.37.1-py2.py3-none-any.whl (35 kB)
Installing collected packages: pip, setuptools, wheel
  Attempting uninstall: pip
    Found existing installation: pip 20.0.2
    Uninstalling pip-20.0.2:
      Successfully uninstalled pip-20.0.2
  Attempting uninstall: setuptools
    Found existing installation: setuptools 44.0.0
    Uninstalling setuptools-44.0.0:
      Successfully uninstalled setuptools-44.0.0
Successfully installed pip-22.0.4 setuptools-62.1.0 wheel-0.37.1
Collecting beautifulsoup4<5.0,>=4.9.0
  Using cached beautifulsoup4-4.11.1-py3-none-any.whl (128 kB)
Collecting pyyaml<6.0.0,>=3.12
  Using cached PyYAML-5.4.1-cp38-cp38-manylinux1_x86_64.whl (662 kB)
Collecting tenacity<6.0,>=5.0.2
  Using cached tenacity-5.1.5-py2.py3-none-any.whl (34 kB)
Collecting soupsieve>1.2
  Using cached soupsieve-2.3.2-py3-none-any.whl (37 kB)
Collecting six>=1.9.0
  Using cached six-1.16.0-py2.py3-none-any.whl (11 kB)
Installing collected packages: soupsieve, six, pyyaml, tenacity, beautifulsoup4
Successfully installed beautifulsoup4-4.11.1 pyyaml-5.4.1 six-1.16.0 soupsieve-2.3.2 tenacity-5.1.5
Executing python <https://ci-beam.apache.org/job/beam_PostCommit_Java_DataflowV2/ws/src/sdks/java/container/license_scripts/pull_licenses_java.py> --license_index=<https://ci-beam.apache.org/job/beam_PostCommit_Java_DataflowV2/ws/src/sdks/java/container/build/reports/dependency-license/index.json>        --output_dir=<https://ci-beam.apache.org/job/beam_PostCommit_Java_DataflowV2/ws/src/sdks/java/container/build/target/java_third_party_licenses>        --dep_url_yaml=<https://ci-beam.apache.org/job/beam_PostCommit_Java_DataflowV2/ws/src/sdks/java/container/license_scripts/dep_urls_java.yaml>        --manual_license_path=<https://ci-beam.apache.org/job/beam_PostCommit_Java_DataflowV2/ws/src/sdks/java/container/license_scripts/manual_licenses>
INFO:root:Pulling license for 225 dependencies using 16 threads.
INFO:root:Replaced local file URL with file://<https://ci-beam.apache.org/job/beam_PostCommit_Java_DataflowV2/ws/src/sdks/java/container/license_scripts/manual_licenses/xz/COPYING> for xz-1.5
INFO:root:pull_licenses_java.py succeed. It took 9.753808 seconds with 16 threads.
Copying licenses from <https://ci-beam.apache.org/job/beam_PostCommit_Java_DataflowV2/ws/src/sdks/java/container/build/target/java_third_party_licenses> to <https://ci-beam.apache.org/job/beam_PostCommit_Java_DataflowV2/ws/src/sdks/java/container/build/target/third_party_licenses.>
Finished license_scripts.sh

> Task :release:go-licenses:java:dockerRun
+ rm -rf '/output/*'
+ export GO111MODULE=off
+ GO111MODULE=off
+ go get github.com/apache/beam/sdks/java/container

> Task :sdks:java:container:java8:copyJavaThirdPartyLicenses

> Task :release:go-licenses:java:dockerRun
+ go-licenses save github.com/apache/beam/sdks/java/container --save_path=/output/licenses
+ go-licenses csv github.com/apache/beam/sdks/java/container
+ tee /output/licenses/list.csv
google.golang.org/genproto/googleapis/rpc/status,https://github.com/googleapis/go-genproto/blob/master/LICENSE,Apache-2.0
github.com/apache/beam/sdks/go/pkg/beam,https://github.com/apache/beam/blob/master/sdks/go/README.md,Apache-2.0
golang.org/x/sys,https://go.googlesource.com/sys/+/refs/heads/master/LICENSE,BSD-3-Clause
google.golang.org/protobuf,https://go.googlesource.com/protobuf/+/refs/heads/master/LICENSE,BSD-3-Clause
github.com/golang/protobuf,https://github.com/golang/protobuf/blob/master/LICENSE,BSD-3-Clause
golang.org/x/text,https://go.googlesource.com/text/+/refs/heads/master/LICENSE,BSD-3-Clause
github.com/apache/beam/sdks/java/container,https://github.com/apache/beam/blob/master/LICENSE,Apache-2.0
google.golang.org/grpc,https://github.com/grpc/grpc-go/blob/master/LICENSE,Apache-2.0
golang.org/x/net,https://go.googlesource.com/net/+/refs/heads/master/LICENSE,BSD-3-Clause
+ chmod -R a+w /output/licenses

> Task :release:go-licenses:java:createLicenses
> Task :sdks:java:container:java8:copyGolangLicenses
> Task :sdks:java:container:java8:dockerPrepare
> Task :sdks:java:container:java8:docker

> Task :runners:google-cloud-dataflow-java:buildAndPushDockerJavaContainer
WARNING: `gcloud docker` will not be supported for Docker client versions above 18.03.

As an alternative, use `gcloud auth configure-docker` to configure `docker` to
use `gcloud` as a credential helper, then use `docker` as you would for non-GCR
registries, e.g. `docker pull gcr.io/project-id/my-image`. Add
`--verbosity=error` to silence this warning: `gcloud docker
--verbosity=error -- pull gcr.io/project-id/my-image`.

See: https://cloud.google.com/container-registry/docs/support/deprecation-notices#gcloud-docker

The push refers to repository [us.gcr.io/apache-beam-testing/java-postcommit-it/java]
4ddae97ecc99: Preparing
949571ae82ba: Preparing
761f8a6402bb: Preparing
56b18362baf2: Preparing
15f6669223df: Preparing
4cd9e19192fe: Preparing
7284ffea221a: Preparing
499d9900ce5c: Preparing
42d2c58d1e39: Preparing
d9c7b754391d: Preparing
4f72a1db62fc: Preparing
44448c5c9ad5: Preparing
cc6cba01ab83: Preparing
f3eb450e629a: Preparing
d3e48ddec666: Preparing
7494d840ea88: Preparing
357cc1947e95: Preparing
b0dc1a441986: Preparing
7a7698da17f2: Preparing
d59769727d80: Preparing
348622fdcc61: Preparing
4ac8bc2cd0be: Preparing
d9c7b754391d: Waiting
d3e48ddec666: Waiting
4f72a1db62fc: Waiting
7494d840ea88: Waiting
357cc1947e95: Waiting
44448c5c9ad5: Waiting
b0dc1a441986: Waiting
cc6cba01ab83: Waiting
7a7698da17f2: Waiting
f3eb450e629a: Waiting
d59769727d80: Waiting
7284ffea221a: Waiting
348622fdcc61: Waiting
499d9900ce5c: Waiting
42d2c58d1e39: Waiting
4cd9e19192fe: Waiting
949571ae82ba: Pushed
761f8a6402bb: Pushed
15f6669223df: Pushed
56b18362baf2: Pushed
499d9900ce5c: Pushed
4ddae97ecc99: Pushed
4cd9e19192fe: Pushed
7284ffea221a: Pushed
42d2c58d1e39: Pushed
d9c7b754391d: Pushed
44448c5c9ad5: Pushed
7494d840ea88: Layer already exists
357cc1947e95: Layer already exists
b0dc1a441986: Layer already exists
7a7698da17f2: Layer already exists
4f72a1db62fc: Pushed
d59769727d80: Layer already exists
348622fdcc61: Layer already exists
4ac8bc2cd0be: Layer already exists
f3eb450e629a: Pushed
d3e48ddec666: Pushed
cc6cba01ab83: Pushed
20220413215735: digest: sha256:5b259411a57f2db53769c2c7ef84c5bf75fc149fc06cf7a48157c1c142fa0530 size: 4935

> Task :runners:google-cloud-dataflow-java:coreSDKJavaRunnerV2IntegrationTest NO-SOURCE
> Task :runners:google-cloud-dataflow-java:examplesJavaRunnerV2IntegrationTest

***********************************************************
***********************************************************
**********************Set Up Pubsub************************
The Pub/Sub topic has been set up for this example: projects/apache-beam-testing/topics/testpipeline-jenkins-0413220006-77b0b999
The Pub/Sub subscription has been set up for this example: projects/apache-beam-testing/subscriptions/testpipeline-jenkins-0413220006-77b0b999
*************************Tear Down*************************
The Pub/Sub topic has been deleted: projects/apache-beam-testing/topics/testpipeline-jenkins-0413220006-77b0b999
The Pub/Sub subscription has been deleted: projects/apache-beam-testing/subscriptions/testpipeline-jenkins-0413220006-77b0b999
***********************************************************
***********************************************************

***********************************************************
***********************************************************
**********************Set Up Pubsub************************
The Pub/Sub topic has been set up for this example: projects/apache-beam-testing/topics/testpipeline-jenkins-0413220005-d26cee36
The Pub/Sub subscription has been set up for this example: projects/apache-beam-testing/subscriptions/testpipeline-jenkins-0413220005-d26cee36
*************************Tear Down*************************
The Pub/Sub topic has been deleted: projects/apache-beam-testing/topics/testpipeline-jenkins-0413220005-d26cee36
The Pub/Sub subscription has been deleted: projects/apache-beam-testing/subscriptions/testpipeline-jenkins-0413220005-d26cee36
***********************************************************
***********************************************************

> Task :runners:google-cloud-dataflow-java:googleCloudPlatformRunnerV2IntegrationTest

org.apache.beam.sdk.io.gcp.pubsublite.ReadWriteIT > testReadWrite FAILED
    java.lang.AssertionError at ReadWriteIT.java:264

47 tests completed, 1 failed, 5 skipped

> Task :runners:google-cloud-dataflow-java:googleCloudPlatformRunnerV2IntegrationTest FAILED

> Task :runners:google-cloud-dataflow-java:cleanUpDockerJavaImages
Untagged: us.gcr.io/apache-beam-testing/java-postcommit-it/java:20220413215735
Untagged: us.gcr.io/apache-beam-testing/java-postcommit-it/java@sha256:5b259411a57f2db53769c2c7ef84c5bf75fc149fc06cf7a48157c1c142fa0530
Deleted: sha256:e3a9d0da42eb26f30d1a6fc4e8f72f7718f77ae005a70d1d980d608926bb16a7
Deleted: sha256:2b35504eb9fc28c34f55621c5e5b73e706d15dd174bfd90668d8c4e715dd951a
Deleted: sha256:676c1bb1d5c20b783486680a17ff1c75e8f74be0d5ed5d7de8d00fb46399a97b
Deleted: sha256:786515cfbeded182912e4a2bb109bfb4d0889429ef3182941ce5b840cff9e8e1
Deleted: sha256:6bc33ba40cca814784d7ff1ce2ebfd5f1bbe9aacba023ad63341e94969d2b24e
Deleted: sha256:8ce3cbba222d02e8b2f168a9fa207501bca7520b1754db5ec0cb58d4bd28a216
Deleted: sha256:8e153116ced58f7a93723e8aaec552e286a8b3410b641417764b55080b98b215
Deleted: sha256:3345ef2958acea9721fab7b0131f30eb7507072c904f3cc46b733195dda79411
Deleted: sha256:6e276528509d230bf13d4915b9250eb06215fb44eeb4dc2634eefb03f04f90ad
Deleted: sha256:3758c73e8bd878b1fcc70ad784abd01f6e102316cf4ce7d9d7c81114d8880c65
Deleted: sha256:f8528783ca5a8f4f087e964cb4ecef554c14edd47e8bd8340adccd44436addb3
Deleted: sha256:be19cf27964782332e35fd77ab7538407624c0075a4bab14cd353d1323d5d9b1
Deleted: sha256:8ee9b8f01e065d59df2160110554615d3d529c2f482c1bf524f8b7f56b1becb9
Deleted: sha256:262d7fcfe34008d3d4031fc5ef3896f839f033dac57b7eb6c995d665316a4115
Deleted: sha256:1a8b1f1933777065b67e46088108eda30934d940085c58cf477db3551e1464f0
Deleted: sha256:674159f50b07004fe213d3849aca3ecb647f45c9e3e04162afbe0d7be63b2a1e
Deleted: sha256:da874439d88ba3c29ede3ac26c9df66913aa429911f374f29de75f4e25a45128
Deleted: sha256:e2999884fe326e4615393b8439bc57e80e434f05cb0c4e9f4bfe8d61afd66fdf
Deleted: sha256:7e5f1e3de591390756ef2ea8d3258da1f8b7d59b8b3b720ea21ae141966f6d33
Deleted: sha256:6aeff34c7a995b32f2020d82b9ac0e34fb35e4f8ef08d067d4d932873647d761
Deleted: sha256:bea2cccb5b284551351e0fbb18788a758e0c6d14b8019f72aaf48ca89e9a0704
Deleted: sha256:919d7dd420beaaa24ad163ad09433b3cb0d3e5e996719f49520d97cbad4c310d
Deleted: sha256:0f492d11eb96259882e277714077766c782ee44012992331393f0d7f07d620b2
Deleted: sha256:7e46a9d99a84e035b10bec3e112570ca90628984cf566e0b09f68cdf99157857
Deleted: sha256:705610720138a83a35bf776817406ab91d08e136456cf499bc96f4de0c0d9f28
Deleted: sha256:78c31b4835ec17228b48d59eb036db58abf5b1649a262e88048dbbd78e7b9e3c
Deleted: sha256:a3caa6a99688c36a353881f2e2febfeee8500d94c4894cd3262a19bf68edd4b5
Deleted: sha256:3edaa1d0c9922ddfcc7783213cfc3261c7b003bbb302d79fb1a8045301491fc1
Deleted: sha256:e449f3a6098b2e29b1912dd75b7b98c8e95cce2c5c87cc01d558a90bc3308341
Deleted: sha256:b5bf38913f8427238e1dfcb3adf1cf074a4b485a95f53d57c83f466e58ae29c1
Deleted: sha256:38c7ee4a839357596d48a6c67357366873a829f953bed522f702ed6d2a96aeb4
Deleted: sha256:fecc2714ff65c94df3c5c129712cbd63182f3315f4e0565d03471ab3601a9287
Deleted: sha256:1873f7ac6d79a8827ed0bc0b01f195bbd4a45ed75bba0cf48bca109bdca23fef
Deleted: sha256:45ff8a16ab65a1544a8e11636c9efe8936ae43f9539d38b34898433b9a3040d6
Tag: [us.gcr.io/apache-beam-testing/java-postcommit-it/java:20220413215735]
- referencing digest: [us.gcr.io/apache-beam-testing/java-postcommit-it/java@sha256:5b259411a57f2db53769c2c7ef84c5bf75fc149fc06cf7a48157c1c142fa0530]

Deleted [[us.gcr.io/apache-beam-testing/java-postcommit-it/java:20220413215735] (referencing [us.gcr.io/apache-beam-testing/java-postcommit-it/java@sha256:5b259411a57f2db53769c2c7ef84c5bf75fc149fc06cf7a48157c1c142fa0530])].
Removing untagged image us.gcr.io/apache-beam-testing/java-postcommit-it/java@sha256:5b259411a57f2db53769c2c7ef84c5bf75fc149fc06cf7a48157c1c142fa0530
Digests:
- us.gcr.io/apache-beam-testing/java-postcommit-it/java@sha256:5b259411a57f2db53769c2c7ef84c5bf75fc149fc06cf7a48157c1c142fa0530
Deleted [us.gcr.io/apache-beam-testing/java-postcommit-it/java@sha256:5b259411a57f2db53769c2c7ef84c5bf75fc149fc06cf7a48157c1c142fa0530].

FAILURE: Build failed with an exception.

* What went wrong:
Execution failed for task ':runners:google-cloud-dataflow-java:googleCloudPlatformRunnerV2IntegrationTest'.
> There were failing tests. See the report at: file://<https://ci-beam.apache.org/job/beam_PostCommit_Java_DataflowV2/ws/src/runners/google-cloud-dataflow-java/build/reports/tests/googleCloudPlatformRunnerV2IntegrationTest/index.html>

* Try:
> Run with --stacktrace option to get the stack trace.
> Run with --info or --debug option to get more log output.
> Run with --scan to get full insights.

* Get more help at https://help.gradle.org

Deprecated Gradle features were used in this build, making it incompatible with Gradle 8.0.

You can use '--warning-mode all' to show the individual deprecation warnings and determine if they come from your own scripts or plugins.

See https://docs.gradle.org/7.3.2/userguide/command_line_interface.html#sec:command_line_warnings

Execution optimizations have been disabled for 1 invalid unit(s) of work during this build to ensure correctness.
Please consult deprecation warnings for more details.

BUILD FAILED in 1h 23m 42s
141 actionable tasks: 90 executed, 47 from cache, 4 up-to-date

Publishing build scan...
https://gradle.com/s/eqjarjatscvau

Build step 'Invoke Gradle script' changed build result to FAILURE
Build step 'Invoke Gradle script' marked build as failure

---------------------------------------------------------------------
To unsubscribe, e-mail: builds-unsubscribe@beam.apache.org
For additional commands, e-mail: builds-help@beam.apache.org


Build failed in Jenkins: beam_PostCommit_Java_DataflowV2 #1492

Posted by Apache Jenkins Server <je...@builds.apache.org>.
See <https://ci-beam.apache.org/job/beam_PostCommit_Java_DataflowV2/1492/display/redirect>

Changes:


------------------------------------------
[...truncated 50.05 KB...]
> Task :sdks:java:extensions:protobuf:testJar
> Task :examples:java:compileTestJava FROM-CACHE
> Task :examples:java:testClasses
> Task :examples:java:testJar
> Task :sdks:java:harness:shadowJar FROM-CACHE
> Task :sdks:java:io:google-cloud-platform:compileTestJava FROM-CACHE
> Task :sdks:java:io:google-cloud-platform:testClasses
> Task :sdks:java:container:java8:copyDockerfileDependencies

> Task :release:go-licenses:java:docker
Sending build context to Docker daemon   5.12kB
Step 1/6 : FROM golang:1.16-bullseye
 ---> 972d8c0bc0fc
Step 2/6 : RUN go get github.com/google/go-licenses@v1.0.0
 ---> Using cache
 ---> 7301a3cd50f2
Step 3/6 : COPY get-licenses.sh /opt/apache/beam/
 ---> Using cache
 ---> c753d3947f4b
Step 4/6 : ARG sdk_location
 ---> Using cache
 ---> 9357d65219a6
Step 5/6 : ENV sdk_location=$sdk_location
 ---> Using cache
 ---> 22c22b4ca22d
Step 6/6 : ENTRYPOINT /opt/apache/beam/get-licenses.sh
 ---> Using cache
 ---> c311176f433b
Successfully built c311176f433b
Successfully tagged golicenses-java:latest

> Task :sdks:java:io:google-cloud-platform:testJar
> Task :sdks:java:container:generateLicenseReport

> Task :sdks:java:container:pullLicenses
Copying already-fetched licenses from <https://ci-beam.apache.org/job/beam_PostCommit_Java_DataflowV2/ws/src/sdks/java/container/build/reports/dependency-license> to <https://ci-beam.apache.org/job/beam_PostCommit_Java_DataflowV2/ws/src/sdks/java/container/build/target/java_third_party_licenses>
Collecting pip
  Using cached pip-22.0.4-py3-none-any.whl (2.1 MB)
Collecting setuptools
  Using cached setuptools-62.1.0-py3-none-any.whl (1.1 MB)
Collecting wheel
  Using cached wheel-0.37.1-py2.py3-none-any.whl (35 kB)
Installing collected packages: pip, setuptools, wheel
  Attempting uninstall: pip
    Found existing installation: pip 20.0.2
    Uninstalling pip-20.0.2:
      Successfully uninstalled pip-20.0.2
  Attempting uninstall: setuptools
    Found existing installation: setuptools 44.0.0
    Uninstalling setuptools-44.0.0:
      Successfully uninstalled setuptools-44.0.0
Successfully installed pip-22.0.4 setuptools-62.1.0 wheel-0.37.1
Collecting beautifulsoup4<5.0,>=4.9.0
  Using cached beautifulsoup4-4.11.1-py3-none-any.whl (128 kB)
Collecting pyyaml<6.0.0,>=3.12
  Using cached PyYAML-5.4.1-cp38-cp38-manylinux1_x86_64.whl (662 kB)
Collecting tenacity<6.0,>=5.0.2
  Using cached tenacity-5.1.5-py2.py3-none-any.whl (34 kB)
Collecting soupsieve>1.2
  Using cached soupsieve-2.3.2-py3-none-any.whl (37 kB)
Collecting six>=1.9.0
  Using cached six-1.16.0-py2.py3-none-any.whl (11 kB)
Installing collected packages: soupsieve, six, pyyaml, tenacity, beautifulsoup4
Successfully installed beautifulsoup4-4.11.1 pyyaml-5.4.1 six-1.16.0 soupsieve-2.3.2 tenacity-5.1.5
Executing python <https://ci-beam.apache.org/job/beam_PostCommit_Java_DataflowV2/ws/src/sdks/java/container/license_scripts/pull_licenses_java.py> --license_index=<https://ci-beam.apache.org/job/beam_PostCommit_Java_DataflowV2/ws/src/sdks/java/container/build/reports/dependency-license/index.json>        --output_dir=<https://ci-beam.apache.org/job/beam_PostCommit_Java_DataflowV2/ws/src/sdks/java/container/build/target/java_third_party_licenses>        --dep_url_yaml=<https://ci-beam.apache.org/job/beam_PostCommit_Java_DataflowV2/ws/src/sdks/java/container/license_scripts/dep_urls_java.yaml>        --manual_license_path=<https://ci-beam.apache.org/job/beam_PostCommit_Java_DataflowV2/ws/src/sdks/java/container/license_scripts/manual_licenses>
INFO:root:Pulling license for 225 dependencies using 16 threads.
INFO:root:Replaced local file URL with file://<https://ci-beam.apache.org/job/beam_PostCommit_Java_DataflowV2/ws/src/sdks/java/container/license_scripts/manual_licenses/xz/COPYING> for xz-1.5
INFO:root:pull_licenses_java.py succeed. It took 8.927803 seconds with 16 threads.
Copying licenses from <https://ci-beam.apache.org/job/beam_PostCommit_Java_DataflowV2/ws/src/sdks/java/container/build/target/java_third_party_licenses> to <https://ci-beam.apache.org/job/beam_PostCommit_Java_DataflowV2/ws/src/sdks/java/container/build/target/third_party_licenses.>
Finished license_scripts.sh

> Task :release:go-licenses:java:dockerRun
+ rm -rf '/output/*'
+ export GO111MODULE=off
+ GO111MODULE=off
+ go get github.com/apache/beam/sdks/java/container

> Task :sdks:java:container:java8:copyJavaThirdPartyLicenses

> Task :release:go-licenses:java:dockerRun
+ go-licenses save github.com/apache/beam/sdks/java/container --save_path=/output/licenses
+ go-licenses csv github.com/apache/beam/sdks/java/container
+ tee /output/licenses/list.csv
github.com/apache/beam/sdks/go/pkg/beam,https://github.com/apache/beam/blob/master/sdks/go/README.md,Apache-2.0
google.golang.org/grpc,https://github.com/grpc/grpc-go/blob/master/LICENSE,Apache-2.0
golang.org/x/net,https://go.googlesource.com/net/+/refs/heads/master/LICENSE,BSD-3-Clause
github.com/golang/protobuf,https://github.com/golang/protobuf/blob/master/LICENSE,BSD-3-Clause
github.com/apache/beam/sdks/java/container,https://github.com/apache/beam/blob/master/LICENSE,Apache-2.0
golang.org/x/sys,https://go.googlesource.com/sys/+/refs/heads/master/LICENSE,BSD-3-Clause
google.golang.org/protobuf,https://go.googlesource.com/protobuf/+/refs/heads/master/LICENSE,BSD-3-Clause
google.golang.org/genproto/googleapis/rpc/status,https://github.com/googleapis/go-genproto/blob/master/LICENSE,Apache-2.0
golang.org/x/text,https://go.googlesource.com/text/+/refs/heads/master/LICENSE,BSD-3-Clause
+ chmod -R a+w /output/licenses

> Task :release:go-licenses:java:createLicenses
> Task :sdks:java:container:java8:copyGolangLicenses
> Task :sdks:java:container:java8:dockerPrepare
> Task :sdks:java:container:java8:docker

> Task :runners:google-cloud-dataflow-java:buildAndPushDockerJavaContainer
WARNING: `gcloud docker` will not be supported for Docker client versions above 18.03.

As an alternative, use `gcloud auth configure-docker` to configure `docker` to
use `gcloud` as a credential helper, then use `docker` as you would for non-GCR
registries, e.g. `docker pull gcr.io/project-id/my-image`. Add
`--verbosity=error` to silence this warning: `gcloud docker
--verbosity=error -- pull gcr.io/project-id/my-image`.

See: https://cloud.google.com/container-registry/docs/support/deprecation-notices#gcloud-docker

The push refers to repository [us.gcr.io/apache-beam-testing/java-postcommit-it/java]
6772192813a3: Preparing
0558aa3247da: Preparing
6bfc8142899b: Preparing
1210fb79a57b: Preparing
7de64b8a548d: Preparing
0b1002138e78: Preparing
d03122d510f1: Preparing
db28062e14df: Preparing
6f7e3e80daff: Preparing
a3d52f6f3443: Preparing
3fd956204d46: Preparing
d182e4e36a4e: Preparing
b9a8b9832b32: Preparing
8af7a500d2a7: Preparing
085ab3182302: Preparing
7494d840ea88: Preparing
357cc1947e95: Preparing
b0dc1a441986: Preparing
7a7698da17f2: Preparing
d59769727d80: Preparing
348622fdcc61: Preparing
4ac8bc2cd0be: Preparing
085ab3182302: Waiting
0b1002138e78: Waiting
7494d840ea88: Waiting
d59769727d80: Waiting
348622fdcc61: Waiting
357cc1947e95: Waiting
3fd956204d46: Waiting
d03122d510f1: Waiting
4ac8bc2cd0be: Waiting
b0dc1a441986: Waiting
6f7e3e80daff: Waiting
d182e4e36a4e: Waiting
7a7698da17f2: Waiting
db28062e14df: Waiting
8af7a500d2a7: Waiting
a3d52f6f3443: Waiting
7de64b8a548d: Pushed
0558aa3247da: Pushed
1210fb79a57b: Pushed
6bfc8142899b: Pushed
6772192813a3: Pushed
db28062e14df: Pushed
d03122d510f1: Pushed
a3d52f6f3443: Pushed
d182e4e36a4e: Pushed
0b1002138e78: Pushed
6f7e3e80daff: Pushed
7494d840ea88: Layer already exists
357cc1947e95: Layer already exists
b0dc1a441986: Layer already exists
7a7698da17f2: Layer already exists
3fd956204d46: Pushed
d59769727d80: Layer already exists
348622fdcc61: Layer already exists
4ac8bc2cd0be: Layer already exists
8af7a500d2a7: Pushed
085ab3182302: Pushed
b9a8b9832b32: Pushed
20220413155733: digest: sha256:64964eb639a14a26d872ddfba6a20d40e045b3130d8a837950979fe8e2ae6715 size: 4935

> Task :runners:google-cloud-dataflow-java:coreSDKJavaRunnerV2IntegrationTest NO-SOURCE
> Task :runners:google-cloud-dataflow-java:examplesJavaRunnerV2IntegrationTest

***********************************************************
***********************************************************
**********************Set Up Pubsub************************
The Pub/Sub topic has been set up for this example: projects/apache-beam-testing/topics/testpipeline-jenkins-0413155929-68dbe237
The Pub/Sub subscription has been set up for this example: projects/apache-beam-testing/subscriptions/testpipeline-jenkins-0413155929-68dbe237
*************************Tear Down*************************
The Pub/Sub topic has been deleted: projects/apache-beam-testing/topics/testpipeline-jenkins-0413155929-68dbe237
The Pub/Sub subscription has been deleted: projects/apache-beam-testing/subscriptions/testpipeline-jenkins-0413155929-68dbe237
***********************************************************
***********************************************************

***********************************************************
***********************************************************
**********************Set Up Pubsub************************
The Pub/Sub topic has been set up for this example: projects/apache-beam-testing/topics/testpipeline-jenkins-0413155929-6618e9
The Pub/Sub subscription has been set up for this example: projects/apache-beam-testing/subscriptions/testpipeline-jenkins-0413155929-6618e9
*************************Tear Down*************************
The Pub/Sub topic has been deleted: projects/apache-beam-testing/topics/testpipeline-jenkins-0413155929-6618e9
The Pub/Sub subscription has been deleted: projects/apache-beam-testing/subscriptions/testpipeline-jenkins-0413155929-6618e9
***********************************************************
***********************************************************

> Task :runners:google-cloud-dataflow-java:googleCloudPlatformRunnerV2IntegrationTest

org.apache.beam.sdk.io.gcp.pubsublite.ReadWriteIT > testReadWrite FAILED
    java.lang.AssertionError at ReadWriteIT.java:264

47 tests completed, 1 failed, 5 skipped

> Task :runners:google-cloud-dataflow-java:googleCloudPlatformRunnerV2IntegrationTest FAILED

> Task :runners:google-cloud-dataflow-java:cleanUpDockerJavaImages
Untagged: us.gcr.io/apache-beam-testing/java-postcommit-it/java:20220413155733
Untagged: us.gcr.io/apache-beam-testing/java-postcommit-it/java@sha256:64964eb639a14a26d872ddfba6a20d40e045b3130d8a837950979fe8e2ae6715
Tag: [us.gcr.io/apache-beam-testing/java-postcommit-it/java:20220413155733]
- referencing digest: [us.gcr.io/apache-beam-testing/java-postcommit-it/java@sha256:64964eb639a14a26d872ddfba6a20d40e045b3130d8a837950979fe8e2ae6715]

Deleted [[us.gcr.io/apache-beam-testing/java-postcommit-it/java:20220413155733] (referencing [us.gcr.io/apache-beam-testing/java-postcommit-it/java@sha256:64964eb639a14a26d872ddfba6a20d40e045b3130d8a837950979fe8e2ae6715])].
Removing untagged image us.gcr.io/apache-beam-testing/java-postcommit-it/java@sha256:64964eb639a14a26d872ddfba6a20d40e045b3130d8a837950979fe8e2ae6715
Digests:
- us.gcr.io/apache-beam-testing/java-postcommit-it/java@sha256:64964eb639a14a26d872ddfba6a20d40e045b3130d8a837950979fe8e2ae6715
Deleted [us.gcr.io/apache-beam-testing/java-postcommit-it/java@sha256:64964eb639a14a26d872ddfba6a20d40e045b3130d8a837950979fe8e2ae6715].

FAILURE: Build failed with an exception.

* What went wrong:
Execution failed for task ':runners:google-cloud-dataflow-java:googleCloudPlatformRunnerV2IntegrationTest'.
> There were failing tests. See the report at: file://<https://ci-beam.apache.org/job/beam_PostCommit_Java_DataflowV2/ws/src/runners/google-cloud-dataflow-java/build/reports/tests/googleCloudPlatformRunnerV2IntegrationTest/index.html>

* Try:
> Run with --stacktrace option to get the stack trace.
> Run with --info or --debug option to get more log output.
> Run with --scan to get full insights.

* Get more help at https://help.gradle.org

Deprecated Gradle features were used in this build, making it incompatible with Gradle 8.0.

You can use '--warning-mode all' to show the individual deprecation warnings and determine if they come from your own scripts or plugins.

See https://docs.gradle.org/7.3.2/userguide/command_line_interface.html#sec:command_line_warnings

Execution optimizations have been disabled for 1 invalid unit(s) of work during this build to ensure correctness.
Please consult deprecation warnings for more details.

BUILD FAILED in 1h 25m 9s
141 actionable tasks: 90 executed, 47 from cache, 4 up-to-date

Publishing build scan...
https://gradle.com/s/lwnewqqjlajys

Build step 'Invoke Gradle script' changed build result to FAILURE
Build step 'Invoke Gradle script' marked build as failure

---------------------------------------------------------------------
To unsubscribe, e-mail: builds-unsubscribe@beam.apache.org
For additional commands, e-mail: builds-help@beam.apache.org