You are viewing a plain text version of this content. The canonical link for it is here.
Posted to dev@zookeeper.apache.org by Apache Jenkins Server <je...@builds.apache.org> on 2017/02/18 20:02:02 UTC
ZooKeeper-trunk-openjdk7 - Build # 1371 - Failure
See https://builds.apache.org/job/ZooKeeper-trunk-openjdk7/1371/
###################################################################################
########################## LAST 60 LINES OF THE CONSOLE ###########################
[...truncated 471293 lines...]
[junit] java.net.ConnectException: Connection refused
[junit] at sun.nio.ch.SocketChannelImpl.checkConnect(Native Method)
[junit] at sun.nio.ch.SocketChannelImpl.finishConnect(SocketChannelImpl.java:739)
[junit] at org.apache.zookeeper.ClientCnxnSocketNIO.doTransport(ClientCnxnSocketNIO.java:357)
[junit] at org.apache.zookeeper.ClientCnxn$SendThread.run(ClientCnxn.java:1214)
[junit] 2017-02-18 20:01:57,122 [myid:] - INFO [SessionTracker:SessionTrackerImpl@158] - SessionTrackerImpl exited loop!
[junit] 2017-02-18 20:01:57,463 [myid:] - INFO [ProcessThread(sid:0 cport:22240)::PrepRequestProcessor@617] - Processed session termination for sessionid: 0x1027dc4b48b0000
[junit] 2017-02-18 20:01:57,464 [myid:] - INFO [SyncThread:0:MBeanRegistry@128] - Unregister MBean [org.apache.ZooKeeperService:name0=StandaloneServer_port22240,name1=Connections,name2=127.0.0.1,name3=0x1027dc4b48b0000]
[junit] 2017-02-18 20:01:57,464 [myid:] - INFO [main-EventThread:ClientCnxn$EventThread@513] - EventThread shut down for session: 0x1027dc4b48b0000
[junit] 2017-02-18 20:01:57,464 [myid:] - INFO [main:ZooKeeper@1324] - Session: 0x1027dc4b48b0000 closed
[junit] 2017-02-18 20:01:57,464 [myid:] - INFO [main:JUnit4ZKTestRunner$LoggedInvokeMethod@82] - Memory used 201514
[junit] 2017-02-18 20:01:57,464 [myid:] - INFO [main:JUnit4ZKTestRunner$LoggedInvokeMethod@87] - Number of threads 2428
[junit] 2017-02-18 20:01:57,465 [myid:] - INFO [main:JUnit4ZKTestRunner$LoggedInvokeMethod@102] - FINISHED TEST METHOD testWatcherAutoResetWithLocal
[junit] 2017-02-18 20:01:57,465 [myid:] - INFO [main:ClientBase@558] - tearDown starting
[junit] 2017-02-18 20:01:57,465 [myid:] - INFO [main:ClientBase@528] - STOPPING server
[junit] 2017-02-18 20:01:57,465 [myid:] - INFO [main:NettyServerCnxnFactory@464] - shutdown called 0.0.0.0/0.0.0.0:22240
[junit] 2017-02-18 20:01:57,469 [myid:] - INFO [main:ZooKeeperServer@542] - shutting down
[junit] 2017-02-18 20:01:57,469 [myid:] - ERROR [main:ZooKeeperServer@506] - ZKShutdownHandler is not registered, so ZooKeeper server won't take any action on ERROR or SHUTDOWN server state changes
[junit] 2017-02-18 20:01:57,469 [myid:] - INFO [main:SessionTrackerImpl@232] - Shutting down
[junit] 2017-02-18 20:01:57,470 [myid:] - INFO [main:PrepRequestProcessor@1008] - Shutting down
[junit] 2017-02-18 20:01:57,470 [myid:] - INFO [main:SyncRequestProcessor@191] - Shutting down
[junit] 2017-02-18 20:01:57,470 [myid:] - INFO [SyncThread:0:SyncRequestProcessor@169] - SyncRequestProcessor exited!
[junit] 2017-02-18 20:01:57,470 [myid:] - INFO [ProcessThread(sid:0 cport:22240)::PrepRequestProcessor@157] - PrepRequestProcessor exited loop!
[junit] 2017-02-18 20:01:57,470 [myid:] - INFO [main:FinalRequestProcessor@481] - shutdown of request processor complete
[junit] 2017-02-18 20:01:57,470 [myid:] - INFO [main:MBeanRegistry@128] - Unregister MBean [org.apache.ZooKeeperService:name0=StandaloneServer_port22240,name1=InMemoryDataTree]
[junit] 2017-02-18 20:01:57,471 [myid:] - INFO [main:MBeanRegistry@128] - Unregister MBean [org.apache.ZooKeeperService:name0=StandaloneServer_port22240]
[junit] 2017-02-18 20:01:57,471 [myid:] - INFO [main:FourLetterWordMain@85] - connecting to 127.0.0.1 22240
[junit] 2017-02-18 20:01:57,471 [myid:] - INFO [main:JMXEnv@146] - ensureOnly:[]
[junit] 2017-02-18 20:01:57,481 [myid:] - INFO [main:ClientBase@583] - fdcount after test is: 7140 at start it was 7136
[junit] 2017-02-18 20:01:57,481 [myid:] - INFO [main:ClientBase@585] - sleeping for 20 secs
[junit] 2017-02-18 20:01:57,481 [myid:] - INFO [main:ZKTestCase$1@65] - SUCCEEDED testWatcherAutoResetWithLocal
[junit] 2017-02-18 20:01:57,481 [myid:] - INFO [main:ZKTestCase$1@60] - FINISHED testWatcherAutoResetWithLocal
[junit] Tests run: 103, Failures: 0, Errors: 0, Skipped: 0, Time elapsed: 464.057 sec, Thread: 5, Class: org.apache.zookeeper.test.NioNettySuiteTest
[junit] 2017-02-18 20:01:57,593 [myid:127.0.0.1:22117] - INFO [main-SendThread(127.0.0.1:22117):ClientCnxn$SendThread@1113] - Opening socket connection to server 127.0.0.1/127.0.0.1:22117. Will not attempt to authenticate using SASL (unknown error)
[junit] 2017-02-18 20:01:57,593 [myid:127.0.0.1:22117] - WARN [main-SendThread(127.0.0.1:22117):ClientCnxn$SendThread@1235] - Session 0x1027dc193140000 for server 127.0.0.1/127.0.0.1:22117, unexpected error, closing socket connection and attempting reconnect
[junit] java.net.ConnectException: Connection refused
[junit] at sun.nio.ch.SocketChannelImpl.checkConnect(Native Method)
[junit] at sun.nio.ch.SocketChannelImpl.finishConnect(SocketChannelImpl.java:739)
[junit] at org.apache.zookeeper.ClientCnxnSocketNIO.doTransport(ClientCnxnSocketNIO.java:357)
[junit] at org.apache.zookeeper.ClientCnxn$SendThread.run(ClientCnxn.java:1214)
[junit] 2017-02-18 20:01:57,747 [myid:127.0.0.1:22120] - INFO [main-SendThread(127.0.0.1:22120):ClientCnxn$SendThread@1113] - Opening socket connection to server 127.0.0.1/127.0.0.1:22120. Will not attempt to authenticate using SASL (unknown error)
[junit] 2017-02-18 20:01:57,748 [myid:127.0.0.1:22120] - WARN [main-SendThread(127.0.0.1:22120):ClientCnxn$SendThread@1235] - Session 0x2027dc193140000 for server 127.0.0.1/127.0.0.1:22120, unexpected error, closing socket connection and attempting reconnect
[junit] java.net.ConnectException: Connection refused
[junit] at sun.nio.ch.SocketChannelImpl.checkConnect(Native Method)
[junit] at sun.nio.ch.SocketChannelImpl.finishConnect(SocketChannelImpl.java:739)
[junit] at org.apache.zookeeper.ClientCnxnSocketNIO.doTransport(ClientCnxnSocketNIO.java:357)
[junit] at org.apache.zookeeper.ClientCnxn$SendThread.run(ClientCnxn.java:1214)
fail.build.on.test.failure:
BUILD FAILED
/home/jenkins/jenkins-slave/workspace/ZooKeeper-trunk-openjdk7/build.xml:1212: The following error occurred while executing this line:
/home/jenkins/jenkins-slave/workspace/ZooKeeper-trunk-openjdk7/build.xml:1216: Tests failed!
Total time: 10 minutes 48 seconds
Build step 'Invoke Ant' marked build as failure
Recording test results
Email was triggered for: Failure - Any
Sending email for trigger: Failure - Any
###################################################################################
############################## FAILED TESTS (if any) ##############################
1 tests failed.
FAILED: org.apache.zookeeper.test.ReadOnlyModeTest.testSessionEstablishment
Error Message:
KeeperErrorCode = ConnectionLoss for /test
Stack Trace:
org.apache.zookeeper.KeeperException$ConnectionLossException: KeeperErrorCode = ConnectionLoss for /test
at org.apache.zookeeper.KeeperException.create(KeeperException.java:99)
at org.apache.zookeeper.KeeperException.create(KeeperException.java:51)
at org.apache.zookeeper.ZooKeeper.create(ZooKeeper.java:1424)
at org.apache.zookeeper.test.ReadOnlyModeTest.testSessionEstablishment(ReadOnlyModeTest.java:238)
at org.apache.zookeeper.JUnit4ZKTestRunner$LoggedInvokeMethod.evaluate(JUnit4ZKTestRunner.java:79)
at java.util.concurrent.FutureTask.run(FutureTask.java:262)
at java.lang.Thread.run(Thread.java:745)
ZooKeeper-trunk-openjdk7 - Build # 1372 - Still Failing
Posted by Apache Jenkins Server <je...@builds.apache.org>.
See https://builds.apache.org/job/ZooKeeper-trunk-openjdk7/1372/
###################################################################################
########################## LAST 60 LINES OF THE CONSOLE ###########################
[...truncated 61.21 MB...]
[junit] at sun.nio.ch.SocketChannelImpl.ensureWriteOpen(SocketChannelImpl.java:265)
[junit] at sun.nio.ch.SocketChannelImpl.write(SocketChannelImpl.java:474)
[junit] at org.jboss.netty.channel.socket.nio.SocketSendBufferPool$UnpooledSendBuffer.transferTo(SocketSendBufferPool.java:203)
[junit] at org.jboss.netty.channel.socket.nio.AbstractNioWorker.write0(AbstractNioWorker.java:201)
[junit] at org.jboss.netty.channel.socket.nio.AbstractNioWorker.writeFromTaskLoop(AbstractNioWorker.java:151)
[junit] at org.jboss.netty.channel.socket.nio.AbstractNioChannel$WriteTask.run(AbstractNioChannel.java:315)
[junit] at org.jboss.netty.channel.socket.nio.AbstractNioSelector.processTaskQueue(AbstractNioSelector.java:391)
[junit] at org.jboss.netty.channel.socket.nio.AbstractNioSelector.run(AbstractNioSelector.java:315)
[junit] at org.jboss.netty.channel.socket.nio.AbstractNioWorker.run(AbstractNioWorker.java:89)
[junit] at org.jboss.netty.channel.socket.nio.NioWorker.run(NioWorker.java:178)
[junit] at org.jboss.netty.util.ThreadRenamingRunnable.run(ThreadRenamingRunnable.java:108)
[junit] at org.jboss.netty.util.internal.DeadLockProofWorker$1.run(DeadLockProofWorker.java:42)
[junit] at java.util.concurrent.ThreadPoolExecutor.runWorker(ThreadPoolExecutor.java:1145)
[junit] at java.util.concurrent.ThreadPoolExecutor$Worker.run(ThreadPoolExecutor.java:615)
[junit] at java.lang.Thread.run(Thread.java:745)
[junit] 2017-02-19 20:01:39,609 [myid:] - INFO [SyncThread:0:MBeanRegistry@128] - Unregister MBean [org.apache.ZooKeeperService:name0=StandaloneServer_port19547,name1=Connections,name2=127.0.0.1,name3=0x10282eac8be0000]
[junit] 2017-02-19 20:01:39,709 [myid:] - INFO [main:ZooKeeper@1324] - Session: 0x10282eac8be0000 closed
[junit] 2017-02-19 20:01:39,709 [myid:] - INFO [main:JUnit4ZKTestRunner$LoggedInvokeMethod@82] - Memory used 236451
[junit] 2017-02-19 20:01:39,709 [myid:] - INFO [main-EventThread:ClientCnxn$EventThread@513] - EventThread shut down for session: 0x10282eac8be0000
[junit] 2017-02-19 20:01:39,710 [myid:] - INFO [main:JUnit4ZKTestRunner$LoggedInvokeMethod@87] - Number of threads 2428
[junit] 2017-02-19 20:01:39,710 [myid:] - INFO [main:JUnit4ZKTestRunner$LoggedInvokeMethod@102] - FINISHED TEST METHOD testWatcherAutoResetWithLocal
[junit] 2017-02-19 20:01:39,710 [myid:] - INFO [main:ClientBase@558] - tearDown starting
[junit] 2017-02-19 20:01:39,710 [myid:] - INFO [main:ClientBase@528] - STOPPING server
[junit] 2017-02-19 20:01:39,710 [myid:] - INFO [main:NettyServerCnxnFactory@464] - shutdown called 0.0.0.0/0.0.0.0:19547
[junit] 2017-02-19 20:01:39,714 [myid:] - INFO [main:ZooKeeperServer@542] - shutting down
[junit] 2017-02-19 20:01:39,715 [myid:] - ERROR [main:ZooKeeperServer@506] - ZKShutdownHandler is not registered, so ZooKeeper server won't take any action on ERROR or SHUTDOWN server state changes
[junit] 2017-02-19 20:01:39,715 [myid:] - INFO [main:SessionTrackerImpl@232] - Shutting down
[junit] 2017-02-19 20:01:39,715 [myid:] - INFO [main:PrepRequestProcessor@1008] - Shutting down
[junit] 2017-02-19 20:01:39,715 [myid:] - INFO [main:SyncRequestProcessor@191] - Shutting down
[junit] 2017-02-19 20:01:39,715 [myid:] - INFO [ProcessThread(sid:0 cport:19547)::PrepRequestProcessor@157] - PrepRequestProcessor exited loop!
[junit] 2017-02-19 20:01:39,715 [myid:] - INFO [SyncThread:0:SyncRequestProcessor@169] - SyncRequestProcessor exited!
[junit] 2017-02-19 20:01:39,715 [myid:] - INFO [main:FinalRequestProcessor@481] - shutdown of request processor complete
[junit] 2017-02-19 20:01:39,715 [myid:] - INFO [main:MBeanRegistry@128] - Unregister MBean [org.apache.ZooKeeperService:name0=StandaloneServer_port19547,name1=InMemoryDataTree]
[junit] 2017-02-19 20:01:39,716 [myid:] - INFO [main:MBeanRegistry@128] - Unregister MBean [org.apache.ZooKeeperService:name0=StandaloneServer_port19547]
[junit] 2017-02-19 20:01:39,716 [myid:] - INFO [main:FourLetterWordMain@85] - connecting to 127.0.0.1 19547
[junit] 2017-02-19 20:01:39,716 [myid:] - INFO [main:JMXEnv@146] - ensureOnly:[]
[junit] 2017-02-19 20:01:39,722 [myid:] - INFO [main:ClientBase@583] - fdcount after test is: 7142 at start it was 7142
[junit] 2017-02-19 20:01:39,723 [myid:] - INFO [main:ZKTestCase$1@65] - SUCCEEDED testWatcherAutoResetWithLocal
[junit] 2017-02-19 20:01:39,723 [myid:] - INFO [main:ZKTestCase$1@60] - FINISHED testWatcherAutoResetWithLocal
[junit] Tests run: 103, Failures: 0, Errors: 0, Skipped: 0, Time elapsed: 458.292 sec, Thread: 4, Class: org.apache.zookeeper.test.NioNettySuiteTest
[junit] 2017-02-19 20:01:40,031 [myid:127.0.0.1:19424] - INFO [main-SendThread(127.0.0.1:19424):ClientCnxn$SendThread@1113] - Opening socket connection to server 127.0.0.1/127.0.0.1:19424. Will not attempt to authenticate using SASL (unknown error)
[junit] 2017-02-19 20:01:40,032 [myid:127.0.0.1:19424] - WARN [main-SendThread(127.0.0.1:19424):ClientCnxn$SendThread@1235] - Session 0x10282e7af2d0000 for server 127.0.0.1/127.0.0.1:19424, unexpected error, closing socket connection and attempting reconnect
[junit] java.net.ConnectException: Connection refused
[junit] at sun.nio.ch.SocketChannelImpl.checkConnect(Native Method)
[junit] at sun.nio.ch.SocketChannelImpl.finishConnect(SocketChannelImpl.java:739)
[junit] at org.apache.zookeeper.ClientCnxnSocketNIO.doTransport(ClientCnxnSocketNIO.java:357)
[junit] at org.apache.zookeeper.ClientCnxn$SendThread.run(ClientCnxn.java:1214)
fail.build.on.test.failure:
BUILD FAILED
/home/jenkins/jenkins-slave/workspace/ZooKeeper-trunk-openjdk7/build.xml:1212: The following error occurred while executing this line:
/home/jenkins/jenkins-slave/workspace/ZooKeeper-trunk-openjdk7/build.xml:1216: Tests failed!
Total time: 10 minutes 38 seconds
Build step 'Invoke Ant' marked build as failure
Recording test results
Email was triggered for: Failure - Any
Sending email for trigger: Failure - Any
###################################################################################
############################## FAILED TESTS (if any) ##############################
1 tests failed.
FAILED: org.apache.zookeeper.test.ReadOnlyModeTest.testSessionEstablishment
Error Message:
KeeperErrorCode = ConnectionLoss for /test
Stack Trace:
org.apache.zookeeper.KeeperException$ConnectionLossException: KeeperErrorCode = ConnectionLoss for /test
at org.apache.zookeeper.KeeperException.create(KeeperException.java:99)
at org.apache.zookeeper.KeeperException.create(KeeperException.java:51)
at org.apache.zookeeper.ZooKeeper.create(ZooKeeper.java:1424)
at org.apache.zookeeper.test.ReadOnlyModeTest.testSessionEstablishment(ReadOnlyModeTest.java:238)
at org.apache.zookeeper.JUnit4ZKTestRunner$LoggedInvokeMethod.evaluate(JUnit4ZKTestRunner.java:79)
at java.util.concurrent.FutureTask.run(FutureTask.java:262)
at java.lang.Thread.run(Thread.java:745)