You are viewing a plain text version of this content. The canonical link for it is here.
Posted to commits@sling.apache.org by Apache Jenkins Server <je...@builds.apache.org> on 2016/08/16 19:54:47 UTC

Build failed in Jenkins: sling-trunk-1.8 #3787

See <https://builds.apache.org/job/sling-trunk-1.8/3787/>

------------------------------------------
[...truncated 145446 lines...]
[INFO] Apache Sling Dynamic Class Loader Support .......... SUCCESS [ 14.708 s]
[INFO] Apache Sling Commons FileSystem ClassLoader ........ SUCCESS [  4.829 s]
[INFO] Apache Sling Commons Java Compiler ................. SUCCESS [  7.205 s]
[INFO] Apache Sling JSON Library .......................... SUCCESS [ 11.270 s]
[INFO] Apache Sling SLF4J Implementation (Logback) ........ SUCCESS [01:09 min]
[INFO] Apache Sling OSGi LogService Implementation ........ SUCCESS [  5.566 s]
[INFO] Apache Sling MIME type mapping support ............. SUCCESS [  5.238 s]
[INFO] Apache Sling Content Detection Support ............. SUCCESS [01:07 min]
[INFO] Apache Sling Commons OSGi support .................. SUCCESS [  9.967 s]
[INFO] Apache Sling Scheduler Support ..................... SUCCESS [  9.429 s]
[INFO] Apache Sling Thread Dumper ......................... SUCCESS [  3.054 s]
[INFO] Apache Sling Thread Support ........................ SUCCESS [  8.365 s]
[INFO] Apache Sling Metrics ............................... SUCCESS [  9.627 s]
[INFO] Apache Sling Authentication Service ................ SUCCESS [  7.451 s]
[INFO] Apache Sling Form Based Authentication Handler ..... SUCCESS [ 13.307 s]
[INFO] Apache Sling Engine Implementation ................. SUCCESS [ 27.540 s]
[INFO] Apache Sling Repository API Bundle ................. SUCCESS [  4.533 s]
[INFO] Apache Sling JCR Base Bundle ....................... SUCCESS [  8.370 s]
[INFO] Apache Sling Pax Exam Utilities .................... SUCCESS [ 59.187 s]
[INFO] Apache Sling Initial Content Loader ................ SUCCESS [01:40 min]
[INFO] Apache Sling Jackrabbit Embedded Repository ........ SUCCESS [ 11.766 s]
[INFO] Apache Sling Jackrabbit UserManager Support ........ SUCCESS [  3.504 s]
[INFO] Apache Sling Jackrabbit JSR-283 Access Control Manager Support SUCCESS [  2.586 s]
[INFO] Apache Sling Wrapper Bundle for the JCR API ........ SUCCESS [  2.225 s]
[INFO] Apache Sling JCR Resource Resolver ................. SUCCESS [ 48.645 s]
[INFO] Apache Sling Versioning Integration Tests .......... SUCCESS [ 15.134 s]
[INFO] Apache Sling JCR Repository Registration ........... SUCCESS [  4.882 s]
[INFO] Apache Sling Simple WebDAV Access to repositories .. SUCCESS [  3.877 s]
[INFO] Apache Sling DavEx Access to repositories .......... SUCCESS [  4.644 s]
[INFO] Apache Sling JCR WebConsole Bundle ................. SUCCESS [  2.115 s]
[INFO] Apache Sling Testing PaxExam ....................... SUCCESS [ 29.032 s]
[INFO] Apache Sling JCR Oak Repository Server ............. SUCCESS [ 34.325 s]
[INFO] Apache Sling SlingRepository Integration Tests ..... SUCCESS [01:41 min]
[INFO] Apache Sling RepoInit Parser ....................... SUCCESS [  4.659 s]
[INFO] Apache Sling RepoInit JCR module ................... SUCCESS [ 25.276 s]
[INFO] Apache Sling Servlet Resolver ...................... SUCCESS [  5.477 s]
[INFO] Apache Sling Default GET Servlets .................. SUCCESS [  5.239 s]
[INFO] Apache Sling Default POST Servlets ................. SUCCESS [ 10.233 s]
[INFO] Apache Sling Compat Servlets ....................... SUCCESS [  2.196 s]
[INFO] Apache Sling Scripting Implementation API .......... SUCCESS [  2.330 s]
[INFO] Apache Sling Scripting Core implementation ......... SUCCESS [ 28.457 s]
[INFO] Apache Sling Scripting JavaScript Support .......... SUCCESS [ 43.387 s]
[INFO] Apache Sling Scripting JSP Support ................. SUCCESS [  7.895 s]
[INFO] Apache Sling JSP Tag Library ....................... SUCCESS [  6.620 s]
[INFO] Apache Sling JSP Standard Tag Library .............. SUCCESS [  2.685 s]
[INFO] Apache Sling Scripting Sightly Compiler ............ SUCCESS [ 40.621 s]
[INFO] Apache Sling Scripting Sightly Java Compiler ....... SUCCESS [ 23.997 s]
[INFO] Apache Sling Scripting Sightly Engine .............. SUCCESS [ 27.437 s]
[INFO] Apache Sling Scripting Sightly JavaScript Use Provider SUCCESS [  3.167 s]
[INFO] Apache Sling Scripting Sightly Models Use Provider . SUCCESS [  2.372 s]
[INFO] Apache Sling Scripting Sightly Read-Eval-Print Loop Environment SUCCESS [  2.614 s]
[INFO] Apache Sling Scripting Sightly Integration Tests Content SUCCESS [  6.235 s]
[INFO] Apache Sling Launchpad Base ........................ SUCCESS [ 22.705 s]
[INFO] Apache Sling Subsystems Base Installer ............. SUCCESS [  3.602 s]
[INFO] Apache Sling Filesystem Resource Provider .......... SUCCESS [  2.490 s]
[INFO] Apache Sling Internationalization Support .......... SUCCESS [ 57.787 s]
[INFO] Apache Sling Installer WebConsole Plugin ........... SUCCESS [  2.509 s]
[INFO] Apache Sling JCR Installer ......................... SUCCESS [02:03 min]
[INFO] Apache Sling Launchpad Application Builder ......... SUCCESS [ 55.504 s]
[INFO] Apache Sling Scripting Sightly Integration Tests ... SUCCESS [03:08 min]
[INFO] Apache Sling Scripting Sightly Reactor ............. SUCCESS [  2.000 s]
[INFO] Apache Sling Adapter Manager Implementation ........ SUCCESS [  4.564 s]
[INFO] Apache Sling Bundle Resource Provider .............. SUCCESS [  2.308 s]
[INFO] Apache Sling Distributed Event Admin ............... SUCCESS [  3.685 s]
[INFO] Apache Sling Discovery API ......................... SUCCESS [  2.223 s]
[INFO] Apache Sling Discovery Commons ..................... SUCCESS [ 52.960 s]
[INFO] Apache Sling Discovery Base ........................ SUCCESS [ 53.887 s]
[INFO] Apache Sling Resource-Based Discovery Service ...... SUCCESS [02:56 min]
[INFO] Apache Sling Oak-Based Discovery Service ........... SUCCESS [02:57 min]
[INFO] Apache Sling Discovery Support Bundle .............. SUCCESS [  2.018 s]
[INFO] Apache Sling Discovery Standalone Implementation ... SUCCESS [  2.766 s]
[INFO] Apache Sling Event Support ......................... SUCCESS [24:29 min]
[INFO] Apache Sling Feature Flags ......................... SUCCESS [  6.492 s]
[INFO] Apache Sling javax.activation bundle ............... SUCCESS [  2.184 s]
[INFO] Apache Sling Service User Mapper ................... SUCCESS [  3.801 s]
[INFO] Apache Sling Settings .............................. SUCCESS [  3.914 s]
[INFO] Apache Sling Web Console Branding .................. SUCCESS [  2.030 s]
[INFO] Apache Sling Web Console Security Provider ......... SUCCESS [  2.227 s]
[INFO] Apache Sling Explorer .............................. SUCCESS [  2.119 s]
[INFO] Apache Sling Health Check Core ..................... SUCCESS [02:46 min]
[INFO] Apache Sling Health Check Samples .................. SUCCESS [  3.385 s]
[INFO] Apache Sling Health Check Support Components ....... SUCCESS [  3.414 s]
[INFO] Apache Sling Health Check Webconsole Plugin ........ SUCCESS [  2.022 s]
[INFO] Apache Sling Health Check JUnit Bridge ............. SUCCESS [  3.424 s]
[INFO] Apache Sling Health Check Annotations .............. SUCCESS [  2.019 s]
[INFO] Apache Sling Health Check Integration Tests ........ SUCCESS [  6.089 s]
[INFO] Apache Sling Health Check Reactor POM .............. SUCCESS [  1.335 s]
[INFO] Apache Sling Resource Access Security .............. SUCCESS [  2.547 s]

[INFO] Apache Sling Resource Access Security Integration Tests SUCCESS [ 33.771 s]
[INFO] Apache Sling Models API ............................ SUCCESS [  2.550 s]
[INFO] Apache Sling Models Implementation ................. SUCCESS [  6.994 s]
[INFO] Apache Sling Models Integration Tests .............. SUCCESS [ 40.756 s]
[INFO] Apache Sling XSS Protection Bundle ................. SUCCESS [ 13.446 s]
[INFO] Apache Sling JUnit Core ............................ SUCCESS [  4.211 s]
[INFO] Apache Sling JUnit Tests Teleporter ................ SUCCESS [  8.455 s]
[INFO] Apache Sling Resource Builder ...................... SUCCESS [ 35.807 s]
[INFO] Apache Sling Servlet Helpers ....................... SUCCESS [  4.092 s]
[INFO] Apache Sling RepoInit Integration Tests ............ SUCCESS [ 28.666 s]
[INFO] Apache Sling RepoInit Reactor ...................... SUCCESS [  1.591 s]
[INFO] Apache Sling Test Tools ............................ SUCCESS [  4.109 s]
[INFO] Apache Sling Testing Clients ....................... SUCCESS [  9.044 s]
[INFO] Apache Sling Testing Hamcrest ...................... SUCCESS [  3.641 s]
[INFO] Apache Sling Server Setup Tools .................... SUCCESS [ 22.292 s]
[INFO] Apache Sling Testing Rules ......................... SUCCESS [  6.254 s]
[INFO] Apache Sling JUnit Scriptable Tests Provider ....... SUCCESS [  3.589 s]
[INFO] Apache Sling JUnit Health Checks ................... SUCCESS [  2.850 s]
[INFO] Apache Sling JUnit Remote Tests Runners ............ SUCCESS [  3.181 s]
[INFO] Apache Sling JUnit Performance ..................... SUCCESS [  2.884 s]
[INFO] Apache Sling Testing Mock Log Configuration ........ SUCCESS [  2.088 s]
[INFO] Apache Sling Testing Resource Resolver Mock ........ SUCCESS [  3.118 s]
[INFO] Apache Sling Testing JCR Mock ...................... SUCCESS [  4.251 s]
[INFO] Apache Sling Testing OSGi Mock ..................... SUCCESS [  8.131 s]
[INFO] Apache Sling Testing Sling Mock .................... FAILURE [ 44.901 s]
[INFO] Apache Sling Testing Sling Mock Oak-based Resource Resolver SKIPPED
[INFO] Apache Sling Testing Mocks Modules Reactor ......... SKIPPED
[INFO] Apache Sling Testing - sample bundle with integration tests SKIPPED
[INFO] Apache Sling Testing - sample module with integration tests SKIPPED
[INFO] Apache Sling Testing Modules Reactor ............... SKIPPED
[INFO] Apache Sling Installer ............................. SKIPPED
[INFO] Apache Sling File Installer ........................ SKIPPED
[INFO] Apache Sling Installer Configuration Admin Support . SKIPPED
[INFO] Apache Sling Deployment Package Installer .......... SKIPPED
[INFO] Apache Sling Subsystems Installer .................. SKIPPED
[INFO] Apache Sling Installer Integration Tests ........... SKIPPED
[INFO] Apache Sling Launchpad API ......................... SKIPPED
[INFO] Apache Sling Launchpad Installer ................... SKIPPED
[INFO] Apache Sling Launchpad Content ..................... SKIPPED
[INFO] Apache Sling Validation Framework API .............. SKIPPED
[INFO] Apache Sling Validation Framework Core Implementation SKIPPED
[INFO] Apache Sling Validation Framework Testing Services . SKIPPED
[INFO] Apache Sling Validation Framework Integration Tests  SKIPPED
[INFO] Apache Sling Validation Framework Examples ......... SKIPPED
[INFO] Apache Sling Validation Framework Builder .......... SKIPPED
[INFO] Apache Sling Models Validation Implementation ...... SKIPPED
[INFO] Apache Sling Launchpad Testing Services ............ SKIPPED
[INFO] Apache Sling Launchpad Testing Services WAR ........ SKIPPED
[INFO] Apache Sling Launchpad Testing Fragment Bundle ..... SKIPPED
[INFO] Apache Sling Launchpad Test Bundles ................ SKIPPED
[INFO] Apache Sling Integration Tests ..................... SKIPPED
[INFO] Apache Sling Launchpad Testing ..................... SKIPPED
[INFO] Apache Sling (Builder) ............................. SKIPPED
[INFO] ------------------------------------------------------------------------
[INFO] BUILD FAILURE
[INFO] ------------------------------------------------------------------------
[INFO] Total time: 01:08 h
[INFO] Finished at: 2016-08-16T19:51:28+00:00
[INFO] Final Memory: 378M/469M
[INFO] ------------------------------------------------------------------------
Waiting for Jenkins to finish collecting data
[ERROR] Failed to execute goal org.apache.maven.plugins:maven-jar-plugin:3.0.0:test-jar (default) on project org.apache.sling.testing.sling-mock: Error assembling JAR: Problem creating jar: Execution exception: Java heap space -> [Help 1]
[ERROR] 
[ERROR] To see the full stack trace of the errors, re-run Maven with the -e switch.
[ERROR] Re-run Maven using the -X switch to enable full debug logging.
[ERROR] 
[ERROR] For more information about the errors and possible solutions, please read the following articles:
[ERROR] [Help 1] http://cwiki.apache.org/confluence/display/MAVEN/MojoExecutionException
[ERROR] 
[ERROR] After correcting the problems, you can resume the build with the command
[ERROR]   mvn <goals> -rf :org.apache.sling.testing.sling-mock
channel stopped
Found 18 test results
Found 95 test results
Found 45 test results
Found 8 test results
Found 4 test results
Found 2 test results
Found 17 test results
Found 4 test results
Found 94 test results
Found 44 test results
Found 10 test results
Found 21 test results
Found 9 test results
Found 36 test results
Found 42 test results
Found 22 test results
Found 10 test results
Found 31 test results
Found 83 test results
Found 50 test results
Found 30 test results
Found 5 test results
Found 95 test results
Found 77 test results
Found failed test junit/org.apache.sling.event.it/ChaosTest
Found failed test junit/org.apache.sling.event.it/ChaosTest/testDoChaos
Found 4 test results
Found 94 test results
Found 3 test results
Found 8 test results
Found 2 test results
Found 13 test results
Found 31 test results
Found failed test junit/org.apache.sling.i18n.it/ResourceBundleProviderIT
Found failed test junit/org.apache.sling.i18n.it/ResourceBundleProviderIT/testChangesDetection
Found failed test junit/org.apache.sling.i18n.it/ResourceBundleProviderIT/test_dummy
Found 3 test results
Found 38 test results
Found 9 test results
Found 96 test results
Found 8 test results
Found 17 test results
Found 45 test results
Found 34 test results
Found 9 test results
Found 94 test results
Found 37 test results
Found 4 test results
Found 16 test results
Found 3 test results
Found 2 test results
Found 23 test results
Found 3 test results
Found 75 test results
Found 184 test results
Found 16 test results
Found 10 test results
Found 49 test results
Found 8 test results
Found 35 test results
Found 21 test results
Found 36 test results
Found 210 test results
Found 24 test results
Found 81 test results
Found 27 test results
Found 24 test results
Found 13 test results
Found 2 test results
Found 392 test results
Found 17 test results
Found 58 test results
Found 28 test results
Found 44 test results
Found 92 test results
Found 18 test results
Found 164 test results
Found 8 test results
Found 70 test results
Found 103 test results
Found 18 test results
Found 50 test results
Found 77 test results
Found 13 test results
Found 154 test results
Found 26 test results
Found 2 test results
Found 27 test results

Build failed in Jenkins: sling-trunk-1.8 #3809

Posted by Apache Jenkins Server <je...@builds.apache.org>.
See <https://builds.apache.org/job/sling-trunk-1.8/3809/>

------------------------------------------
[...truncated 133426 lines...]
[JENKINS] Archiving disabled
[JENKINS] Archiving disabled
[JENKINS] Archiving disabled
[JENKINS] Archiving disabled
[JENKINS] Archiving disabled
[JENKINS] Archiving disabled[INFO] ------------------------------------------------------------------------
[INFO] Reactor Summary:
[INFO] 
[INFO] Apache Sling JAR Resource Bundle ................... SUCCESS [ 14.623 s]
[INFO] Apache Sling (Parent) .............................. SUCCESS [  9.825 s]
[INFO] Apache Sling Tooling Support Install ............... SUCCESS [ 14.603 s]
[INFO] Apache Sling Provisioning Model .................... SUCCESS [ 54.539 s]
[INFO] Apache Sling Tooling Support Source ................ SUCCESS [  8.121 s]
[INFO] Apache Sling Testing Utilities ..................... SUCCESS [ 46.746 s]
[INFO] Apache Sling API ................................... SUCCESS [ 18.573 s]
[INFO] Apache Sling Resource Resolver ..................... SUCCESS [01:22 min]
[INFO] Apache Sling System Bundle Extension: Java Transaction API SUCCESS [  9.246 s]
[INFO] Apache Sling System Bundle Extension: XML APIs ..... SUCCESS [  8.649 s]
[INFO] Apache Sling System Bundle Extension: Activation API SUCCESS [  9.437 s]
[INFO] Apache Sling System Bundle Extension: WS APIs ...... SUCCESS [  9.886 s]
[INFO] Apache Sling Dynamic Class Loader Support .......... SUCCESS [ 59.383 s]
[INFO] Apache Sling Commons FileSystem ClassLoader ........ SUCCESS [ 11.170 s]
[INFO] Apache Sling Commons Java Compiler ................. SUCCESS [ 13.618 s]
[INFO] Apache Sling JSON Library .......................... SUCCESS [ 20.066 s]
[INFO] Apache Sling SLF4J Implementation (Logback) ........ SUCCESS [ 56.623 s]
[INFO] Apache Sling OSGi LogService Implementation ........ SUCCESS [ 11.982 s]
[INFO] Apache Sling MIME type mapping support ............. SUCCESS [ 16.101 s]
[INFO] Apache Sling Content Detection Support ............. SUCCESS [01:25 min]
[INFO] Apache Sling Commons OSGi support .................. SUCCESS [01:06 min]
[INFO] Apache Sling Scheduler Support ..................... SUCCESS [ 14.006 s]
[INFO] Apache Sling Thread Dumper ......................... SUCCESS [  8.641 s]
[INFO] Apache Sling Thread Support ........................ SUCCESS [ 13.196 s]
[INFO] Apache Sling Metrics ............................... SUCCESS [ 14.125 s]
[INFO] Apache Sling Authentication Service ................ SUCCESS [ 11.533 s]
[INFO] Apache Sling Form Based Authentication Handler ..... SUCCESS [ 14.399 s]
[INFO] Apache Sling Engine Implementation ................. SUCCESS [ 23.623 s]
[INFO] Apache Sling Repository API Bundle ................. SUCCESS [ 10.689 s]
[INFO] Apache Sling JCR Base Bundle ....................... SUCCESS [ 12.625 s]
[INFO] Apache Sling Pax Exam Utilities .................... SUCCESS [01:15 min]
[INFO] Apache Sling Initial Content Loader ................ SUCCESS [02:19 min]
[INFO] Apache Sling Jackrabbit Embedded Repository ........ SUCCESS [ 16.107 s]
[INFO] Apache Sling Jackrabbit UserManager Support ........ SUCCESS [  9.654 s]
[INFO] Apache Sling Jackrabbit JSR-283 Access Control Manager Support SUCCESS [  8.285 s]
[INFO] Apache Sling Wrapper Bundle for the JCR API ........ SUCCESS [  6.342 s]
[INFO] Apache Sling JCR Resource Resolver ................. SUCCESS [01:26 min]
[INFO] Apache Sling Versioning Integration Tests .......... SUCCESS [ 40.939 s]
[INFO] Apache Sling JCR Repository Registration ........... SUCCESS [  9.508 s]
[INFO] Apache Sling Simple WebDAV Access to repositories .. SUCCESS [ 11.417 s]
[INFO] Apache Sling DavEx Access to repositories .......... SUCCESS [ 12.748 s]
[INFO] Apache Sling JCR WebConsole Bundle ................. SUCCESS [  6.973 s]
[INFO] Apache Sling JCR Oak Repository Server ............. SUCCESS [01:11 min]
[INFO] Apache Sling SlingRepository Integration Tests ..... SUCCESS [01:58 min]
[INFO] Apache Sling RepoInit Parser ....................... SUCCESS [ 14.638 s]
[INFO] Apache Sling RepoInit JCR module ................... SUCCESS [ 25.415 s]
[INFO] Apache Sling Servlet Resolver ...................... SUCCESS [ 14.342 s]
[INFO] Apache Sling Default GET Servlets .................. SUCCESS [ 11.075 s]
[INFO] Apache Sling Default POST Servlets ................. SUCCESS [ 17.265 s]
[INFO] Apache Sling Compat Servlets ....................... SUCCESS [  7.426 s]
[INFO] Apache Sling Scripting Implementation API .......... SUCCESS [  7.991 s]
[INFO] Apache Sling Scripting Core implementation ......... SUCCESS [ 31.591 s]
[INFO] Apache Sling Scripting JavaScript Support .......... SUCCESS [ 45.772 s]
[INFO] Apache Sling Scripting JSP Support ................. SUCCESS [ 10.630 s]
[INFO] Apache Sling JSP Tag Library ....................... SUCCESS [ 13.787 s]
[INFO] Apache Sling JSP Standard Tag Library .............. SUCCESS [  6.597 s]
[INFO] Apache Sling Scripting Sightly Compiler ............ SUCCESS [ 33.701 s]
[INFO] Apache Sling Scripting Sightly Java Compiler ....... SUCCESS [ 24.094 s]
[INFO] Apache Sling Scripting Sightly Engine .............. SUCCESS [ 25.565 s]
[INFO] Apache Sling Scripting Sightly JavaScript Use Provider SUCCESS [  8.518 s]
[INFO] Apache Sling Scripting Sightly Models Use Provider . SUCCESS [  9.822 s]
[INFO] Apache Sling Scripting Sightly Read-Eval-Print Loop Environment SUCCESS [ 10.714 s]
[INFO] Apache Sling Scripting Sightly Integration Tests Content SUCCESS [ 12.731 s]
[INFO] Apache Sling Launchpad Base ........................ SUCCESS [ 28.011 s]
[INFO] Apache Sling Subsystems Base Installer ............. SUCCESS [ 10.083 s]
[INFO] Apache Sling Filesystem Resource Provider .......... SUCCESS [  6.699 s]
[INFO] Apache Sling Installer WebConsole Plugin ........... SUCCESS [  8.253 s]
[INFO] Apache Sling JCR Installer ......................... SUCCESS [02:35 min]
[INFO] Apache Sling Launchpad Application Builder ......... SUCCESS [ 55.731 s]
[INFO] Apache Sling Scripting Sightly Integration Tests ... SUCCESS [02:25 min]
[INFO] Apache Sling Scripting Sightly Reactor ............. SUCCESS [  5.574 s]
[INFO] Apache Sling Adapter Manager Implementation ........ SUCCESS [ 13.794 s]
[INFO] Apache Sling Bundle Resource Provider .............. SUCCESS [  8.937 s]
[INFO] Apache Sling Distributed Event Admin ............... SUCCESS [  9.543 s]
[INFO] Apache Sling Discovery API ......................... SUCCESS [  6.665 s]
[INFO] Apache Sling Discovery Commons ..................... SUCCESS [01:18 min]
[INFO] Apache Sling Discovery Base ........................ SUCCESS [01:28 min]
[INFO] Apache Sling Resource-Based Discovery Service ...... SUCCESS [04:05 min]
[INFO] Apache Sling Oak-Based Discovery Service ........... SUCCESS [02:43 min]
[INFO] Apache Sling Discovery Support Bundle .............. SUCCESS [  8.535 s]
[INFO] Apache Sling Discovery Standalone Implementation ... SUCCESS [  8.789 s]
[INFO] Apache Sling Event Support ......................... SUCCESS [27:33 min]
[INFO] Apache Sling Feature Flags ......................... SUCCESS [ 10.551 s]
[INFO] Apache Sling javax.activation bundle ............... SUCCESS [ 12.774 s]
[INFO] Apache Sling Service User Mapper ................... SUCCESS [ 12.601 s]
[INFO] Apache Sling Settings .............................. SUCCESS [  9.460 s]
[INFO] Apache Sling Web Console Branding .................. SUCCESS [  5.346 s]
[INFO] Apache Sling Web Console Security Provider ......... SUCCESS [  7.816 s]
[INFO] Apache Sling Explorer .............................. SUCCESS [  6.863 s]
[INFO] Apache Sling Health Check Core ..................... SUCCESS [02:34 min]
[INFO] Apache Sling Health Check Samples .................. SUCCESS [ 10.754 s]
[INFO] Apache Sling Health Check Support Components ....... SUCCESS [ 11.563 s]
[INFO] Apache Sling Health Check Webconsole Plugin ........ SUCCESS [  9.931 s]
[INFO] Apache Sling Health Check JUnit Bridge ............. SUCCESS [ 10.128 s]
[INFO] Apache Sling Health Check Annotations .............. SUCCESS [  7.432 s]
[INFO] Apache Sling Health Check Integration Tests ........ SUCCESS [ 12.405 s]
[INFO] Apache Sling Health Check Reactor POM .............. SUCCESS [  5.498 s]
[INFO] Apache Sling Resource Access Security .............. SUCCESS [  9.366 s]
[INFO] Apache Sling Resource Access Security Integration Tests SUCCESS [01:00 min]
[INFO] Apache Sling Models API ............................ SUCCESS [  9.427 s]
[INFO] Apache Sling Models Implementation ................. SUCCESS [ 16.661 s]
[INFO] Apache Sling Models Integration Tests .............. SUCCESS [01:01 min]
[INFO] Apache Sling Internationalization Support .......... FAILURE [01:26 min]
[INFO] Apache Sling XSS Protection Bundle ................. SKIPPED
[INFO] Apache Sling JUnit Core ............................ SKIPPED
[INFO] Apache Sling JUnit Tests Teleporter ................ SKIPPED
[INFO] Apache Sling Resource Builder ...................... SKIPPED
[INFO] Apache Sling Servlet Helpers ....................... SKIPPED
[INFO] Apache Sling RepoInit Integration Tests ............ SKIPPED
[INFO] Apache Sling RepoInit Reactor ...................... SKIPPED
[INFO] Apache Sling Test Tools ............................ SKIPPED
[INFO] Apache Sling Testing Clients ....................... SKIPPED
[INFO] Apache Sling Testing Hamcrest ...................... SKIPPED
[INFO] Apache Sling Server Setup Tools .................... SKIPPED
[INFO] Apache Sling Testing Rules ......................... SKIPPED
[INFO] Apache Sling JUnit Scriptable Tests Provider ....... SKIPPED
[INFO] Apache Sling JUnit Health Checks ................... SKIPPED
[INFO] Apache Sling JUnit Remote Tests Runners ............ SKIPPED
[INFO] Apache Sling JUnit Performance ..................... SKIPPED
[INFO] Apache Sling Testing Mock Log Configuration ........ SKIPPED
[INFO] Apache Sling Testing Resource Resolver Mock ........ SKIPPED
[INFO] Apache Sling Testing JCR Mock ...................... SKIPPED
[INFO] Apache Sling Testing OSGi Mock ..................... SKIPPED
[INFO] Apache Sling Testing Sling Mock .................... SKIPPED
[INFO] Apache Sling Testing Sling Mock Oak-based Resource Resolver SKIPPED
[INFO] Apache Sling Testing Mocks Modules Reactor ......... SKIPPED
[INFO] Apache Sling Testing - sample bundle with integration tests SKIPPED
[INFO] Apache Sling Testing - sample module with integration tests SKIPPED
[INFO] Apache Sling Testing PaxExam ....................... SKIPPED
[INFO] Apache Sling Testing Modules Reactor ............... SKIPPED
[INFO] Apache Sling Installer ............................. SKIPPED
[INFO] Apache Sling File Installer ........................ SKIPPED
[INFO] Apache Sling Installer Configuration Admin Support . SKIPPED
[INFO] Apache Sling Deployment Package Installer .......... SKIPPED
[INFO] Apache Sling Subsystems Installer .................. SKIPPED
[INFO] Apache Sling Installer Health Checks ............... SKIPPED
[INFO] Apache Sling Installer Integration Tests ........... SKIPPED
[INFO] Apache Sling Launchpad API ......................... SKIPPED
[INFO] Apache Sling Launchpad Installer ................... SKIPPED
[INFO] Apache Sling Launchpad Content ..................... SKIPPED
[INFO] Apache Sling Validation Framework API .............. SKIPPED
[INFO] Apache Sling Validation Framework Core Implementation SKIPPED
[INFO] Apache Sling Validation Framework Testing Services . SKIPPED
[INFO] Apache Sling Validation Framework Integration Tests  SKIPPED
[INFO] Apache Sling Validation Framework Examples ......... SKIPPED
[INFO] Apache Sling Validation Framework Builder .......... SKIPPED
[INFO] Apache Sling Models Validation Implementation ...... SKIPPED
[INFO] Apache Sling Launchpad Testing Services ............ SKIPPED
[INFO] Apache Sling Launchpad Testing Services WAR ........ SKIPPED
[INFO] Apache Sling Launchpad Testing Fragment Bundle ..... SKIPPED
[INFO] Apache Sling Launchpad Test Bundles ................ SKIPPED
[INFO] Apache Sling Integration Tests ..................... SKIPPED
[INFO] Apache Sling Launchpad Testing ..................... SKIPPED
[INFO] Apache Sling (Builder) ............................. SKIPPED
[INFO] ------------------------------------------------------------------------
[INFO] BUILD FAILURE
[INFO] ------------------------------------------------------------------------
[INFO] Total time: 01:37 h
[INFO] Finished at: 2016-08-19T02:58:25+00:00

[INFO] Final Memory: 282M/471M
[INFO] ------------------------------------------------------------------------
Waiting for Jenkins to finish collecting data
[ERROR] Failed to execute goal org.apache.maven.plugins:maven-failsafe-plugin:2.19.1:integration-test (default) on project org.apache.sling.i18n: Execution default of goal org.apache.maven.plugins:maven-failsafe-plugin:2.19.1:integration-test failed: The forked VM terminated without properly saying goodbye. VM crash or System.exit called?
[ERROR] Command was /bin/sh -c cd <https://builds.apache.org/job/sling-trunk-1.8/ws/trunk/bundles/extensions/i18n> && /usr/local/asfpackages/java/jdk1.8.0_102/jre/bin/java -jar <https://builds.apache.org/job/sling-trunk-1.8/ws/trunk/bundles/extensions/i18n/target/surefire/surefirebooter7408834617185479558.jar> <https://builds.apache.org/job/sling-trunk-1.8/ws/trunk/bundles/extensions/i18n/target/surefire/surefire8843626968267589046tmp> <https://builds.apache.org/job/sling-trunk-1.8/ws/trunk/bundles/extensions/i18n/target/surefire/surefire_16713063695041092978tmp>
[ERROR] -> [Help 1]
[ERROR] 
[ERROR] To see the full stack trace of the errors, re-run Maven with the -e switch.
[ERROR] Re-run Maven using the -X switch to enable full debug logging.
[ERROR] 
[ERROR] For more information about the errors and possible solutions, please read the following articles:
[ERROR] [Help 1] http://cwiki.apache.org/confluence/display/MAVEN/PluginExecutionException
[ERROR] 
[ERROR] After correcting the problems, you can resume the build with the command
[ERROR]   mvn <goals> -rf :org.apache.sling.i18n
channel stopped
Found 18 test results
Found 95 test results
Found 45 test results
Found 8 test results
Found 4 test results
Found 2 test results
Found 17 test results
Found 4 test results
Found 94 test results
Found 44 test results
Found 10 test results
Found 21 test results
Found 9 test results
Found 36 test results
Found 42 test results
Found 22 test results
Found 10 test results
Found 31 test results
Found 83 test results
Found 50 test results
Found 30 test results
Found 5 test results
Found 95 test results
Found 77 test results
Found failed test junit/org.apache.sling.event.it/ChaosTest
Found failed test junit/org.apache.sling.event.it/ChaosTest/testDoChaos
Found 4 test results
Found 94 test results
Found 3 test results
Found 8 test results
Found 2 test results
Found 13 test results
Found 27 test results
Found 3 test results
Found 38 test results
Found 9 test results
Found 96 test results
Found 8 test results
Found 17 test results
Found 45 test results
Found 34 test results
Found 9 test results
Found 94 test results
Found 3 test results
Found 75 test results
Found 184 test results
Found 16 test results
Found 10 test results
Found 49 test results
Found 35 test results
Found 21 test results
Found 210 test results
Found 24 test results
Found 81 test results
Found 27 test results
Found 24 test results
Found 13 test results
Found 2 test results
Found 392 test results
Found 17 test results
Found 28 test results
Found 44 test results
Found 92 test results
Found 18 test results
Found 2 test results

Build failed in Jenkins: sling-trunk-1.8 #3808

Posted by Apache Jenkins Server <je...@builds.apache.org>.
See <https://builds.apache.org/job/sling-trunk-1.8/3808/>

------------------------------------------
[...truncated 154328 lines...]
[INFO] Apache Sling Thread Dumper ......................... SUCCESS [ 10.601 s]
[INFO] Apache Sling Thread Support ........................ SUCCESS [  9.893 s]
[INFO] Apache Sling Metrics ............................... SUCCESS [ 12.619 s]
[INFO] Apache Sling Authentication Service ................ SUCCESS [ 10.662 s]
[INFO] Apache Sling Form Based Authentication Handler ..... SUCCESS [ 12.501 s]
[INFO] Apache Sling Engine Implementation ................. SUCCESS [ 25.768 s]
[INFO] Apache Sling Repository API Bundle ................. SUCCESS [  6.608 s]
[INFO] Apache Sling JCR Base Bundle ....................... SUCCESS [  9.141 s]
[INFO] Apache Sling Pax Exam Utilities .................... SUCCESS [ 54.760 s]
[INFO] Apache Sling Initial Content Loader ................ SUCCESS [01:36 min]
[INFO] Apache Sling Jackrabbit Embedded Repository ........ SUCCESS [ 14.591 s]
[INFO] Apache Sling Jackrabbit UserManager Support ........ SUCCESS [  7.912 s]
[INFO] Apache Sling Jackrabbit JSR-283 Access Control Manager Support SUCCESS [  7.265 s]
[INFO] Apache Sling Wrapper Bundle for the JCR API ........ SUCCESS [  6.650 s]
[INFO] Apache Sling JCR Resource Resolver ................. SUCCESS [ 49.900 s]
[INFO] Apache Sling Versioning Integration Tests .......... SUCCESS [ 20.839 s]
[INFO] Apache Sling JCR Repository Registration ........... SUCCESS [  8.996 s]
[INFO] Apache Sling Simple WebDAV Access to repositories .. SUCCESS [  8.464 s]
[INFO] Apache Sling DavEx Access to repositories .......... SUCCESS [  9.986 s]
[INFO] Apache Sling JCR WebConsole Bundle ................. SUCCESS [  8.971 s]
[INFO] Apache Sling JCR Oak Repository Server ............. SUCCESS [01:31 min]
[INFO] Apache Sling SlingRepository Integration Tests ..... SUCCESS [01:56 min]
[INFO] Apache Sling RepoInit Parser ....................... SUCCESS [ 11.024 s]
[INFO] Apache Sling RepoInit JCR module ................... SUCCESS [ 29.675 s]
[INFO] Apache Sling Servlet Resolver ...................... SUCCESS [ 13.640 s]
[INFO] Apache Sling Default GET Servlets .................. SUCCESS [ 12.645 s]
[INFO] Apache Sling Default POST Servlets ................. SUCCESS [ 17.731 s]
[INFO] Apache Sling Compat Servlets ....................... SUCCESS [  5.657 s]
[INFO] Apache Sling Scripting Implementation API .......... SUCCESS [  9.277 s]
[INFO] Apache Sling Scripting Core implementation ......... SUCCESS [ 32.960 s]
[INFO] Apache Sling Scripting JavaScript Support .......... SUCCESS [ 27.659 s]
[INFO] Apache Sling Scripting JSP Support ................. SUCCESS [ 12.213 s]
[INFO] Apache Sling JSP Tag Library ....................... SUCCESS [ 14.683 s]
[INFO] Apache Sling JSP Standard Tag Library .............. SUCCESS [  8.808 s]
[INFO] Apache Sling Scripting Sightly Compiler ............ SUCCESS [ 42.946 s]
[INFO] Apache Sling Scripting Sightly Java Compiler ....... SUCCESS [ 27.361 s]
[INFO] Apache Sling Scripting Sightly Engine .............. SUCCESS [ 27.157 s]
[INFO] Apache Sling Scripting Sightly JavaScript Use Provider SUCCESS [  8.481 s]
[INFO] Apache Sling Scripting Sightly Models Use Provider . SUCCESS [  6.966 s]
[INFO] Apache Sling Scripting Sightly Read-Eval-Print Loop Environment SUCCESS [  6.234 s]
[INFO] Apache Sling Scripting Sightly Integration Tests Content SUCCESS [ 10.420 s]
[INFO] Apache Sling Launchpad Base ........................ SUCCESS [ 28.027 s]
[INFO] Apache Sling Subsystems Base Installer ............. SUCCESS [ 13.059 s]
[INFO] Apache Sling Filesystem Resource Provider .......... SUCCESS [  4.595 s]
[INFO] Apache Sling Installer WebConsole Plugin ........... SUCCESS [  6.435 s]
[INFO] Apache Sling JCR Installer ......................... SUCCESS [02:09 min]
[INFO] Apache Sling Launchpad Application Builder ......... SUCCESS [ 55.255 s]
[INFO] Apache Sling Scripting Sightly Integration Tests ... SUCCESS [02:58 min]
[INFO] Apache Sling Scripting Sightly Reactor ............. SUCCESS [  4.925 s]
[INFO] Apache Sling Adapter Manager Implementation ........ SUCCESS [  9.608 s]
[INFO] Apache Sling Bundle Resource Provider .............. SUCCESS [  6.268 s]
[INFO] Apache Sling Distributed Event Admin ............... SUCCESS [  9.239 s]
[INFO] Apache Sling Discovery API ......................... SUCCESS [  5.470 s]
[INFO] Apache Sling Discovery Commons ..................... SUCCESS [ 59.257 s]
[INFO] Apache Sling Discovery Base ........................ SUCCESS [ 58.234 s]
[INFO] Apache Sling Resource-Based Discovery Service ...... SUCCESS [03:00 min]
[INFO] Apache Sling Oak-Based Discovery Service ........... SUCCESS [02:35 min]
[INFO] Apache Sling Discovery Support Bundle .............. SUCCESS [  7.340 s]
[INFO] Apache Sling Discovery Standalone Implementation ... SUCCESS [  5.903 s]
[INFO] Apache Sling Event Support ......................... SUCCESS [10:20 min]
[INFO] Apache Sling Feature Flags ......................... SUCCESS [ 17.446 s]
[INFO] Apache Sling javax.activation bundle ............... SUCCESS [  5.050 s]
[INFO] Apache Sling Service User Mapper ................... SUCCESS [ 11.354 s]
[INFO] Apache Sling Settings .............................. SUCCESS [  7.744 s]
[INFO] Apache Sling Web Console Branding .................. SUCCESS [  8.042 s]
[INFO] Apache Sling Web Console Security Provider ......... SUCCESS [  5.894 s]
[INFO] Apache Sling Explorer .............................. SUCCESS [  7.613 s]
[INFO] Apache Sling Health Check Core ..................... SUCCESS [02:53 min]
[INFO] Apache Sling Health Check Samples .................. SUCCESS [  9.360 s]
[INFO] Apache Sling Health Check Support Components ....... SUCCESS [  9.593 s]
[INFO] Apache Sling Health Check Webconsole Plugin ........ SUCCESS [  5.798 s]
[INFO] Apache Sling Health Check JUnit Bridge ............. SUCCESS [  8.142 s]
[INFO] Apache Sling Health Check Annotations .............. SUCCESS [  6.280 s]
[INFO] Apache Sling Health Check Integration Tests ........ SUCCESS [  9.678 s]
[INFO] Apache Sling Health Check Reactor POM .............. SUCCESS [  7.943 s]
[INFO] Apache Sling Resource Access Security .............. SUCCESS [  8.176 s]
[INFO] Apache Sling Resource Access Security Integration Tests SUCCESS [ 39.661 s]
[INFO] Apache Sling Models API ............................ SUCCESS [  6.792 s]
[INFO] Apache Sling Models Implementation ................. SUCCESS [ 16.709 s]
[INFO] Apache Sling Models Integration Tests .............. SUCCESS [ 46.113 s]
[INFO] Apache Sling Internationalization Support .......... SUCCESS [01:11 min]
[INFO] Apache Sling XSS Protection Bundle ................. SUCCESS [ 18.870 s]
[INFO] Apache Sling JUnit Core ............................ SUCCESS [  9.329 s]
[INFO] Apache Sling JUnit Tests Teleporter ................ SUCCESS [ 15.757 s]
[INFO] Apache Sling Resource Builder ...................... SUCCESS [ 43.809 s]
[INFO] Apache Sling Servlet Helpers ....................... SUCCESS [  7.687 s]
[INFO] Apache Sling RepoInit Integration Tests ............ SUCCESS [ 37.273 s]
[INFO] Apache Sling RepoInit Reactor ...................... SUCCESS [  5.319 s]
[INFO] Apache Sling Test Tools ............................ SUCCESS [  9.073 s]
[INFO] Apache Sling Testing Clients ....................... SUCCESS [ 15.502 s]
[INFO] Apache Sling Testing Hamcrest ...................... SUCCESS [  9.371 s]
[INFO] Apache Sling Server Setup Tools .................... SUCCESS [  8.652 s]
[INFO] Apache Sling Testing Rules ......................... SUCCESS [ 15.175 s]
[INFO] Apache Sling JUnit Scriptable Tests Provider ....... SUCCESS [ 10.857 s]
[INFO] Apache Sling JUnit Health Checks ................... SUCCESS [  9.284 s]
[INFO] Apache Sling JUnit Remote Tests Runners ............ SUCCESS [ 10.066 s]
[INFO] Apache Sling JUnit Performance ..................... SUCCESS [  7.648 s]
[INFO] Apache Sling Testing Mock Log Configuration ........ SUCCESS [  6.195 s]
[INFO] Apache Sling Testing Resource Resolver Mock ........ SUCCESS [  7.891 s]
[INFO] Apache Sling Testing JCR Mock ...................... SUCCESS [ 11.468 s]
[INFO] Apache Sling Testing OSGi Mock ..................... SUCCESS [ 17.135 s]
[INFO] Apache Sling Testing Sling Mock .................... SUCCESS [ 24.497 s]
[INFO] Apache Sling Testing Sling Mock Oak-based Resource Resolver SUCCESS [ 49.787 s]
[INFO] Apache Sling Testing Mocks Modules Reactor ......... SUCCESS [  5.701 s]
[INFO] Apache Sling Testing - sample bundle with integration tests SUCCESS [ 40.489 s]
[INFO] Apache Sling Testing - sample module with integration tests SUCCESS [ 37.585 s]
[INFO] Apache Sling Testing PaxExam ....................... SUCCESS [ 36.419 s]
[INFO] Apache Sling Testing Modules Reactor ............... SUCCESS [  5.045 s]
[INFO] Apache Sling Installer ............................. SUCCESS [  7.516 s]
[INFO] Apache Sling File Installer ........................ SUCCESS [  7.295 s]
[INFO] Apache Sling Installer Configuration Admin Support . SUCCESS [ 11.129 s]
[INFO] Apache Sling Deployment Package Installer .......... SUCCESS [  7.016 s]
[INFO] Apache Sling Subsystems Installer .................. SUCCESS [  6.487 s]
[INFO] Apache Sling Installer Health Checks ............... SUCCESS [  7.799 s]
[INFO] Apache Sling Installer Integration Tests ........... SUCCESS [01:06 min]
[INFO] Apache Sling Launchpad API ......................... SUCCESS [  6.345 s]
[INFO] Apache Sling Launchpad Installer ................... SUCCESS [  9.311 s]
[INFO] Apache Sling Launchpad Content ..................... SUCCESS [  7.358 s]
[INFO] Apache Sling Validation Framework API .............. SUCCESS [  0.434 s]
[INFO] Apache Sling Validation Framework Core Implementation SUCCESS [  3.995 s]
[INFO] Apache Sling Validation Framework Testing Services . SUCCESS [  0.886 s]
[INFO] Apache Sling Validation Framework Integration Tests  FAILURE [04:02 min]
[INFO] Apache Sling Validation Framework Examples ......... SKIPPED
[INFO] Apache Sling Validation Framework Builder .......... SKIPPED
[INFO] Apache Sling Models Validation Implementation ...... SKIPPED
[INFO] Apache Sling Launchpad Testing Services ............ SKIPPED
[INFO] Apache Sling Launchpad Testing Services WAR ........ SKIPPED
[INFO] Apache Sling Launchpad Testing Fragment Bundle ..... SKIPPED
[INFO] Apache Sling Launchpad Test Bundles ................ SKIPPED
[INFO] Apache Sling Integration Tests ..................... SKIPPED
[INFO] Apache Sling Launchpad Testing ..................... SKIPPED
[INFO] Apache Sling (Builder) ............................. SKIPPED
[INFO] ------------------------------------------------------------------------
[INFO] BUILD FAILURE
[INFO] ------------------------------------------------------------------------
[INFO] Total time: 01:25 h
[INFO] Finished at: 2016-08-18T20:36:32+00:00

[INFO] Final Memory: 306M/464M
[INFO] ------------------------------------------------------------------------
Waiting for Jenkins to finish collecting data
[ERROR] Failed to execute goal org.apache.maven.plugins:maven-failsafe-plugin:2.18.1:verify (verify) on project org.apache.sling.validation.it-http: There are test failures.
[ERROR] 
[ERROR] Please refer to <https://builds.apache.org/job/sling-trunk-1.8/ws/trunk/bundles/extensions/validation/it-http/target/failsafe-reports> for the individual test results.
[ERROR] -> [Help 1]
[ERROR] 
[ERROR] To see the full stack trace of the errors, re-run Maven with the -e switch.
[ERROR] Re-run Maven using the -X switch to enable full debug logging.
[ERROR] 
[ERROR] For more information about the errors and possible solutions, please read the following articles:
[ERROR] [Help 1] http://cwiki.apache.org/confluence/display/MAVEN/MojoFailureException
[ERROR] 
[ERROR] After correcting the problems, you can resume the build with the command
[ERROR]   mvn <goals> -rf :org.apache.sling.validation.it-http
channel stopped
Found 18 test results
Found 95 test results
Found 45 test results
Found 8 test results
Found 4 test results
Found 2 test results
Found 17 test results
Found 4 test results
Found 94 test results
Found 44 test results
Found 10 test results
Found 21 test results
Found 9 test results
Found 36 test results
Found 42 test results
Found 22 test results
Found 10 test results
Found failed test junit/org.apache.sling.commons.threads.impl/ThreadExpiringThreadPoolTest
Found failed test junit/org.apache.sling.commons.threads.impl/ThreadExpiringThreadPoolTest/shouldLetMultipleThreadsDieAfterExpiry
Found 31 test results
Found 83 test results
Found 50 test results
Found 30 test results
Found 5 test results
Found 95 test results
Found 77 test results
Found failed test junit/org.apache.sling.event.it/TimedJobsTest
Found failed test junit/org.apache.sling.event.it/TimedJobsTest/testTimedJob
Found 4 test results
Found 94 test results
Found 3 test results
Found 8 test results
Found 2 test results
Found 13 test results
Found 31 test results
Found 53 test results
Found 4 test results
Found 3 test results
Found 47 test results
Found 38 test results
Found 9 test results
Found 96 test results
Found 8 test results
Found 17 test results
Found 45 test results
Found 34 test results
Found 9 test results
Found 94 test results
Found 37 test results
Found 4 test results
Found 16 test results
Found 3 test results
Found 2 test results
Found 23 test results
Found 3 test results
Found 75 test results
Found 6 test results
Found 184 test results
Found 16 test results
Found 10 test results
Found 49 test results
Found 8 test results
Found 35 test results
Found 21 test results
Found 36 test results
Found 210 test results
Found 24 test results
Found 81 test results
Found 27 test results
Found 24 test results
Found 13 test results
Found 2 test results
Found 392 test results
Found 17 test results
Found 58 test results
Found 28 test results
Found 44 test results
Found 92 test results
Found 18 test results
Found 164 test results
Found 8 test results
Found 70 test results
Found 103 test results
Found 18 test results
Found 50 test results
Found 77 test results
Found 15 test results
Found 2 test results
Found 13 test results
Found 154 test results
Found 47 test results
Found 26 test results
Found 2 test results
Found 27 test results

Jenkins build is still unstable: sling-trunk-1.8 #3807

Posted by Apache Jenkins Server <je...@builds.apache.org>.
See <https://builds.apache.org/job/sling-trunk-1.8/changes>


Jenkins build is still unstable: sling-trunk-1.8 #3806

Posted by Apache Jenkins Server <je...@builds.apache.org>.
See <https://builds.apache.org/job/sling-trunk-1.8/changes>


Jenkins build is still unstable: sling-trunk-1.8 #3805

Posted by Apache Jenkins Server <je...@builds.apache.org>.
See <https://builds.apache.org/job/sling-trunk-1.8/changes>


Jenkins build is unstable: sling-trunk-1.8 #3804

Posted by Apache Jenkins Server <je...@builds.apache.org>.
See <https://builds.apache.org/job/sling-trunk-1.8/3804/changes>


Build failed in Jenkins: sling-trunk-1.8 #3803

Posted by Apache Jenkins Server <je...@builds.apache.org>.
See <https://builds.apache.org/job/sling-trunk-1.8/3803/changes>

Changes:

[olli] SLING-5973 HTMLSerializer not handling some unicode characters (emoji, etc.)

add test

[sseifert] cosmetic/formatting changes to make it more readable

------------------------------------------
[...truncated 68612 lines...]
[JENKINS] Archiving disabled
[JENKINS] Archiving disabled
[JENKINS] Archiving disabled
[JENKINS] Archiving disabled
[JENKINS] Archiving disabled
[JENKINS] Archiving disabled
[JENKINS] Archiving disabled
[JENKINS] Archiving disabled
[JENKINS] Archiving disabled
[JENKINS] Archiving disabled
[JENKINS] Archiving disabled
[JENKINS] Archiving disabled
[JENKINS] Archiving disabled
[JENKINS] Archiving disabled
[JENKINS] Archiving disabled
[JENKINS] Archiving disabled
[JENKINS] Archiving disabled
[JENKINS] Archiving disabled
[JENKINS] Archiving disabled
[JENKINS] Archiving disabled
[JENKINS] Archiving disabled
[JENKINS] Archiving disabled
[JENKINS] Archiving disabled
[JENKINS] Archiving disabled
[JENKINS] Archiving disabled
[JENKINS] Archiving disabled
[JENKINS] Archiving disabled
[JENKINS] Archiving disabled
[JENKINS] Archiving disabled[INFO] ------------------------------------------------------------------------
[INFO] Reactor Summary:
[INFO] 
[INFO] Apache Sling JAR Resource Bundle ................... SUCCESS [ 12.646 s]
[INFO] Apache Sling (Parent) .............................. SUCCESS [ 14.148 s]
[INFO] Apache Sling Tooling Support Install ............... SUCCESS [ 16.167 s]
[INFO] Apache Sling Provisioning Model .................... SUCCESS [ 35.329 s]
[INFO] Apache Sling Tooling Support Source ................ SUCCESS [  5.819 s]
[INFO] Apache Sling Testing Utilities ..................... SUCCESS [01:43 min]
[INFO] Apache Sling API ................................... SUCCESS [ 11.957 s]

[INFO] Apache Sling Resource Resolver ..................... SUCCESS [ 24.731 s]
[INFO] Apache Sling System Bundle Extension: Java Transaction API SUCCESS [  6.502 s]
[INFO] Apache Sling System Bundle Extension: XML APIs ..... SUCCESS [  4.035 s]
[INFO] Apache Sling System Bundle Extension: Activation API SUCCESS [  4.068 s]
[INFO] Apache Sling System Bundle Extension: WS APIs ...... SUCCESS [  3.672 s]
[INFO] Apache Sling Dynamic Class Loader Support .......... SUCCESS [ 17.310 s]
[INFO] Apache Sling Commons FileSystem ClassLoader ........ SUCCESS [  8.124 s]
[INFO] Apache Sling Commons Java Compiler ................. SUCCESS [  9.959 s]
[INFO] Apache Sling JSON Library .......................... SUCCESS [ 15.177 s]
[INFO] Apache Sling SLF4J Implementation (Logback) ........ SUCCESS [01:09 min]
[INFO] Apache Sling OSGi LogService Implementation ........ SUCCESS [  5.787 s]
[INFO] Apache Sling MIME type mapping support ............. SUCCESS [  5.932 s]
[INFO] Apache Sling Content Detection Support ............. SUCCESS [02:37 min]
[INFO] Apache Sling Commons OSGi support .................. SUCCESS [  8.759 s]
[INFO] Apache Sling Scheduler Support ..................... SUCCESS [ 11.786 s]
[INFO] Apache Sling Thread Dumper ......................... SUCCESS [  5.820 s]
[INFO] Apache Sling Thread Support ........................ SUCCESS [  9.306 s]
[INFO] Apache Sling Metrics ............................... SUCCESS [ 11.218 s]
[INFO] Apache Sling Authentication Service ................ SUCCESS [  8.332 s]
[INFO] Apache Sling Form Based Authentication Handler ..... SUCCESS [ 15.361 s]
[INFO] Apache Sling Engine Implementation ................. SUCCESS [ 22.296 s]
[INFO] Apache Sling Repository API Bundle ................. SUCCESS [  5.195 s]
[INFO] Apache Sling JCR Base Bundle ....................... SUCCESS [  7.446 s]
[INFO] Apache Sling Pax Exam Utilities .................... SUCCESS [02:39 min]
[INFO] Apache Sling Initial Content Loader ................ SUCCESS [04:19 min]
[INFO] Apache Sling Jackrabbit Embedded Repository ........ SUCCESS [ 12.876 s]
[INFO] Apache Sling Jackrabbit UserManager Support ........ SUCCESS [  6.815 s]
[INFO] Apache Sling Jackrabbit JSR-283 Access Control Manager Support SUCCESS [  4.634 s]
[INFO] Apache Sling Wrapper Bundle for the JCR API ........ SUCCESS [  5.801 s]
[INFO] Apache Sling JCR Resource Resolver ................. SUCCESS [01:47 min]
[INFO] Apache Sling Versioning Integration Tests .......... SUCCESS [01:16 min]
[INFO] Apache Sling JCR Repository Registration ........... SUCCESS [  5.737 s]
[INFO] Apache Sling Simple WebDAV Access to repositories .. SUCCESS [  6.940 s]
[INFO] Apache Sling DavEx Access to repositories .......... SUCCESS [  6.846 s]
[INFO] Apache Sling JCR WebConsole Bundle ................. SUCCESS [  3.849 s]
[INFO] Apache Sling JCR Oak Repository Server ............. SUCCESS [ 56.993 s]
[INFO] Apache Sling SlingRepository Integration Tests ..... SUCCESS [02:48 min]
[INFO] Apache Sling RepoInit Parser ....................... SUCCESS [ 10.492 s]
[INFO] Apache Sling RepoInit JCR module ................... SUCCESS [ 18.817 s]
[INFO] Apache Sling Servlet Resolver ...................... SUCCESS [  9.474 s]
[INFO] Apache Sling Default GET Servlets .................. SUCCESS [  9.763 s]
[INFO] Apache Sling Default POST Servlets ................. SUCCESS [ 12.599 s]
[INFO] Apache Sling Compat Servlets ....................... SUCCESS [  4.328 s]
[INFO] Apache Sling Scripting Implementation API .......... SUCCESS [  4.766 s]
[INFO] Apache Sling Scripting Core implementation ......... SUCCESS [01:52 min]
[INFO] Apache Sling Scripting JavaScript Support .......... SUCCESS [02:22 min]
[INFO] Apache Sling Scripting JSP Support ................. SUCCESS [ 22.007 s]
[INFO] Apache Sling JSP Tag Library ....................... SUCCESS [ 11.365 s]
[INFO] Apache Sling JSP Standard Tag Library .............. SUCCESS [  5.418 s]
[INFO] Apache Sling Scripting Sightly Compiler ............ SUCCESS [ 36.895 s]
[INFO] Apache Sling Scripting Sightly Java Compiler ....... SUCCESS [ 15.316 s]
[INFO] Apache Sling Scripting Sightly Engine .............. SUCCESS [ 20.574 s]
[INFO] Apache Sling Scripting Sightly JavaScript Use Provider SUCCESS [  5.578 s]
[INFO] Apache Sling Scripting Sightly Models Use Provider . SUCCESS [  5.357 s]
[INFO] Apache Sling Scripting Sightly Read-Eval-Print Loop Environment SUCCESS [  6.129 s]
[INFO] Apache Sling Scripting Sightly Integration Tests Content SUCCESS [  9.196 s]
[INFO] Apache Sling Launchpad Base ........................ SUCCESS [ 23.233 s]
[INFO] Apache Sling Subsystems Base Installer ............. SUCCESS [  7.682 s]
[INFO] Apache Sling Filesystem Resource Provider .......... SUCCESS [  4.475 s]
[INFO] Apache Sling Internationalization Support .......... FAILURE [02:05 min]
[INFO] Apache Sling Installer WebConsole Plugin ........... SKIPPED
[INFO] Apache Sling JCR Installer ......................... SKIPPED
[INFO] Apache Sling Launchpad Application Builder ......... SKIPPED
[INFO] Apache Sling Scripting Sightly Integration Tests ... SKIPPED
[INFO] Apache Sling Scripting Sightly Reactor ............. SKIPPED
[INFO] Apache Sling Adapter Manager Implementation ........ SKIPPED
[INFO] Apache Sling Bundle Resource Provider .............. SKIPPED
[INFO] Apache Sling Distributed Event Admin ............... SKIPPED
[INFO] Apache Sling Discovery API ......................... SKIPPED
[INFO] Apache Sling Discovery Commons ..................... SKIPPED
[INFO] Apache Sling Discovery Base ........................ SKIPPED
[INFO] Apache Sling Resource-Based Discovery Service ...... SKIPPED
[INFO] Apache Sling Oak-Based Discovery Service ........... SKIPPED
[INFO] Apache Sling Discovery Support Bundle .............. SKIPPED
[INFO] Apache Sling Discovery Standalone Implementation ... SKIPPED
[INFO] Apache Sling Event Support ......................... SKIPPED
[INFO] Apache Sling Feature Flags ......................... SKIPPED
[INFO] Apache Sling javax.activation bundle ............... SKIPPED
[INFO] Apache Sling Service User Mapper ................... SKIPPED
[INFO] Apache Sling Settings .............................. SKIPPED
[INFO] Apache Sling Web Console Branding .................. SKIPPED
[INFO] Apache Sling Web Console Security Provider ......... SKIPPED
[INFO] Apache Sling Explorer .............................. SKIPPED
[INFO] Apache Sling Health Check Core ..................... SKIPPED
[INFO] Apache Sling Health Check Samples .................. SKIPPED
[INFO] Apache Sling Health Check Support Components ....... SKIPPED
[INFO] Apache Sling Health Check Webconsole Plugin ........ SKIPPED
[INFO] Apache Sling Health Check JUnit Bridge ............. SKIPPED
[INFO] Apache Sling Health Check Annotations .............. SKIPPED
[INFO] Apache Sling Health Check Integration Tests ........ SKIPPED
[INFO] Apache Sling Health Check Reactor POM .............. SKIPPED
[INFO] Apache Sling Resource Access Security .............. SKIPPED
[INFO] Apache Sling Resource Access Security Integration Tests SKIPPED
[INFO] Apache Sling Models API ............................ SKIPPED
[INFO] Apache Sling Models Implementation ................. SKIPPED
[INFO] Apache Sling Models Integration Tests .............. SKIPPED
[INFO] Apache Sling XSS Protection Bundle ................. SKIPPED
[INFO] Apache Sling JUnit Core ............................ SKIPPED
[INFO] Apache Sling JUnit Tests Teleporter ................ SKIPPED
[INFO] Apache Sling Resource Builder ...................... SKIPPED
[INFO] Apache Sling Servlet Helpers ....................... SKIPPED
[INFO] Apache Sling RepoInit Integration Tests ............ SKIPPED
[INFO] Apache Sling RepoInit Reactor ...................... SKIPPED
[INFO] Apache Sling Test Tools ............................ SKIPPED
[INFO] Apache Sling Testing Clients ....................... SKIPPED
[INFO] Apache Sling Testing Hamcrest ...................... SKIPPED
[INFO] Apache Sling Server Setup Tools .................... SKIPPED
[INFO] Apache Sling Testing Rules ......................... SKIPPED
[INFO] Apache Sling JUnit Scriptable Tests Provider ....... SKIPPED
[INFO] Apache Sling JUnit Health Checks ................... SKIPPED
[INFO] Apache Sling JUnit Remote Tests Runners ............ SKIPPED
[INFO] Apache Sling JUnit Performance ..................... SKIPPED
[INFO] Apache Sling Testing Mock Log Configuration ........ SKIPPED
[INFO] Apache Sling Testing Resource Resolver Mock ........ SKIPPED
[INFO] Apache Sling Testing JCR Mock ...................... SKIPPED
[INFO] Apache Sling Testing OSGi Mock ..................... SKIPPED
[INFO] Apache Sling Testing Sling Mock .................... SKIPPED
[INFO] Apache Sling Testing Sling Mock Oak-based Resource Resolver SKIPPED
[INFO] Apache Sling Testing Mocks Modules Reactor ......... SKIPPED
[INFO] Apache Sling Testing - sample bundle with integration tests SKIPPED
[INFO] Apache Sling Testing - sample module with integration tests SKIPPED
[INFO] Apache Sling Testing PaxExam ....................... SKIPPED
[INFO] Apache Sling Testing Modules Reactor ............... SKIPPED
[INFO] Apache Sling Installer ............................. SKIPPED
[INFO] Apache Sling File Installer ........................ SKIPPED
[INFO] Apache Sling Installer Configuration Admin Support . SKIPPED
[INFO] Apache Sling Deployment Package Installer .......... SKIPPED
[INFO] Apache Sling Subsystems Installer .................. SKIPPED
[INFO] Apache Sling Installer Health Checks ............... SKIPPED
[INFO] Apache Sling Installer Integration Tests ........... SKIPPED
[INFO] Apache Sling Launchpad API ......................... SKIPPED
[INFO] Apache Sling Launchpad Installer ................... SKIPPED
[INFO] Apache Sling Launchpad Content ..................... SKIPPED
[INFO] Apache Sling Validation Framework API .............. SKIPPED
[INFO] Apache Sling Validation Framework Core Implementation SKIPPED
[INFO] Apache Sling Validation Framework Testing Services . SKIPPED
[INFO] Apache Sling Validation Framework Integration Tests  SKIPPED
[INFO] Apache Sling Validation Framework Examples ......... SKIPPED
[INFO] Apache Sling Validation Framework Builder .......... SKIPPED
[INFO] Apache Sling Models Validation Implementation ...... SKIPPED
[INFO] Apache Sling Launchpad Testing Services ............ SKIPPED
[INFO] Apache Sling Launchpad Testing Services WAR ........ SKIPPED
[INFO] Apache Sling Launchpad Testing Fragment Bundle ..... SKIPPED
[INFO] Apache Sling Launchpad Test Bundles ................ SKIPPED
[INFO] Apache Sling Integration Tests ..................... SKIPPED
[INFO] Apache Sling Launchpad Testing ..................... SKIPPED
[INFO] Apache Sling (Builder) ............................. SKIPPED
[INFO] ------------------------------------------------------------------------
[INFO] BUILD FAILURE
[INFO] ------------------------------------------------------------------------
[INFO] Total time: 39:26 min
[INFO] Finished at: 2016-08-18T10:39:19+00:00
[INFO] Final Memory: 253M/455M
[INFO] ------------------------------------------------------------------------
Waiting for Jenkins to finish collecting data
[ERROR] Failed to execute goal org.apache.maven.plugins:maven-failsafe-plugin:2.19.1:integration-test (default) on project org.apache.sling.i18n: Execution default of goal org.apache.maven.plugins:maven-failsafe-plugin:2.19.1:integration-test failed: The forked VM terminated without properly saying goodbye. VM crash or System.exit called?
[ERROR] Command was /bin/sh -c cd <https://builds.apache.org/job/sling-trunk-1.8/ws/trunk/bundles/extensions/i18n> && /usr/local/asfpackages/java/jdk1.8.0_102/jre/bin/java -jar <https://builds.apache.org/job/sling-trunk-1.8/ws/trunk/bundles/extensions/i18n/target/surefire/surefirebooter8778524750278725970.jar> <https://builds.apache.org/job/sling-trunk-1.8/ws/trunk/bundles/extensions/i18n/target/surefire/surefire8016561920596962360tmp> <https://builds.apache.org/job/sling-trunk-1.8/ws/trunk/bundles/extensions/i18n/target/surefire/surefire_14646779098652131407tmp>
[ERROR] -> [Help 1]
[ERROR] 
[ERROR] To see the full stack trace of the errors, re-run Maven with the -e switch.
[ERROR] Re-run Maven using the -X switch to enable full debug logging.
[ERROR] 
[ERROR] For more information about the errors and possible solutions, please read the following articles:
[ERROR] [Help 1] http://cwiki.apache.org/confluence/display/MAVEN/PluginExecutionException
[ERROR] 
[ERROR] After correcting the problems, you can resume the build with the command
[ERROR]   mvn <goals> -rf :org.apache.sling.i18n
channel stopped
Found 95 test results
Found 45 test results
Found 8 test results
Found 4 test results
Found 2 test results
Found 17 test results
Found 4 test results
Found 94 test results
Found 44 test results
Found 10 test results
Found 21 test results
Found 9 test results
Found 36 test results
Found 42 test results
Found 22 test results
Found 10 test results
Found 95 test results
Found 27 test results
Found 3 test results
Found 9 test results
Found 96 test results
Found 8 test results
Found 17 test results
Found 45 test results
Found 34 test results
Found 9 test results
Found 94 test results
Found 75 test results
Found 10 test results
Found 49 test results
Found 35 test results
Found 210 test results
Found 24 test results
Found 81 test results
Found 27 test results
Found 24 test results
Found 13 test results
Found 2 test results
Found 28 test results
Found 44 test results
Found 92 test results
Found 2 test results

Build failed in Jenkins: sling-trunk-1.8 #3802

Posted by Apache Jenkins Server <je...@builds.apache.org>.
See <https://builds.apache.org/job/sling-trunk-1.8/3802/changes>

Changes:

[tmaret] Revert: SLING-5906 - Allow to filter resource by properties

* Update org.apache.jackrabbit.vault dependency in order to include JCRVLT-120
* Allow to configure a Package Property Filter, pass the configured filters to the vlt WorkspaceFilter

[olli] use org.apache.sling.testing.paxexam 0.0.2

------------------------------------------
[...truncated 129370 lines...]
[JENKINS] Archiving disabled
[JENKINS] Archiving disabled
[JENKINS] Archiving disabled
[JENKINS] Archiving disabled
[JENKINS] Archiving disabled
[JENKINS] Archiving disabled
[JENKINS] Archiving disabled
[JENKINS] Archiving disabled
[JENKINS] Archiving disabled
[JENKINS] Archiving disabled
[JENKINS] Archiving disabled
[JENKINS] Archiving disabled
[JENKINS] Archiving disabled
[JENKINS] Archiving disabled
[JENKINS] Archiving disabled
[JENKINS] Archiving disabled
[JENKINS] Archiving disabled[INFO] ------------------------------------------------------------------------
[INFO] Reactor Summary:
[INFO] 
[INFO] Apache Sling JAR Resource Bundle ................... SUCCESS [ 10.589 s]
[INFO] Apache Sling (Parent) .............................. SUCCESS [ 12.208 s]
[INFO] Apache Sling Tooling Support Install ............... SUCCESS [ 16.131 s]
[INFO] Apache Sling Provisioning Model .................... SUCCESS [ 22.345 s]
[INFO] Apache Sling Tooling Support Source ................ SUCCESS [  9.912 s]
[INFO] Apache Sling Testing Utilities ..................... SUCCESS [ 23.929 s]
[INFO] Apache Sling API ................................... SUCCESS [ 27.993 s]
[INFO] Apache Sling Resource Resolver ..................... SUCCESS [ 17.524 s]
[INFO] Apache Sling System Bundle Extension: Java Transaction API SUCCESS [  7.971 s]
[INFO] Apache Sling System Bundle Extension: XML APIs ..... SUCCESS [  7.232 s]
[INFO] Apache Sling System Bundle Extension: Activation API SUCCESS [  6.666 s]
[INFO] Apache Sling System Bundle Extension: WS APIs ...... SUCCESS [  9.069 s]
[INFO] Apache Sling Dynamic Class Loader Support .......... SUCCESS [ 13.854 s]
[INFO] Apache Sling Commons FileSystem ClassLoader ........ SUCCESS [  8.158 s]
[INFO] Apache Sling Commons Java Compiler ................. SUCCESS [  9.316 s]
[INFO] Apache Sling JSON Library .......................... SUCCESS [ 13.947 s]
[INFO] Apache Sling SLF4J Implementation (Logback) ........ SUCCESS [ 40.366 s]
[INFO] Apache Sling OSGi LogService Implementation ........ SUCCESS [  8.652 s]
[INFO] Apache Sling MIME type mapping support ............. SUCCESS [  9.623 s]
[INFO] Apache Sling Content Detection Support ............. SUCCESS [ 37.836 s]
[INFO] Apache Sling Commons OSGi support .................. SUCCESS [ 12.024 s]
[INFO] Apache Sling Scheduler Support ..................... SUCCESS [ 13.557 s]
[INFO] Apache Sling Thread Dumper ......................... SUCCESS [  4.474 s]
[INFO] Apache Sling Thread Support ........................ SUCCESS [ 12.696 s]
[INFO] Apache Sling Metrics ............................... SUCCESS [  7.946 s]
[INFO] Apache Sling Authentication Service ................ SUCCESS [ 12.910 s]
[INFO] Apache Sling Form Based Authentication Handler ..... SUCCESS [ 13.018 s]
[INFO] Apache Sling Engine Implementation ................. SUCCESS [ 14.337 s]
[INFO] Apache Sling Repository API Bundle ................. SUCCESS [  7.914 s]
[INFO] Apache Sling JCR Base Bundle ....................... SUCCESS [  7.242 s]
[INFO] Apache Sling Pax Exam Utilities .................... SUCCESS [ 33.860 s]
[INFO] Apache Sling Initial Content Loader ................ SUCCESS [01:00 min]
[INFO] Apache Sling Jackrabbit Embedded Repository ........ SUCCESS [ 13.820 s]
[INFO] Apache Sling Jackrabbit UserManager Support ........ SUCCESS [  8.720 s]
[INFO] Apache Sling Jackrabbit JSR-283 Access Control Manager Support SUCCESS [  6.667 s]
[INFO] Apache Sling Wrapper Bundle for the JCR API ........ SUCCESS [  7.451 s]
[INFO] Apache Sling JCR Resource Resolver ................. SUCCESS [ 36.008 s]
[INFO] Apache Sling Versioning Integration Tests .......... SUCCESS [ 11.863 s]
[INFO] Apache Sling JCR Repository Registration ........... SUCCESS [ 11.066 s]
[INFO] Apache Sling Simple WebDAV Access to repositories .. SUCCESS [01:10 min]
[INFO] Apache Sling DavEx Access to repositories .......... SUCCESS [  8.459 s]
[INFO] Apache Sling JCR WebConsole Bundle ................. SUCCESS [  7.577 s]
[INFO] Apache Sling JCR Oak Repository Server ............. SUCCESS [ 29.744 s]
[INFO] Apache Sling SlingRepository Integration Tests ..... SUCCESS [ 31.736 s]
[INFO] Apache Sling RepoInit Parser ....................... SUCCESS [  9.104 s]
[INFO] Apache Sling RepoInit JCR module ................... SUCCESS [ 18.502 s]
[INFO] Apache Sling Servlet Resolver ...................... SUCCESS [  8.939 s]
[INFO] Apache Sling Default GET Servlets .................. SUCCESS [  7.939 s]
[INFO] Apache Sling Default POST Servlets ................. SUCCESS [ 18.970 s]
[INFO] Apache Sling Compat Servlets ....................... SUCCESS [  6.612 s]
[INFO] Apache Sling Scripting Implementation API .......... SUCCESS [  5.171 s]
[INFO] Apache Sling Scripting Core implementation ......... SUCCESS [ 20.265 s]
[INFO] Apache Sling Scripting JavaScript Support .......... SUCCESS [ 18.100 s]
[INFO] Apache Sling Scripting JSP Support ................. SUCCESS [ 10.636 s]
[INFO] Apache Sling JSP Tag Library ....................... SUCCESS [ 10.796 s]
[INFO] Apache Sling JSP Standard Tag Library .............. SUCCESS [  4.763 s]
[INFO] Apache Sling Scripting Sightly Compiler ............ SUCCESS [ 25.981 s]
[INFO] Apache Sling Scripting Sightly Java Compiler ....... SUCCESS [ 14.259 s]
[INFO] Apache Sling Scripting Sightly Engine .............. SUCCESS [ 14.441 s]
[INFO] Apache Sling Scripting Sightly JavaScript Use Provider SUCCESS [  6.701 s]
[INFO] Apache Sling Scripting Sightly Models Use Provider . SUCCESS [  5.746 s]
[INFO] Apache Sling Scripting Sightly Read-Eval-Print Loop Environment SUCCESS [  6.063 s]
[INFO] Apache Sling Scripting Sightly Integration Tests Content SUCCESS [  7.215 s]
[INFO] Apache Sling Launchpad Base ........................ SUCCESS [ 21.408 s]
[INFO] Apache Sling Subsystems Base Installer ............. SUCCESS [  7.609 s]
[INFO] Apache Sling Filesystem Resource Provider .......... SUCCESS [  6.367 s]
[INFO] Apache Sling Internationalization Support .......... SUCCESS [01:02 min]
[INFO] Apache Sling Installer WebConsole Plugin ........... SUCCESS [  6.822 s]
[INFO] Apache Sling JCR Installer ......................... SUCCESS [02:02 min]
[INFO] Apache Sling Launchpad Application Builder ......... SUCCESS [ 39.551 s]
[INFO] Apache Sling Scripting Sightly Integration Tests ... SUCCESS [01:56 min]
[INFO] Apache Sling Scripting Sightly Reactor ............. SUCCESS [  3.887 s]
[INFO] Apache Sling Adapter Manager Implementation ........ SUCCESS [  7.745 s]
[INFO] Apache Sling Bundle Resource Provider .............. SUCCESS [  5.965 s]
[INFO] Apache Sling Distributed Event Admin ............... SUCCESS [  7.581 s]
[INFO] Apache Sling Discovery API ......................... SUCCESS [  5.714 s]
[INFO] Apache Sling Discovery Commons ..................... SUCCESS [ 50.484 s]
[INFO] Apache Sling Discovery Base ........................ SUCCESS [ 45.900 s]
[INFO] Apache Sling Resource-Based Discovery Service ...... SUCCESS [02:37 min]
[INFO] Apache Sling Oak-Based Discovery Service ........... SUCCESS [02:32 min]
[INFO] Apache Sling Discovery Support Bundle .............. SUCCESS [  7.320 s]
[INFO] Apache Sling Discovery Standalone Implementation ... SUCCESS [  6.144 s]
[INFO] Apache Sling Event Support ......................... SUCCESS [07:20 min]
[INFO] Apache Sling Feature Flags ......................... FAILURE [  8.178 s]
[INFO] Apache Sling javax.activation bundle ............... SKIPPED
[INFO] Apache Sling Service User Mapper ................... SKIPPED
[INFO] Apache Sling Settings .............................. SKIPPED
[INFO] Apache Sling Web Console Branding .................. SKIPPED
[INFO] Apache Sling Web Console Security Provider ......... SKIPPED
[INFO] Apache Sling Explorer .............................. SKIPPED
[INFO] Apache Sling Health Check Core ..................... SKIPPED
[INFO] Apache Sling Health Check Samples .................. SKIPPED
[INFO] Apache Sling Health Check Support Components ....... SKIPPED
[INFO] Apache Sling Health Check Webconsole Plugin ........ SKIPPED
[INFO] Apache Sling Health Check JUnit Bridge ............. SKIPPED
[INFO] Apache Sling Health Check Annotations .............. SKIPPED
[INFO] Apache Sling Health Check Integration Tests ........ SKIPPED
[INFO] Apache Sling Health Check Reactor POM .............. SKIPPED
[INFO] Apache Sling Resource Access Security .............. SKIPPED
[INFO] Apache Sling Resource Access Security Integration Tests SKIPPED
[INFO] Apache Sling Models API ............................ SKIPPED
[INFO] Apache Sling Models Implementation ................. SKIPPED
[INFO] Apache Sling Models Integration Tests .............. SKIPPED
[INFO] Apache Sling XSS Protection Bundle ................. SKIPPED
[INFO] Apache Sling JUnit Core ............................ SKIPPED
[INFO] Apache Sling JUnit Tests Teleporter ................ SKIPPED
[INFO] Apache Sling Resource Builder ...................... SKIPPED
[INFO] Apache Sling Servlet Helpers ....................... SKIPPED
[INFO] Apache Sling RepoInit Integration Tests ............ SKIPPED
[INFO] Apache Sling RepoInit Reactor ...................... SKIPPED
[INFO] Apache Sling Test Tools ............................ SKIPPED
[INFO] Apache Sling Testing Clients ....................... SKIPPED
[INFO] Apache Sling Testing Hamcrest ...................... SKIPPED
[INFO] Apache Sling Server Setup Tools .................... SKIPPED
[INFO] Apache Sling Testing Rules ......................... SKIPPED
[INFO] Apache Sling JUnit Scriptable Tests Provider ....... SKIPPED
[INFO] Apache Sling JUnit Health Checks ................... SKIPPED
[INFO] Apache Sling JUnit Remote Tests Runners ............ SKIPPED
[INFO] Apache Sling JUnit Performance ..................... SKIPPED
[INFO] Apache Sling Testing Mock Log Configuration ........ SKIPPED
[INFO] Apache Sling Testing Resource Resolver Mock ........ SKIPPED
[INFO] Apache Sling Testing JCR Mock ...................... SKIPPED
[INFO] Apache Sling Testing OSGi Mock ..................... SKIPPED
[INFO] Apache Sling Testing Sling Mock .................... SKIPPED
[INFO] Apache Sling Testing Sling Mock Oak-based Resource Resolver SKIPPED
[INFO] Apache Sling Testing Mocks Modules Reactor ......... SKIPPED
[INFO] Apache Sling Testing - sample bundle with integration tests SKIPPED
[INFO] Apache Sling Testing - sample module with integration tests SKIPPED
[INFO] Apache Sling Testing PaxExam ....................... SKIPPED
[INFO] Apache Sling Testing Modules Reactor ............... SKIPPED
[INFO] Apache Sling Installer ............................. SKIPPED
[INFO] Apache Sling File Installer ........................ SKIPPED
[INFO] Apache Sling Installer Configuration Admin Support . SKIPPED
[INFO] Apache Sling Deployment Package Installer .......... SKIPPED
[INFO] Apache Sling Subsystems Installer .................. SKIPPED
[INFO] Apache Sling Installer Health Checks ............... SKIPPED
[INFO] Apache Sling Installer Integration Tests ........... SKIPPED
[INFO] Apache Sling Launchpad API ......................... SKIPPED
[INFO] Apache Sling Launchpad Installer ................... SKIPPED
[INFO] Apache Sling Launchpad Content ..................... SKIPPED
[INFO] Apache Sling Validation Framework API .............. SKIPPED
[INFO] Apache Sling Validation Framework Core Implementation SKIPPED
[INFO] Apache Sling Validation Framework Testing Services . SKIPPED
[INFO] Apache Sling Validation Framework Integration Tests  SKIPPED
[INFO] Apache Sling Validation Framework Examples ......... SKIPPED
[INFO] Apache Sling Validation Framework Builder .......... SKIPPED
[INFO] Apache Sling Models Validation Implementation ...... SKIPPED
[INFO] Apache Sling Launchpad Testing Services ............ SKIPPED
[INFO] Apache Sling Launchpad Testing Services WAR ........ SKIPPED
[INFO] Apache Sling Launchpad Testing Fragment Bundle ..... SKIPPED
[INFO] Apache Sling Launchpad Test Bundles ................ SKIPPED
[INFO] Apache Sling Integration Tests ..................... SKIPPED
[INFO] Apache Sling Launchpad Testing ..................... SKIPPED
[INFO] Apache Sling (Builder) ............................. SKIPPED
[INFO] ------------------------------------------------------------------------
[INFO] BUILD FAILURE
[INFO] ------------------------------------------------------------------------
[INFO] Total time: 46:13 min
[INFO] Finished at: 2016-08-18T09:32:58+00:00

[INFO] Final Memory: 366M/425M
[INFO] ------------------------------------------------------------------------
Waiting for Jenkins to finish collecting data
[ERROR] Failed to execute goal org.apache.maven.plugins:maven-source-plugin:3.0.0:jar (attach-sources) on project org.apache.sling.featureflags: Error creating source archive: Problem creating jar: Execution exception: Java heap space -> [Help 1]
[ERROR] 
[ERROR] To see the full stack trace of the errors, re-run Maven with the -e switch.
[ERROR] Re-run Maven using the -X switch to enable full debug logging.
[ERROR] 
[ERROR] For more information about the errors and possible solutions, please read the following articles:
[ERROR] [Help 1] http://cwiki.apache.org/confluence/display/MAVEN/MojoExecutionException
[ERROR] 
[ERROR] After correcting the problems, you can resume the build with the command
[ERROR]   mvn <goals> -rf :org.apache.sling.featureflags
channel stopped
Found 18 test results
Found 95 test results
Found 45 test results
Found 8 test results
Found 4 test results
Found 2 test results
Found 17 test results
Found 4 test results
Found 94 test results
Found 44 test results
Found 10 test results
Found 21 test results
Found 9 test results
Found 36 test results
Found 42 test results
Found 22 test results
Found 10 test results
Found 31 test results
Found 83 test results
Found 50 test results
Found 30 test results
Found 5 test results
Found 95 test results
Found 77 test results
Found 4 test results
Found 31 test results
Found failed test junit/org.apache.sling.i18n.it/ResourceBundleProviderIT
Found failed test junit/org.apache.sling.i18n.it/ResourceBundleProviderIT/testChangesDetection
Found failed test junit/org.apache.sling.i18n.it/ResourceBundleProviderIT/test_dummy
Found 3 test results
Found 38 test results
Found 9 test results
Found 96 test results
Found 8 test results
Found 17 test results
Found 45 test results
Found 34 test results
Found 9 test results
Found 94 test results
Found 3 test results
Found 75 test results
Found 10 test results
Found 49 test results
Found 35 test results
Found 210 test results
Found 24 test results
Found 81 test results
Found 27 test results
Found 24 test results
Found 13 test results
Found 2 test results
Found 392 test results
Found 28 test results
Found 44 test results
Found 92 test results
Found 2 test results

Build failed in Jenkins: sling-trunk-1.8 #3801

Posted by Apache Jenkins Server <je...@builds.apache.org>.
See <https://builds.apache.org/job/sling-trunk-1.8/3801/>

------------------------------------------
[...truncated 70265 lines...]
[JENKINS] Archiving disabled
[JENKINS] Archiving disabled
[JENKINS] Archiving disabled
[JENKINS] Archiving disabled
[JENKINS] Archiving disabled
[JENKINS] Archiving disabled
[JENKINS] Archiving disabled
[JENKINS] Archiving disabled
[JENKINS] Archiving disabled
[JENKINS] Archiving disabled
[JENKINS] Archiving disabled
[JENKINS] Archiving disabled
[JENKINS] Archiving disabled
[JENKINS] Archiving disabled
[JENKINS] Archiving disabled
[JENKINS] Archiving disabled
[JENKINS] Archiving disabled
[JENKINS] Archiving disabled
[JENKINS] Archiving disabled
[JENKINS] Archiving disabled
[JENKINS] Archiving disabled
[JENKINS] Archiving disabled
[JENKINS] Archiving disabled
[JENKINS] Archiving disabled
[JENKINS] Archiving disabled
[JENKINS] Archiving disabled
[JENKINS] Archiving disabled
[JENKINS] Archiving disabled[INFO] ------------------------------------------------------------------------
[INFO] Reactor Summary:
[INFO] 
[INFO] Apache Sling JAR Resource Bundle ................... SUCCESS [  9.459 s]
[INFO] Apache Sling (Parent) .............................. SUCCESS [ 13.421 s]
[INFO] Apache Sling Tooling Support Install ............... SUCCESS [ 13.459 s]
[INFO] Apache Sling Provisioning Model .................... SUCCESS [ 33.658 s]
[INFO] Apache Sling Tooling Support Source ................ SUCCESS [  5.818 s]
[INFO] Apache Sling Testing Utilities ..................... SUCCESS [01:37 min]
[INFO] Apache Sling API ................................... SUCCESS [ 15.423 s]
[INFO] Apache Sling Resource Resolver ..................... SUCCESS [ 19.677 s]
[INFO] Apache Sling System Bundle Extension: Java Transaction API SUCCESS [  5.738 s]
[INFO] Apache Sling System Bundle Extension: XML APIs ..... SUCCESS [  5.234 s]
[INFO] Apache Sling System Bundle Extension: Activation API SUCCESS [  4.708 s]
[INFO] Apache Sling System Bundle Extension: WS APIs ...... SUCCESS [  4.968 s]
[INFO] Apache Sling Dynamic Class Loader Support .......... SUCCESS [ 18.597 s]
[INFO] Apache Sling Commons FileSystem ClassLoader ........ SUCCESS [  8.429 s]
[INFO] Apache Sling Commons Java Compiler ................. SUCCESS [  9.727 s]
[INFO] Apache Sling JSON Library .......................... SUCCESS [ 14.903 s]
[INFO] Apache Sling SLF4J Implementation (Logback) ........ SUCCESS [01:07 min]
[INFO] Apache Sling OSGi LogService Implementation ........ SUCCESS [  5.714 s]
[INFO] Apache Sling MIME type mapping support ............. SUCCESS [  9.678 s]
[INFO] Apache Sling Content Detection Support ............. SUCCESS [02:50 min]
[INFO] Apache Sling Commons OSGi support .................. SUCCESS [ 12.431 s]
[INFO] Apache Sling Scheduler Support ..................... SUCCESS [ 13.151 s]
[INFO] Apache Sling Thread Dumper ......................... SUCCESS [  6.526 s]
[INFO] Apache Sling Thread Support ........................ SUCCESS [  9.982 s]
[INFO] Apache Sling Metrics ............................... SUCCESS [ 10.033 s]
[INFO] Apache Sling Authentication Service ................ SUCCESS [ 10.029 s]
[INFO] Apache Sling Form Based Authentication Handler ..... SUCCESS [ 16.261 s]
[INFO] Apache Sling Engine Implementation ................. SUCCESS [ 22.309 s]
[INFO] Apache Sling Repository API Bundle ................. SUCCESS [  7.324 s]
[INFO] Apache Sling JCR Base Bundle ....................... SUCCESS [  7.919 s]
[INFO] Apache Sling Pax Exam Utilities .................... SUCCESS [02:18 min]
[INFO] Apache Sling Initial Content Loader ................ SUCCESS [04:07 min]
[INFO] Apache Sling Jackrabbit Embedded Repository ........ SUCCESS [ 15.615 s]
[INFO] Apache Sling Jackrabbit UserManager Support ........ SUCCESS [  7.454 s]
[INFO] Apache Sling Jackrabbit JSR-283 Access Control Manager Support SUCCESS [  6.465 s]
[INFO] Apache Sling Wrapper Bundle for the JCR API ........ SUCCESS [  4.570 s]
[INFO] Apache Sling JCR Resource Resolver ................. SUCCESS [02:12 min]
[INFO] Apache Sling Versioning Integration Tests .......... SUCCESS [01:20 min]
[INFO] Apache Sling JCR Repository Registration ........... SUCCESS [  7.088 s]
[INFO] Apache Sling Simple WebDAV Access to repositories .. SUCCESS [  7.203 s]
[INFO] Apache Sling DavEx Access to repositories .......... SUCCESS [  8.807 s]
[INFO] Apache Sling JCR WebConsole Bundle ................. SUCCESS [  3.938 s]
[INFO] Apache Sling Testing PaxExam ....................... SUCCESS [ 37.850 s]
[INFO] Apache Sling JCR Oak Repository Server ............. SUCCESS [ 45.960 s]
[INFO] Apache Sling SlingRepository Integration Tests ..... SUCCESS [02:54 min]
[INFO] Apache Sling RepoInit Parser ....................... SUCCESS [ 11.965 s]
[INFO] Apache Sling RepoInit JCR module ................... SUCCESS [ 16.577 s]
[INFO] Apache Sling Servlet Resolver ...................... SUCCESS [  8.269 s]
[INFO] Apache Sling Default GET Servlets .................. SUCCESS [  7.455 s]
[INFO] Apache Sling Default POST Servlets ................. SUCCESS [ 12.663 s]
[INFO] Apache Sling Compat Servlets ....................... SUCCESS [  4.941 s]
[INFO] Apache Sling Scripting Implementation API .......... SUCCESS [  5.175 s]
[INFO] Apache Sling Scripting Core implementation ......... SUCCESS [ 44.474 s]
[INFO] Apache Sling Scripting JavaScript Support .......... SUCCESS [01:26 min]
[INFO] Apache Sling Scripting JSP Support ................. SUCCESS [ 17.973 s]
[INFO] Apache Sling JSP Tag Library ....................... SUCCESS [ 15.608 s]
[INFO] Apache Sling JSP Standard Tag Library .............. SUCCESS [  4.487 s]
[INFO] Apache Sling Scripting Sightly Compiler ............ SUCCESS [ 35.026 s]
[INFO] Apache Sling Scripting Sightly Java Compiler ....... SUCCESS [ 13.720 s]
[INFO] Apache Sling Scripting Sightly Engine .............. SUCCESS [ 18.703 s]
[INFO] Apache Sling Scripting Sightly JavaScript Use Provider SUCCESS [  5.391 s]
[INFO] Apache Sling Scripting Sightly Models Use Provider . SUCCESS [  5.190 s]
[INFO] Apache Sling Scripting Sightly Read-Eval-Print Loop Environment SUCCESS [  5.129 s]
[INFO] Apache Sling Scripting Sightly Integration Tests Content SUCCESS [  9.674 s]
[INFO] Apache Sling Launchpad Base ........................ SUCCESS [ 23.607 s]
[INFO] Apache Sling Subsystems Base Installer ............. SUCCESS [  7.034 s]
[INFO] Apache Sling Filesystem Resource Provider .......... SUCCESS [  7.209 s]
[INFO] Apache Sling Internationalization Support .......... FAILURE [02:28 min]
[INFO] Apache Sling Installer WebConsole Plugin ........... SKIPPED
[INFO] Apache Sling JCR Installer ......................... SKIPPED
[INFO] Apache Sling Launchpad Application Builder ......... SKIPPED
[INFO] Apache Sling Scripting Sightly Integration Tests ... SKIPPED
[INFO] Apache Sling Scripting Sightly Reactor ............. SKIPPED
[INFO] Apache Sling Adapter Manager Implementation ........ SKIPPED
[INFO] Apache Sling Bundle Resource Provider .............. SKIPPED
[INFO] Apache Sling Distributed Event Admin ............... SKIPPED
[INFO] Apache Sling Discovery API ......................... SKIPPED
[INFO] Apache Sling Discovery Commons ..................... SKIPPED
[INFO] Apache Sling Discovery Base ........................ SKIPPED
[INFO] Apache Sling Resource-Based Discovery Service ...... SKIPPED
[INFO] Apache Sling Oak-Based Discovery Service ........... SKIPPED
[INFO] Apache Sling Discovery Support Bundle .............. SKIPPED
[INFO] Apache Sling Discovery Standalone Implementation ... SKIPPED
[INFO] Apache Sling Event Support ......................... SKIPPED
[INFO] Apache Sling Feature Flags ......................... SKIPPED
[INFO] Apache Sling javax.activation bundle ............... SKIPPED
[INFO] Apache Sling Service User Mapper ................... SKIPPED
[INFO] Apache Sling Settings .............................. SKIPPED
[INFO] Apache Sling Web Console Branding .................. SKIPPED
[INFO] Apache Sling Web Console Security Provider ......... SKIPPED
[INFO] Apache Sling Explorer .............................. SKIPPED
[INFO] Apache Sling Health Check Core ..................... SKIPPED
[INFO] Apache Sling Health Check Samples .................. SKIPPED
[INFO] Apache Sling Health Check Support Components ....... SKIPPED
[INFO] Apache Sling Health Check Webconsole Plugin ........ SKIPPED
[INFO] Apache Sling Health Check JUnit Bridge ............. SKIPPED
[INFO] Apache Sling Health Check Annotations .............. SKIPPED
[INFO] Apache Sling Health Check Integration Tests ........ SKIPPED
[INFO] Apache Sling Health Check Reactor POM .............. SKIPPED
[INFO] Apache Sling Resource Access Security .............. SKIPPED
[INFO] Apache Sling Resource Access Security Integration Tests SKIPPED
[INFO] Apache Sling Models API ............................ SKIPPED
[INFO] Apache Sling Models Implementation ................. SKIPPED
[INFO] Apache Sling Models Integration Tests .............. SKIPPED
[INFO] Apache Sling XSS Protection Bundle ................. SKIPPED
[INFO] Apache Sling JUnit Core ............................ SKIPPED
[INFO] Apache Sling JUnit Tests Teleporter ................ SKIPPED
[INFO] Apache Sling Resource Builder ...................... SKIPPED
[INFO] Apache Sling Servlet Helpers ....................... SKIPPED
[INFO] Apache Sling RepoInit Integration Tests ............ SKIPPED
[INFO] Apache Sling RepoInit Reactor ...................... SKIPPED
[INFO] Apache Sling Test Tools ............................ SKIPPED
[INFO] Apache Sling Testing Clients ....................... SKIPPED
[INFO] Apache Sling Testing Hamcrest ...................... SKIPPED
[INFO] Apache Sling Server Setup Tools .................... SKIPPED
[INFO] Apache Sling Testing Rules ......................... SKIPPED
[INFO] Apache Sling JUnit Scriptable Tests Provider ....... SKIPPED
[INFO] Apache Sling JUnit Health Checks ................... SKIPPED
[INFO] Apache Sling JUnit Remote Tests Runners ............ SKIPPED
[INFO] Apache Sling JUnit Performance ..................... SKIPPED
[INFO] Apache Sling Testing Mock Log Configuration ........ SKIPPED
[INFO] Apache Sling Testing Resource Resolver Mock ........ SKIPPED
[INFO] Apache Sling Testing JCR Mock ...................... SKIPPED
[INFO] Apache Sling Testing OSGi Mock ..................... SKIPPED
[INFO] Apache Sling Testing Sling Mock .................... SKIPPED
[INFO] Apache Sling Testing Sling Mock Oak-based Resource Resolver SKIPPED
[INFO] Apache Sling Testing Mocks Modules Reactor ......... SKIPPED
[INFO] Apache Sling Testing - sample bundle with integration tests SKIPPED
[INFO] Apache Sling Testing - sample module with integration tests SKIPPED
[INFO] Apache Sling Testing Modules Reactor ............... SKIPPED
[INFO] Apache Sling Installer ............................. SKIPPED
[INFO] Apache Sling File Installer ........................ SKIPPED
[INFO] Apache Sling Installer Configuration Admin Support . SKIPPED
[INFO] Apache Sling Deployment Package Installer .......... SKIPPED
[INFO] Apache Sling Subsystems Installer .................. SKIPPED
[INFO] Apache Sling Installer Health Checks ............... SKIPPED
[INFO] Apache Sling Installer Integration Tests ........... SKIPPED
[INFO] Apache Sling Launchpad API ......................... SKIPPED
[INFO] Apache Sling Launchpad Installer ................... SKIPPED
[INFO] Apache Sling Launchpad Content ..................... SKIPPED
[INFO] Apache Sling Validation Framework API .............. SKIPPED
[INFO] Apache Sling Validation Framework Core Implementation SKIPPED
[INFO] Apache Sling Validation Framework Testing Services . SKIPPED
[INFO] Apache Sling Validation Framework Integration Tests  SKIPPED
[INFO] Apache Sling Validation Framework Examples ......... SKIPPED
[INFO] Apache Sling Validation Framework Builder .......... SKIPPED
[INFO] Apache Sling Models Validation Implementation ...... SKIPPED
[INFO] Apache Sling Launchpad Testing Services ............ SKIPPED
[INFO] Apache Sling Launchpad Testing Services WAR ........ SKIPPED
[INFO] Apache Sling Launchpad Testing Fragment Bundle ..... SKIPPED
[INFO] Apache Sling Launchpad Test Bundles ................ SKIPPED
[INFO] Apache Sling Integration Tests ..................... SKIPPED
[INFO] Apache Sling Launchpad Testing ..................... SKIPPED
[INFO] Apache Sling (Builder) ............................. SKIPPED
[INFO] ------------------------------------------------------------------------
[INFO] BUILD FAILURE
[INFO] ------------------------------------------------------------------------
[INFO] Total time: 38:07 min
[INFO] Finished at: 2016-08-18T07:36:24+00:00

[INFO] Final Memory: 249M/424M
[INFO] ------------------------------------------------------------------------
Waiting for Jenkins to finish collecting data
[ERROR] Failed to execute goal org.apache.maven.plugins:maven-failsafe-plugin:2.19.1:integration-test (default) on project org.apache.sling.i18n: Execution default of goal org.apache.maven.plugins:maven-failsafe-plugin:2.19.1:integration-test failed: The forked VM terminated without properly saying goodbye. VM crash or System.exit called?
[ERROR] Command was /bin/sh -c cd <https://builds.apache.org/job/sling-trunk-1.8/ws/trunk/bundles/extensions/i18n> && /usr/local/asfpackages/java/jdk1.8.0_102/jre/bin/java -jar <https://builds.apache.org/job/sling-trunk-1.8/ws/trunk/bundles/extensions/i18n/target/surefire/surefirebooter5249183041654916531.jar> <https://builds.apache.org/job/sling-trunk-1.8/ws/trunk/bundles/extensions/i18n/target/surefire/surefire3884387048847778688tmp> <https://builds.apache.org/job/sling-trunk-1.8/ws/trunk/bundles/extensions/i18n/target/surefire/surefire_13978908652981353943tmp>
[ERROR] -> [Help 1]
[ERROR] 
[ERROR] To see the full stack trace of the errors, re-run Maven with the -e switch.
[ERROR] Re-run Maven using the -X switch to enable full debug logging.
[ERROR] 
[ERROR] For more information about the errors and possible solutions, please read the following articles:
[ERROR] [Help 1] http://cwiki.apache.org/confluence/display/MAVEN/PluginExecutionException
[ERROR] 
[ERROR] After correcting the problems, you can resume the build with the command
[ERROR]   mvn <goals> -rf :org.apache.sling.i18n
channel stopped
Found 95 test results
Found 45 test results
Found 8 test results
Found 4 test results
Found 2 test results
Found 17 test results
Found 4 test results
Found 94 test results
Found 44 test results
Found 10 test results
Found 21 test results
Found 9 test results
Found 36 test results
Found 42 test results
Found 22 test results
Found 10 test results
Found 95 test results
Found 27 test results
Found 3 test results
Found 9 test results
Found 96 test results
Found 8 test results
Found 17 test results
Found 45 test results
Found 34 test results
Found 9 test results
Found 94 test results
Found 75 test results
Found 10 test results
Found 49 test results
Found 35 test results
Found 210 test results
Found 24 test results
Found 81 test results
Found 27 test results
Found 24 test results
Found 13 test results
Found 2 test results
Found 28 test results
Found 44 test results
Found 92 test results
Found 18 test results
Found 2 test results

Jenkins build is unstable: sling-trunk-1.8 #3800

Posted by Apache Jenkins Server <je...@builds.apache.org>.
See <https://builds.apache.org/job/sling-trunk-1.8/3800/>


Build failed in Jenkins: sling-trunk-1.8 #3799

Posted by Apache Jenkins Server <je...@builds.apache.org>.
See <https://builds.apache.org/job/sling-trunk-1.8/3799/changes>

Changes:

[olli] use org.apache.sling.jcr.oak.server 1.1.0

[olli] use org.apache.sling.jcr.oak.server 1.1.0

[olli] use org.apache.sling.testing.paxexam 0.0.2

[olli] use org.apache.sling.testing.paxexam 0.0.2

------------------------------------------
[...truncated 79207 lines...]
[JENKINS] Archiving disabled
[JENKINS] Archiving disabled
[JENKINS] Archiving disabled
[JENKINS] Archiving disabled
[JENKINS] Archiving disabled
[JENKINS] Archiving disabled
[JENKINS] Archiving disabled
[JENKINS] Archiving disabled
[JENKINS] Archiving disabled
[JENKINS] Archiving disabled
[JENKINS] Archiving disabled
[JENKINS] Archiving disabled
[JENKINS] Archiving disabled
[JENKINS] Archiving disabled
[JENKINS] Archiving disabled
[JENKINS] Archiving disabled
[JENKINS] Archiving disabled
[JENKINS] Archiving disabled
[JENKINS] Archiving disabled
[JENKINS] Archiving disabled
[JENKINS] Archiving disabled
[JENKINS] Archiving disabled
[JENKINS] Archiving disabled
[JENKINS] Archiving disabled
[JENKINS] Archiving disabled
[JENKINS] Archiving disabled
[JENKINS] Archiving disabled
[JENKINS] Archiving disabled[INFO] ------------------------------------------------------------------------
[INFO] Reactor Summary:
[INFO] 
[INFO] Apache Sling JAR Resource Bundle ................... SUCCESS [  5.445 s]
[INFO] Apache Sling (Parent) .............................. SUCCESS [  8.350 s]
[INFO] Apache Sling Tooling Support Install ............... SUCCESS [ 10.350 s]
[INFO] Apache Sling Provisioning Model .................... SUCCESS [ 20.957 s]
[INFO] Apache Sling Tooling Support Source ................ SUCCESS [  4.781 s]
[INFO] Apache Sling Testing Utilities ..................... SUCCESS [ 23.455 s]
[INFO] Apache Sling API ................................... SUCCESS [ 15.142 s]
[INFO] Apache Sling Resource Resolver ..................... SUCCESS [ 17.318 s]
[INFO] Apache Sling System Bundle Extension: Java Transaction API SUCCESS [  7.718 s]
[INFO] Apache Sling System Bundle Extension: XML APIs ..... SUCCESS [  2.847 s]
[INFO] Apache Sling System Bundle Extension: Activation API SUCCESS [  3.061 s]
[INFO] Apache Sling System Bundle Extension: WS APIs ...... SUCCESS [  3.028 s]
[INFO] Apache Sling Dynamic Class Loader Support .......... SUCCESS [ 17.052 s]
[INFO] Apache Sling Commons FileSystem ClassLoader ........ SUCCESS [  7.609 s]
[INFO] Apache Sling Commons Java Compiler ................. SUCCESS [  7.274 s]
[INFO] Apache Sling JSON Library .......................... SUCCESS [ 12.149 s]
[INFO] Apache Sling SLF4J Implementation (Logback) ........ SUCCESS [ 50.545 s]
[INFO] Apache Sling OSGi LogService Implementation ........ SUCCESS [  4.792 s]
[INFO] Apache Sling MIME type mapping support ............. SUCCESS [  5.745 s]
[INFO] Apache Sling Content Detection Support ............. SUCCESS [ 53.928 s]
[INFO] Apache Sling Commons OSGi support .................. SUCCESS [ 18.904 s]
[INFO] Apache Sling Scheduler Support ..................... SUCCESS [ 15.225 s]
[INFO] Apache Sling Thread Dumper ......................... SUCCESS [  5.839 s]
[INFO] Apache Sling Thread Support ........................ SUCCESS [  7.816 s]
[INFO] Apache Sling Metrics ............................... SUCCESS [  7.816 s]
[INFO] Apache Sling Authentication Service ................ SUCCESS [ 10.403 s]
[INFO] Apache Sling Form Based Authentication Handler ..... SUCCESS [  9.644 s]
[INFO] Apache Sling Engine Implementation ................. SUCCESS [ 21.918 s]
[INFO] Apache Sling Repository API Bundle ................. SUCCESS [  2.435 s]
[INFO] Apache Sling JCR Base Bundle ....................... SUCCESS [  6.216 s]
[INFO] Apache Sling Pax Exam Utilities .................... SUCCESS [ 53.457 s]
[INFO] Apache Sling Initial Content Loader ................ SUCCESS [01:27 min]
[INFO] Apache Sling Jackrabbit Embedded Repository ........ SUCCESS [ 11.389 s]
[INFO] Apache Sling Jackrabbit UserManager Support ........ SUCCESS [  5.668 s]
[INFO] Apache Sling Jackrabbit JSR-283 Access Control Manager Support SUCCESS [  3.171 s]
[INFO] Apache Sling Wrapper Bundle for the JCR API ........ SUCCESS [  3.708 s]
[INFO] Apache Sling JCR Resource Resolver ................. SUCCESS [ 46.684 s]
[INFO] Apache Sling Versioning Integration Tests .......... SUCCESS [ 12.896 s]
[INFO] Apache Sling JCR Repository Registration ........... SUCCESS [  5.445 s]
[INFO] Apache Sling Simple WebDAV Access to repositories .. SUCCESS [  3.871 s]
[INFO] Apache Sling DavEx Access to repositories .......... SUCCESS [  4.568 s]
[INFO] Apache Sling JCR WebConsole Bundle ................. SUCCESS [  3.602 s]
[INFO] Apache Sling Testing PaxExam ....................... SUCCESS [ 30.721 s]
[INFO] Apache Sling JCR Oak Repository Server ............. SUCCESS [ 31.492 s]
[INFO] Apache Sling SlingRepository Integration Tests ..... SUCCESS [01:40 min]
[INFO] Apache Sling RepoInit Parser ....................... SUCCESS [  5.738 s]
[INFO] Apache Sling RepoInit JCR module ................... SUCCESS [ 25.078 s]
[INFO] Apache Sling Servlet Resolver ...................... SUCCESS [  5.843 s]
[INFO] Apache Sling Default GET Servlets .................. SUCCESS [  5.700 s]
[INFO] Apache Sling Default POST Servlets ................. SUCCESS [ 18.881 s]
[INFO] Apache Sling Compat Servlets ....................... SUCCESS [  3.314 s]
[INFO] Apache Sling Scripting Implementation API .......... SUCCESS [  3.294 s]
[INFO] Apache Sling Scripting Core implementation ......... SUCCESS [ 29.814 s]
[INFO] Apache Sling Scripting JavaScript Support .......... SUCCESS [ 24.871 s]
[INFO] Apache Sling Scripting JSP Support ................. SUCCESS [  7.975 s]
[INFO] Apache Sling JSP Tag Library ....................... SUCCESS [  7.135 s]
[INFO] Apache Sling JSP Standard Tag Library .............. SUCCESS [  3.257 s]
[INFO] Apache Sling Scripting Sightly Compiler ............ SUCCESS [ 44.627 s]
[INFO] Apache Sling Scripting Sightly Java Compiler ....... SUCCESS [ 22.621 s]
[INFO] Apache Sling Scripting Sightly Engine .............. SUCCESS [ 25.760 s]
[INFO] Apache Sling Scripting Sightly JavaScript Use Provider SUCCESS [  3.359 s]
[INFO] Apache Sling Scripting Sightly Models Use Provider . SUCCESS [  3.025 s]
[INFO] Apache Sling Scripting Sightly Read-Eval-Print Loop Environment SUCCESS [  2.706 s]
[INFO] Apache Sling Scripting Sightly Integration Tests Content SUCCESS [  5.371 s]
[INFO] Apache Sling Launchpad Base ........................ SUCCESS [ 20.511 s]
[INFO] Apache Sling Subsystems Base Installer ............. SUCCESS [  4.615 s]
[INFO] Apache Sling Filesystem Resource Provider .......... SUCCESS [  2.581 s]
[INFO] Apache Sling Internationalization Support .......... FAILURE [01:06 min]
[INFO] Apache Sling Installer WebConsole Plugin ........... SKIPPED
[INFO] Apache Sling JCR Installer ......................... SKIPPED
[INFO] Apache Sling Launchpad Application Builder ......... SKIPPED
[INFO] Apache Sling Scripting Sightly Integration Tests ... SKIPPED
[INFO] Apache Sling Scripting Sightly Reactor ............. SKIPPED
[INFO] Apache Sling Adapter Manager Implementation ........ SKIPPED
[INFO] Apache Sling Bundle Resource Provider .............. SKIPPED
[INFO] Apache Sling Distributed Event Admin ............... SKIPPED
[INFO] Apache Sling Discovery API ......................... SKIPPED
[INFO] Apache Sling Discovery Commons ..................... SKIPPED
[INFO] Apache Sling Discovery Base ........................ SKIPPED
[INFO] Apache Sling Resource-Based Discovery Service ...... SKIPPED
[INFO] Apache Sling Oak-Based Discovery Service ........... SKIPPED
[INFO] Apache Sling Discovery Support Bundle .............. SKIPPED
[INFO] Apache Sling Discovery Standalone Implementation ... SKIPPED
[INFO] Apache Sling Event Support ......................... SKIPPED
[INFO] Apache Sling Feature Flags ......................... SKIPPED
[INFO] Apache Sling javax.activation bundle ............... SKIPPED
[INFO] Apache Sling Service User Mapper ................... SKIPPED
[INFO] Apache Sling Settings .............................. SKIPPED
[INFO] Apache Sling Web Console Branding .................. SKIPPED
[INFO] Apache Sling Web Console Security Provider ......... SKIPPED
[INFO] Apache Sling Explorer .............................. SKIPPED
[INFO] Apache Sling Health Check Core ..................... SKIPPED
[INFO] Apache Sling Health Check Samples .................. SKIPPED
[INFO] Apache Sling Health Check Support Components ....... SKIPPED
[INFO] Apache Sling Health Check Webconsole Plugin ........ SKIPPED
[INFO] Apache Sling Health Check JUnit Bridge ............. SKIPPED
[INFO] Apache Sling Health Check Annotations .............. SKIPPED
[INFO] Apache Sling Health Check Integration Tests ........ SKIPPED
[INFO] Apache Sling Health Check Reactor POM .............. SKIPPED
[INFO] Apache Sling Resource Access Security .............. SKIPPED
[INFO] Apache Sling Resource Access Security Integration Tests SKIPPED
[INFO] Apache Sling Models API ............................ SKIPPED
[INFO] Apache Sling Models Implementation ................. SKIPPED
[INFO] Apache Sling Models Integration Tests .............. SKIPPED
[INFO] Apache Sling XSS Protection Bundle ................. SKIPPED
[INFO] Apache Sling JUnit Core ............................ SKIPPED
[INFO] Apache Sling JUnit Tests Teleporter ................ SKIPPED
[INFO] Apache Sling Resource Builder ...................... SKIPPED
[INFO] Apache Sling Servlet Helpers ....................... SKIPPED
[INFO] Apache Sling RepoInit Integration Tests ............ SKIPPED
[INFO] Apache Sling RepoInit Reactor ...................... SKIPPED
[INFO] Apache Sling Test Tools ............................ SKIPPED
[INFO] Apache Sling Testing Clients ....................... SKIPPED
[INFO] Apache Sling Testing Hamcrest ...................... SKIPPED
[INFO] Apache Sling Server Setup Tools .................... SKIPPED
[INFO] Apache Sling Testing Rules ......................... SKIPPED
[INFO] Apache Sling JUnit Scriptable Tests Provider ....... SKIPPED
[INFO] Apache Sling JUnit Health Checks ................... SKIPPED
[INFO] Apache Sling JUnit Remote Tests Runners ............ SKIPPED
[INFO] Apache Sling JUnit Performance ..................... SKIPPED
[INFO] Apache Sling Testing Mock Log Configuration ........ SKIPPED
[INFO] Apache Sling Testing Resource Resolver Mock ........ SKIPPED
[INFO] Apache Sling Testing JCR Mock ...................... SKIPPED
[INFO] Apache Sling Testing OSGi Mock ..................... SKIPPED
[INFO] Apache Sling Testing Sling Mock .................... SKIPPED
[INFO] Apache Sling Testing Sling Mock Oak-based Resource Resolver SKIPPED
[INFO] Apache Sling Testing Mocks Modules Reactor ......... SKIPPED
[INFO] Apache Sling Testing - sample bundle with integration tests SKIPPED
[INFO] Apache Sling Testing - sample module with integration tests SKIPPED
[INFO] Apache Sling Testing Modules Reactor ............... SKIPPED
[INFO] Apache Sling Installer ............................. SKIPPED
[INFO] Apache Sling File Installer ........................ SKIPPED
[INFO] Apache Sling Installer Configuration Admin Support . SKIPPED
[INFO] Apache Sling Deployment Package Installer .......... SKIPPED
[INFO] Apache Sling Subsystems Installer .................. SKIPPED
[INFO] Apache Sling Installer Health Checks ............... SKIPPED
[INFO] Apache Sling Installer Integration Tests ........... SKIPPED
[INFO] Apache Sling Launchpad API ......................... SKIPPED
[INFO] Apache Sling Launchpad Installer ................... SKIPPED
[INFO] Apache Sling Launchpad Content ..................... SKIPPED
[INFO] Apache Sling Validation Framework API .............. SKIPPED
[INFO] Apache Sling Validation Framework Core Implementation SKIPPED
[INFO] Apache Sling Validation Framework Testing Services . SKIPPED
[INFO] Apache Sling Validation Framework Integration Tests  SKIPPED
[INFO] Apache Sling Validation Framework Examples ......... SKIPPED
[INFO] Apache Sling Validation Framework Builder .......... SKIPPED
[INFO] Apache Sling Models Validation Implementation ...... SKIPPED
[INFO] Apache Sling Launchpad Testing Services ............ SKIPPED
[INFO] Apache Sling Launchpad Testing Services WAR ........ SKIPPED
[INFO] Apache Sling Launchpad Testing Fragment Bundle ..... SKIPPED
[INFO] Apache Sling Launchpad Test Bundles ................ SKIPPED
[INFO] Apache Sling Integration Tests ..................... SKIPPED
[INFO] Apache Sling Launchpad Testing ..................... SKIPPED
[INFO] Apache Sling (Builder) ............................. SKIPPED
[INFO] ------------------------------------------------------------------------
[INFO] BUILD FAILURE
[INFO] ------------------------------------------------------------------------
[INFO] Total time: 21:43 min

[INFO] Finished at: 2016-08-17T22:10:27+00:00
[INFO] Final Memory: 257M/461M
[INFO] ------------------------------------------------------------------------
Waiting for Jenkins to finish collecting data
[ERROR] Failed to execute goal org.apache.maven.plugins:maven-failsafe-plugin:2.19.1:integration-test (default) on project org.apache.sling.i18n: Execution default of goal org.apache.maven.plugins:maven-failsafe-plugin:2.19.1:integration-test failed: The forked VM terminated without properly saying goodbye. VM crash or System.exit called?
[ERROR] Command was /bin/sh -c cd <https://builds.apache.org/job/sling-trunk-1.8/ws/trunk/bundles/extensions/i18n> && /usr/local/asfpackages/java/jdk1.8.0_102/jre/bin/java -jar <https://builds.apache.org/job/sling-trunk-1.8/ws/trunk/bundles/extensions/i18n/target/surefire/surefirebooter8557729005085064832.jar> <https://builds.apache.org/job/sling-trunk-1.8/ws/trunk/bundles/extensions/i18n/target/surefire/surefire8287825949960192064tmp> <https://builds.apache.org/job/sling-trunk-1.8/ws/trunk/bundles/extensions/i18n/target/surefire/surefire_15423081896064186865tmp>
[ERROR] -> [Help 1]
[ERROR] 
[ERROR] To see the full stack trace of the errors, re-run Maven with the -e switch.
[ERROR] Re-run Maven using the -X switch to enable full debug logging.
[ERROR] 
[ERROR] For more information about the errors and possible solutions, please read the following articles:
[ERROR] [Help 1] http://cwiki.apache.org/confluence/display/MAVEN/PluginExecutionException
[ERROR] 
[ERROR] After correcting the problems, you can resume the build with the command
[ERROR]   mvn <goals> -rf :org.apache.sling.i18n
channel stopped
Found 95 test results
Found 45 test results
Found 8 test results
Found 4 test results
Found 2 test results
Found 17 test results
Found 4 test results
Found 94 test results
Found 44 test results
Found 10 test results
Found 21 test results
Found 9 test results
Found 36 test results
Found 42 test results
Found 22 test results
Found 10 test results
Found 95 test results
Found 27 test results
Found 3 test results
Found 9 test results
Found 96 test results
Found 8 test results
Found 17 test results
Found 45 test results
Found 34 test results
Found 9 test results
Found 94 test results
Found 75 test results
Found 10 test results
Found 49 test results
Found 35 test results
Found 210 test results
Found 24 test results
Found 81 test results
Found 27 test results
Found 24 test results
Found 13 test results
Found 2 test results
Found 28 test results
Found 44 test results
Found 92 test results
Found 18 test results
Found 2 test results

Jenkins build is unstable: sling-trunk-1.8 #3798

Posted by Apache Jenkins Server <je...@builds.apache.org>.
See <https://builds.apache.org/job/sling-trunk-1.8/3798/>


Build failed in Jenkins: sling-trunk-1.8 #3797

Posted by Apache Jenkins Server <je...@builds.apache.org>.
See <https://builds.apache.org/job/sling-trunk-1.8/3797/changes>

Changes:

[tmaret] SLING-5906 - Allow to filter resource by properties

* Update org.apache.jackrabbit.vault dependency in order to include JCRVLT-120
* Allow to configure a Package Property Filter, pass the configured filters to the vlt WorkspaceFilter

[tmaret] SLING-5941 - [SCD] Verify the uploaded distribution packages integrity via checksums

* Add DigestUtils

------------------------------------------
[...truncated 65169 lines...]
[JENKINS] Archiving disabled
[JENKINS] Archiving disabled
[JENKINS] Archiving disabled
[JENKINS] Archiving disabled
[JENKINS] Archiving disabled
[JENKINS] Archiving disabled
[JENKINS] Archiving disabled
[JENKINS] Archiving disabled
[JENKINS] Archiving disabled
[JENKINS] Archiving disabled
[JENKINS] Archiving disabled
[JENKINS] Archiving disabled
[JENKINS] Archiving disabled
[JENKINS] Archiving disabled
[JENKINS] Archiving disabled
[JENKINS] Archiving disabled
[JENKINS] Archiving disabled
[JENKINS] Archiving disabled
[JENKINS] Archiving disabled
[JENKINS] Archiving disabled
[JENKINS] Archiving disabled
[JENKINS] Archiving disabled
[JENKINS] Archiving disabled
[JENKINS] Archiving disabled
[JENKINS] Archiving disabled
[JENKINS] Archiving disabled
[JENKINS] Archiving disabled
[JENKINS] Archiving disabled
[JENKINS] Archiving disabled
[JENKINS] Archiving disabled
[JENKINS] Archiving disabled
[JENKINS] Archiving disabled
[JENKINS] Archiving disabled
[JENKINS] Archiving disabled
[JENKINS] Archiving disabled
[JENKINS] Archiving disabled
[JENKINS] Archiving disabled
[JENKINS] Archiving disabled
[JENKINS] Archiving disabled
[INFO] ------------------------------------------------------------------------
[INFO] Reactor Summary:
[INFO] 
[INFO] Apache Sling JAR Resource Bundle ................... SUCCESS [  4.524 s]
[INFO] Apache Sling (Parent) .............................. SUCCESS [  5.826 s]
[INFO] Apache Sling Tooling Support Install ............... SUCCESS [  8.604 s]
[INFO] Apache Sling Provisioning Model .................... SUCCESS [ 13.682 s]
[INFO] Apache Sling Tooling Support Source ................ SUCCESS [  5.667 s]
[INFO] Apache Sling Testing Utilities ..................... SUCCESS [ 17.699 s]
[INFO] Apache Sling API ................................... SUCCESS [ 11.633 s]
[INFO] Apache Sling Resource Resolver ..................... SUCCESS [ 12.689 s]
[INFO] Apache Sling System Bundle Extension: Java Transaction API SUCCESS [  7.343 s]
[INFO] Apache Sling System Bundle Extension: XML APIs ..... SUCCESS [  5.704 s]
[INFO] Apache Sling System Bundle Extension: Activation API SUCCESS [  3.862 s]
[INFO] Apache Sling System Bundle Extension: WS APIs ...... SUCCESS [  4.190 s]
[INFO] Apache Sling Dynamic Class Loader Support .......... SUCCESS [ 13.416 s]
[INFO] Apache Sling Commons FileSystem ClassLoader ........ SUCCESS [  5.583 s]
[INFO] Apache Sling Commons Java Compiler ................. SUCCESS [  5.771 s]
[INFO] Apache Sling JSON Library .......................... SUCCESS [ 25.158 s]
[INFO] Apache Sling SLF4J Implementation (Logback) ........ SUCCESS [ 35.856 s]
[INFO] Apache Sling OSGi LogService Implementation ........ SUCCESS [  4.128 s]
[INFO] Apache Sling MIME type mapping support ............. SUCCESS [  4.319 s]
[INFO] Apache Sling Content Detection Support ............. SUCCESS [ 33.278 s]
[INFO] Apache Sling Commons OSGi support .................. SUCCESS [  6.535 s]
[INFO] Apache Sling Scheduler Support ..................... SUCCESS [  7.350 s]
[INFO] Apache Sling Thread Dumper ......................... SUCCESS [  2.855 s]
[INFO] Apache Sling Thread Support ........................ SUCCESS [  6.491 s]
[INFO] Apache Sling Metrics ............................... SUCCESS [  8.703 s]
[INFO] Apache Sling Authentication Service ................ SUCCESS [  7.131 s]
[INFO] Apache Sling Form Based Authentication Handler ..... SUCCESS [  9.303 s]
[INFO] Apache Sling Engine Implementation ................. SUCCESS [ 12.303 s]
[INFO] Apache Sling Repository API Bundle ................. SUCCESS [  2.592 s]
[INFO] Apache Sling JCR Base Bundle ....................... SUCCESS [  5.052 s]
[INFO] Apache Sling Pax Exam Utilities .................... SUCCESS [ 30.140 s]
[INFO] Apache Sling Initial Content Loader ................ SUCCESS [ 49.055 s]
[INFO] Apache Sling Jackrabbit Embedded Repository ........ SUCCESS [  9.225 s]
[INFO] Apache Sling Jackrabbit UserManager Support ........ SUCCESS [  3.905 s]
[INFO] Apache Sling Jackrabbit JSR-283 Access Control Manager Support SUCCESS [  3.013 s]
[INFO] Apache Sling Wrapper Bundle for the JCR API ........ SUCCESS [  3.098 s]
[INFO] Apache Sling JCR Resource Resolver ................. SUCCESS [ 33.958 s]
[INFO] Apache Sling Versioning Integration Tests .......... SUCCESS [  8.240 s]
[INFO] Apache Sling JCR Repository Registration ........... SUCCESS [  7.941 s]
[INFO] Apache Sling Simple WebDAV Access to repositories .. SUCCESS [  4.138 s]
[INFO] Apache Sling DavEx Access to repositories .......... SUCCESS [  4.020 s]
[INFO] Apache Sling JCR WebConsole Bundle ................. SUCCESS [  2.667 s]
[INFO] Apache Sling Testing PaxExam ....................... SUCCESS [ 16.279 s]
[INFO] Apache Sling JCR Oak Repository Server ............. SUCCESS [ 20.313 s]
[INFO] Apache Sling SlingRepository Integration Tests ..... SUCCESS [ 23.718 s]
[INFO] Apache Sling RepoInit Parser ....................... SUCCESS [  7.202 s]
[INFO] Apache Sling RepoInit JCR module ................... SUCCESS [ 13.052 s]
[INFO] Apache Sling Servlet Resolver ...................... SUCCESS [  4.860 s]
[INFO] Apache Sling Default GET Servlets .................. SUCCESS [  4.763 s]
[INFO] Apache Sling Default POST Servlets ................. FAILURE [ 11.047 s]
[INFO] Apache Sling Compat Servlets ....................... SKIPPED
[INFO] Apache Sling Scripting Implementation API .......... SKIPPED
[INFO] Apache Sling Scripting Core implementation ......... SKIPPED
[INFO] Apache Sling Scripting JavaScript Support .......... SKIPPED
[INFO] Apache Sling Scripting JSP Support ................. SKIPPED
[INFO] Apache Sling JSP Tag Library ....................... SKIPPED
[INFO] Apache Sling JSP Standard Tag Library .............. SKIPPED
[INFO] Apache Sling Scripting Sightly Compiler ............ SKIPPED
[INFO] Apache Sling Scripting Sightly Java Compiler ....... SKIPPED
[INFO] Apache Sling Scripting Sightly Engine .............. SKIPPED
[INFO] Apache Sling Scripting Sightly JavaScript Use Provider SKIPPED
[INFO] Apache Sling Scripting Sightly Models Use Provider . SKIPPED
[INFO] Apache Sling Scripting Sightly Read-Eval-Print Loop Environment SKIPPED
[INFO] Apache Sling Scripting Sightly Integration Tests Content SKIPPED
[INFO] Apache Sling Launchpad Base ........................ SKIPPED
[INFO] Apache Sling Subsystems Base Installer ............. SKIPPED
[INFO] Apache Sling Filesystem Resource Provider .......... SKIPPED
[INFO] Apache Sling Internationalization Support .......... SKIPPED
[INFO] Apache Sling Installer WebConsole Plugin ........... SKIPPED
[INFO] Apache Sling JCR Installer ......................... SKIPPED
[INFO] Apache Sling Launchpad Application Builder ......... SKIPPED
[INFO] Apache Sling Scripting Sightly Integration Tests ... SKIPPED
[INFO] Apache Sling Scripting Sightly Reactor ............. SKIPPED
[INFO] Apache Sling Adapter Manager Implementation ........ SKIPPED
[INFO] Apache Sling Bundle Resource Provider .............. SKIPPED
[INFO] Apache Sling Distributed Event Admin ............... SKIPPED
[INFO] Apache Sling Discovery API ......................... SKIPPED
[INFO] Apache Sling Discovery Commons ..................... SKIPPED
[INFO] Apache Sling Discovery Base ........................ SKIPPED
[INFO] Apache Sling Resource-Based Discovery Service ...... SKIPPED
[INFO] Apache Sling Oak-Based Discovery Service ........... SKIPPED
[INFO] Apache Sling Discovery Support Bundle .............. SKIPPED
[INFO] Apache Sling Discovery Standalone Implementation ... SKIPPED
[INFO] Apache Sling Event Support ......................... SKIPPED
[INFO] Apache Sling Feature Flags ......................... SKIPPED
[INFO] Apache Sling javax.activation bundle ............... SKIPPED
[INFO] Apache Sling Service User Mapper ................... SKIPPED
[INFO] Apache Sling Settings .............................. SKIPPED
[INFO] Apache Sling Web Console Branding .................. SKIPPED
[INFO] Apache Sling Web Console Security Provider ......... SKIPPED
[INFO] Apache Sling Explorer .............................. SKIPPED
[INFO] Apache Sling Health Check Core ..................... SKIPPED
[INFO] Apache Sling Health Check Samples .................. SKIPPED
[INFO] Apache Sling Health Check Support Components ....... SKIPPED
[INFO] Apache Sling Health Check Webconsole Plugin ........ SKIPPED
[INFO] Apache Sling Health Check JUnit Bridge ............. SKIPPED
[INFO] Apache Sling Health Check Annotations .............. SKIPPED
[INFO] Apache Sling Health Check Integration Tests ........ SKIPPED
[INFO] Apache Sling Health Check Reactor POM .............. SKIPPED
[INFO] Apache Sling Resource Access Security .............. SKIPPED
[INFO] Apache Sling Resource Access Security Integration Tests SKIPPED
[INFO] Apache Sling Models API ............................ SKIPPED
[INFO] Apache Sling Models Implementation ................. SKIPPED
[INFO] Apache Sling Models Integration Tests .............. SKIPPED
[INFO] Apache Sling XSS Protection Bundle ................. SKIPPED
[INFO] Apache Sling JUnit Core ............................ SKIPPED
[INFO] Apache Sling JUnit Tests Teleporter ................ SKIPPED
[INFO] Apache Sling Resource Builder ...................... SKIPPED
[INFO] Apache Sling Servlet Helpers ....................... SKIPPED
[INFO] Apache Sling RepoInit Integration Tests ............ SKIPPED
[INFO] Apache Sling RepoInit Reactor ...................... SKIPPED
[INFO] Apache Sling Test Tools ............................ SKIPPED
[INFO] Apache Sling Testing Clients ....................... SKIPPED
[INFO] Apache Sling Testing Hamcrest ...................... SKIPPED
[INFO] Apache Sling Server Setup Tools .................... SKIPPED
[INFO] Apache Sling Testing Rules ......................... SKIPPED
[INFO] Apache Sling JUnit Scriptable Tests Provider ....... SKIPPED
[INFO] Apache Sling JUnit Health Checks ................... SKIPPED
[INFO] Apache Sling JUnit Remote Tests Runners ............ SKIPPED
[INFO] Apache Sling JUnit Performance ..................... SKIPPED
[INFO] Apache Sling Testing Mock Log Configuration ........ SKIPPED
[INFO] Apache Sling Testing Resource Resolver Mock ........ SKIPPED
[INFO] Apache Sling Testing JCR Mock ...................... SKIPPED
[INFO] Apache Sling Testing OSGi Mock ..................... SKIPPED
[INFO] Apache Sling Testing Sling Mock .................... SKIPPED
[INFO] Apache Sling Testing Sling Mock Oak-based Resource Resolver SKIPPED
[INFO] Apache Sling Testing Mocks Modules Reactor ......... SKIPPED
[INFO] Apache Sling Testing - sample bundle with integration tests SKIPPED
[INFO] Apache Sling Testing - sample module with integration tests SKIPPED
[INFO] Apache Sling Testing Modules Reactor ............... SKIPPED
[INFO] Apache Sling Installer ............................. SKIPPED
[INFO] Apache Sling File Installer ........................ SKIPPED
[INFO] Apache Sling Installer Configuration Admin Support . SKIPPED
[INFO] Apache Sling Deployment Package Installer .......... SKIPPED
[INFO] Apache Sling Subsystems Installer .................. SKIPPED
[INFO] Apache Sling Installer Health Checks ............... SKIPPED
[INFO] Apache Sling Installer Integration Tests ........... SKIPPED
[INFO] Apache Sling Launchpad API ......................... SKIPPED
[INFO] Apache Sling Launchpad Installer ................... SKIPPED
[INFO] Apache Sling Launchpad Content ..................... SKIPPED
[INFO] Apache Sling Validation Framework API .............. SKIPPED
[INFO] Apache Sling Validation Framework Core Implementation SKIPPED
[INFO] Apache Sling Validation Framework Testing Services . SKIPPED
[INFO] Apache Sling Validation Framework Integration Tests  SKIPPED
[INFO] Apache Sling Validation Framework Examples ......... SKIPPED
[INFO] Apache Sling Validation Framework Builder .......... SKIPPED
[INFO] Apache Sling Models Validation Implementation ...... SKIPPED
[INFO] Apache Sling Launchpad Testing Services ............ SKIPPED
[INFO] Apache Sling Launchpad Testing Services WAR ........ SKIPPED
[INFO] Apache Sling Launchpad Testing Fragment Bundle ..... SKIPPED
[INFO] Apache Sling Launchpad Test Bundles ................ SKIPPED
[INFO] Apache Sling Integration Tests ..................... SKIPPED
[INFO] Apache Sling Launchpad Testing ..................... SKIPPED
[INFO] Apache Sling (Builder) ............................. SKIPPED
[INFO] ------------------------------------------------------------------------
[INFO] BUILD FAILURE
[INFO] ------------------------------------------------------------------------
[INFO] Total time: 11:08 min
[INFO] Finished at: 2016-08-17T18:23:45+00:00
[INFO] Final Memory: 353M/426M
[INFO] ------------------------------------------------------------------------
Waiting for Jenkins to finish collecting data
[ERROR] Failed to execute goal org.apache.maven.plugins:maven-source-plugin:3.0.0:jar (attach-sources) on project org.apache.sling.servlets.post: Error creating source archive: Problem creating jar: Execution exception: Java heap space -> [Help 1]
[ERROR] 
[ERROR] To see the full stack trace of the errors, re-run Maven with the -e switch.
[ERROR] Re-run Maven using the -X switch to enable full debug logging.
[ERROR] 
[ERROR] For more information about the errors and possible solutions, please read the following articles:
[ERROR] [Help 1] http://cwiki.apache.org/confluence/display/MAVEN/MojoExecutionException
[ERROR] 
[ERROR] After correcting the problems, you can resume the build with the command
[ERROR]   mvn <goals> -rf :org.apache.sling.servlets.post
channel stopped
Found 95 test results
Found 45 test results
Found 8 test results
Found 4 test results
Found 2 test results
Found 17 test results
Found 4 test results
Found 94 test results
Found 44 test results
Found 10 test results
Found 21 test results
Found 9 test results
Found 36 test results
Found 42 test results
Found 22 test results
Found 10 test results
Found 95 test results
Found 9 test results
Found 96 test results
Found 8 test results
Found 17 test results
Found 45 test results
Found 34 test results
Found 9 test results
Found 94 test results
Found 10 test results
Found 49 test results
Found 35 test results
Found 210 test results
Found 28 test results
Found 44 test results
Found 92 test results
Found 18 test results
Found 2 test results

Jenkins build is still unstable: sling-trunk-1.8 #3796

Posted by Apache Jenkins Server <je...@builds.apache.org>.
See <https://builds.apache.org/job/sling-trunk-1.8/changes>


Jenkins build is still unstable: sling-trunk-1.8 #3795

Posted by Apache Jenkins Server <je...@builds.apache.org>.
See <https://builds.apache.org/job/sling-trunk-1.8/changes>


Jenkins build is still unstable: sling-trunk-1.8 #3794

Posted by Apache Jenkins Server <je...@builds.apache.org>.
See <https://builds.apache.org/job/sling-trunk-1.8/changes>


Jenkins build is unstable: sling-trunk-1.8 #3793

Posted by Apache Jenkins Server <je...@builds.apache.org>.
See <https://builds.apache.org/job/sling-trunk-1.8/3793/>


Build failed in Jenkins: sling-trunk-1.8 #3792

Posted by Apache Jenkins Server <je...@builds.apache.org>.
See <https://builds.apache.org/job/sling-trunk-1.8/3792/changes>

Changes:

[sseifert] SLING-5972 Update to maven-jar-plugin 3.0.2

[sseifert] test jar not required - avoid heap space problem in maven build

[cziegeler] SLING-5792 : API to manage Authentication Requirement. Use PropertiesUtil instead of OsgiUtil

------------------------------------------
[...truncated 67558 lines...]
[JENKINS] Archiving disabled
[JENKINS] Archiving disabled
[JENKINS] Archiving disabled
[JENKINS] Archiving disabled
[JENKINS] Archiving disabled
[JENKINS] Archiving disabled
[JENKINS] Archiving disabled
[JENKINS] Archiving disabled
[JENKINS] Archiving disabled
[JENKINS] Archiving disabled
[JENKINS] Archiving disabled
[JENKINS] Archiving disabled
[JENKINS] Archiving disabled
[JENKINS] Archiving disabled
[JENKINS] Archiving disabled
[JENKINS] Archiving disabled
[JENKINS] Archiving disabled
[JENKINS] Archiving disabled
[JENKINS] Archiving disabled
[JENKINS] Archiving disabled
[JENKINS] Archiving disabled
[JENKINS] Archiving disabled
[JENKINS] Archiving disabled
[JENKINS] Archiving disabled
[JENKINS] Archiving disabled
[JENKINS] Archiving disabled
[JENKINS] Archiving disabled
[JENKINS] Archiving disabled
[JENKINS] Archiving disabled[INFO] ------------------------------------------------------------------------
[INFO] Reactor Summary:
[INFO] 
[INFO] Apache Sling JAR Resource Bundle ................... SUCCESS [  3.754 s]
[INFO] Apache Sling (Parent) .............................. SUCCESS [  5.139 s]
[INFO] Apache Sling Tooling Support Install ............... SUCCESS [  6.449 s]
[INFO] Apache Sling Provisioning Model .................... SUCCESS [ 21.235 s]
[INFO] Apache Sling Tooling Support Source ................ SUCCESS [  4.394 s]
[INFO] Apache Sling Testing Utilities ..................... SUCCESS [ 41.943 s]
[INFO] Apache Sling API ................................... SUCCESS [  9.592 s]
[INFO] Apache Sling Resource Resolver ..................... SUCCESS [ 10.044 s]
[INFO] Apache Sling System Bundle Extension: Java Transaction API SUCCESS [  3.093 s]
[INFO] Apache Sling System Bundle Extension: XML APIs ..... SUCCESS [  2.059 s]
[INFO] Apache Sling System Bundle Extension: Activation API SUCCESS [  1.856 s]
[INFO] Apache Sling System Bundle Extension: WS APIs ...... SUCCESS [  1.904 s]
[INFO] Apache Sling Dynamic Class Loader Support .......... SUCCESS [ 10.203 s]
[INFO] Apache Sling Commons FileSystem ClassLoader ........ SUCCESS [  3.809 s]
[INFO] Apache Sling Commons Java Compiler ................. SUCCESS [  4.483 s]
[INFO] Apache Sling JSON Library .......................... SUCCESS [  8.882 s]
[INFO] Apache Sling SLF4J Implementation (Logback) ........ SUCCESS [ 38.416 s]
[INFO] Apache Sling OSGi LogService Implementation ........ SUCCESS [  3.236 s]
[INFO] Apache Sling MIME type mapping support ............. SUCCESS [  3.136 s]
[INFO] Apache Sling Content Detection Support ............. SUCCESS [01:04 min]
[INFO] Apache Sling Commons OSGi support .................. SUCCESS [  6.304 s]
[INFO] Apache Sling Scheduler Support ..................... SUCCESS [  5.082 s]
[INFO] Apache Sling Thread Dumper ......................... SUCCESS [  1.881 s]
[INFO] Apache Sling Thread Support ........................ SUCCESS [  4.797 s]
[INFO] Apache Sling Metrics ............................... SUCCESS [  5.425 s]
[INFO] Apache Sling Authentication Service ................ SUCCESS [  4.054 s]
[INFO] Apache Sling Form Based Authentication Handler ..... SUCCESS [  6.224 s]
[INFO] Apache Sling Engine Implementation ................. SUCCESS [ 18.473 s]
[INFO] Apache Sling Repository API Bundle ................. SUCCESS [  2.016 s]
[INFO] Apache Sling JCR Base Bundle ....................... SUCCESS [  3.917 s]
[INFO] Apache Sling Pax Exam Utilities .................... SUCCESS [ 57.143 s]
[INFO] Apache Sling Initial Content Loader ................ SUCCESS [01:33 min]
[INFO] Apache Sling Jackrabbit Embedded Repository ........ SUCCESS [  8.253 s]
[INFO] Apache Sling Jackrabbit UserManager Support ........ SUCCESS [  3.083 s]
[INFO] Apache Sling Jackrabbit JSR-283 Access Control Manager Support SUCCESS [  2.198 s]
[INFO] Apache Sling Wrapper Bundle for the JCR API ........ SUCCESS [  1.967 s]
[INFO] Apache Sling JCR Resource Resolver ................. SUCCESS [01:39 min]
[INFO] Apache Sling Versioning Integration Tests .......... SUCCESS [ 27.857 s]
[INFO] Apache Sling JCR Repository Registration ........... SUCCESS [  4.482 s]
[INFO] Apache Sling Simple WebDAV Access to repositories .. SUCCESS [  3.101 s]
[INFO] Apache Sling DavEx Access to repositories .......... SUCCESS [  3.949 s]
[INFO] Apache Sling JCR WebConsole Bundle ................. SUCCESS [  5.313 s]
[INFO] Apache Sling Testing PaxExam ....................... SUCCESS [ 20.311 s]
[INFO] Apache Sling JCR Oak Repository Server ............. SUCCESS [ 21.008 s]
[INFO] Apache Sling SlingRepository Integration Tests ..... SUCCESS [ 51.789 s]
[INFO] Apache Sling RepoInit Parser ....................... SUCCESS [  5.541 s]
[INFO] Apache Sling RepoInit JCR module ................... SUCCESS [ 13.447 s]
[INFO] Apache Sling Servlet Resolver ...................... SUCCESS [  4.241 s]
[INFO] Apache Sling Default GET Servlets .................. SUCCESS [  3.671 s]
[INFO] Apache Sling Default POST Servlets ................. SUCCESS [  8.824 s]
[INFO] Apache Sling Compat Servlets ....................... SUCCESS [  2.135 s]
[INFO] Apache Sling Scripting Implementation API .......... SUCCESS [  1.821 s]
[INFO] Apache Sling Scripting Core implementation ......... SUCCESS [ 17.736 s]
[INFO] Apache Sling Scripting JavaScript Support .......... SUCCESS [ 39.428 s]
[INFO] Apache Sling Scripting JSP Support ................. SUCCESS [  5.634 s]
[INFO] Apache Sling JSP Tag Library ....................... SUCCESS [  5.145 s]
[INFO] Apache Sling JSP Standard Tag Library .............. SUCCESS [  2.199 s]
[INFO] Apache Sling Scripting Sightly Compiler ............ SUCCESS [ 20.030 s]
[INFO] Apache Sling Scripting Sightly Java Compiler ....... SUCCESS [ 10.626 s]
[INFO] Apache Sling Scripting Sightly Engine .............. SUCCESS [ 11.608 s]
[INFO] Apache Sling Scripting Sightly JavaScript Use Provider SUCCESS [  2.468 s]
[INFO] Apache Sling Scripting Sightly Models Use Provider . SUCCESS [  2.186 s]
[INFO] Apache Sling Scripting Sightly Read-Eval-Print Loop Environment SUCCESS [  2.697 s]
[INFO] Apache Sling Scripting Sightly Integration Tests Content SUCCESS [  4.796 s]
[INFO] Apache Sling Launchpad Base ........................ SUCCESS [ 19.150 s]
[INFO] Apache Sling Subsystems Base Installer ............. SUCCESS [  7.109 s]
[INFO] Apache Sling Filesystem Resource Provider .......... SUCCESS [  4.250 s]
[INFO] Apache Sling Internationalization Support .......... FAILURE [01:21 min]
[INFO] Apache Sling Installer WebConsole Plugin ........... SKIPPED
[INFO] Apache Sling JCR Installer ......................... SKIPPED
[INFO] Apache Sling Launchpad Application Builder ......... SKIPPED
[INFO] Apache Sling Scripting Sightly Integration Tests ... SKIPPED
[INFO] Apache Sling Scripting Sightly Reactor ............. SKIPPED
[INFO] Apache Sling Adapter Manager Implementation ........ SKIPPED
[INFO] Apache Sling Bundle Resource Provider .............. SKIPPED
[INFO] Apache Sling Distributed Event Admin ............... SKIPPED
[INFO] Apache Sling Discovery API ......................... SKIPPED
[INFO] Apache Sling Discovery Commons ..................... SKIPPED
[INFO] Apache Sling Discovery Base ........................ SKIPPED
[INFO] Apache Sling Resource-Based Discovery Service ...... SKIPPED
[INFO] Apache Sling Oak-Based Discovery Service ........... SKIPPED
[INFO] Apache Sling Discovery Support Bundle .............. SKIPPED
[INFO] Apache Sling Discovery Standalone Implementation ... SKIPPED
[INFO] Apache Sling Event Support ......................... SKIPPED
[INFO] Apache Sling Feature Flags ......................... SKIPPED
[INFO] Apache Sling javax.activation bundle ............... SKIPPED
[INFO] Apache Sling Service User Mapper ................... SKIPPED
[INFO] Apache Sling Settings .............................. SKIPPED
[INFO] Apache Sling Web Console Branding .................. SKIPPED
[INFO] Apache Sling Web Console Security Provider ......... SKIPPED
[INFO] Apache Sling Explorer .............................. SKIPPED
[INFO] Apache Sling Health Check Core ..................... SKIPPED
[INFO] Apache Sling Health Check Samples .................. SKIPPED
[INFO] Apache Sling Health Check Support Components ....... SKIPPED
[INFO] Apache Sling Health Check Webconsole Plugin ........ SKIPPED
[INFO] Apache Sling Health Check JUnit Bridge ............. SKIPPED
[INFO] Apache Sling Health Check Annotations .............. SKIPPED
[INFO] Apache Sling Health Check Integration Tests ........ SKIPPED
[INFO] Apache Sling Health Check Reactor POM .............. SKIPPED
[INFO] Apache Sling Resource Access Security .............. SKIPPED
[INFO] Apache Sling Resource Access Security Integration Tests SKIPPED
[INFO] Apache Sling Models API ............................ SKIPPED
[INFO] Apache Sling Models Implementation ................. SKIPPED
[INFO] Apache Sling Models Integration Tests .............. SKIPPED
[INFO] Apache Sling XSS Protection Bundle ................. SKIPPED
[INFO] Apache Sling JUnit Core ............................ SKIPPED
[INFO] Apache Sling JUnit Tests Teleporter ................ SKIPPED
[INFO] Apache Sling Resource Builder ...................... SKIPPED
[INFO] Apache Sling Servlet Helpers ....................... SKIPPED
[INFO] Apache Sling RepoInit Integration Tests ............ SKIPPED
[INFO] Apache Sling RepoInit Reactor ...................... SKIPPED
[INFO] Apache Sling Test Tools ............................ SKIPPED
[INFO] Apache Sling Testing Clients ....................... SKIPPED
[INFO] Apache Sling Testing Hamcrest ...................... SKIPPED
[INFO] Apache Sling Server Setup Tools .................... SKIPPED
[INFO] Apache Sling Testing Rules ......................... SKIPPED
[INFO] Apache Sling JUnit Scriptable Tests Provider ....... SKIPPED
[INFO] Apache Sling JUnit Health Checks ................... SKIPPED
[INFO] Apache Sling JUnit Remote Tests Runners ............ SKIPPED
[INFO] Apache Sling JUnit Performance ..................... SKIPPED
[INFO] Apache Sling Testing Mock Log Configuration ........ SKIPPED
[INFO] Apache Sling Testing Resource Resolver Mock ........ SKIPPED
[INFO] Apache Sling Testing JCR Mock ...................... SKIPPED
[INFO] Apache Sling Testing OSGi Mock ..................... SKIPPED
[INFO] Apache Sling Testing Sling Mock .................... SKIPPED
[INFO] Apache Sling Testing Sling Mock Oak-based Resource Resolver SKIPPED
[INFO] Apache Sling Testing Mocks Modules Reactor ......... SKIPPED
[INFO] Apache Sling Testing - sample bundle with integration tests SKIPPED
[INFO] Apache Sling Testing - sample module with integration tests SKIPPED
[INFO] Apache Sling Testing Modules Reactor ............... SKIPPED
[INFO] Apache Sling Installer ............................. SKIPPED
[INFO] Apache Sling File Installer ........................ SKIPPED
[INFO] Apache Sling Installer Configuration Admin Support . SKIPPED
[INFO] Apache Sling Deployment Package Installer .......... SKIPPED
[INFO] Apache Sling Subsystems Installer .................. SKIPPED
[INFO] Apache Sling Installer Integration Tests ........... SKIPPED
[INFO] Apache Sling Launchpad API ......................... SKIPPED
[INFO] Apache Sling Launchpad Installer ................... SKIPPED
[INFO] Apache Sling Launchpad Content ..................... SKIPPED
[INFO] Apache Sling Validation Framework API .............. SKIPPED
[INFO] Apache Sling Validation Framework Core Implementation SKIPPED
[INFO] Apache Sling Validation Framework Testing Services . SKIPPED
[INFO] Apache Sling Validation Framework Integration Tests  SKIPPED
[INFO] Apache Sling Validation Framework Examples ......... SKIPPED
[INFO] Apache Sling Validation Framework Builder .......... SKIPPED
[INFO] Apache Sling Models Validation Implementation ...... SKIPPED
[INFO] Apache Sling Launchpad Testing Services ............ SKIPPED
[INFO] Apache Sling Launchpad Testing Services WAR ........ SKIPPED
[INFO] Apache Sling Launchpad Testing Fragment Bundle ..... SKIPPED
[INFO] Apache Sling Launchpad Test Bundles ................ SKIPPED
[INFO] Apache Sling Integration Tests ..................... SKIPPED
[INFO] Apache Sling Launchpad Testing ..................... SKIPPED
[INFO] Apache Sling (Builder) ............................. SKIPPED
[INFO] ------------------------------------------------------------------------
[INFO] BUILD FAILURE
[INFO] ------------------------------------------------------------------------
[INFO] Total time: 17:57 min
[INFO] Finished at: 2016-08-17T11:02:51+00:00

[INFO] Final Memory: 263M/445M
[INFO] ------------------------------------------------------------------------
Waiting for Jenkins to finish collecting data
[ERROR] Failed to execute goal org.apache.maven.plugins:maven-failsafe-plugin:2.19.1:integration-test (default) on project org.apache.sling.i18n: Execution default of goal org.apache.maven.plugins:maven-failsafe-plugin:2.19.1:integration-test failed: The forked VM terminated without properly saying goodbye. VM crash or System.exit called?
[ERROR] Command was /bin/sh -c cd <https://builds.apache.org/job/sling-trunk-1.8/ws/trunk/bundles/extensions/i18n> && /usr/local/asfpackages/java/jdk1.8.0_102/jre/bin/java -jar <https://builds.apache.org/job/sling-trunk-1.8/ws/trunk/bundles/extensions/i18n/target/surefire/surefirebooter6293192457016657118.jar> <https://builds.apache.org/job/sling-trunk-1.8/ws/trunk/bundles/extensions/i18n/target/surefire/surefire3354668299916047096tmp> <https://builds.apache.org/job/sling-trunk-1.8/ws/trunk/bundles/extensions/i18n/target/surefire/surefire_1622093137621198114tmp>
[ERROR] -> [Help 1]
[ERROR] 
[ERROR] To see the full stack trace of the errors, re-run Maven with the -e switch.
[ERROR] Re-run Maven using the -X switch to enable full debug logging.
[ERROR] 
[ERROR] For more information about the errors and possible solutions, please read the following articles:
[ERROR] [Help 1] http://cwiki.apache.org/confluence/display/MAVEN/PluginExecutionException
[ERROR] 
[ERROR] After correcting the problems, you can resume the build with the command
[ERROR]   mvn <goals> -rf :org.apache.sling.i18n
channel stopped
Found 95 test results
Found 45 test results
Found 8 test results
Found 4 test results
Found 2 test results
Found 17 test results
Found 4 test results
Found 94 test results
Found 44 test results
Found 10 test results
Found 21 test results
Found 9 test results
Found 36 test results
Found 42 test results
Found 22 test results
Found 10 test results
Found 95 test results
Found 27 test results
Found 3 test results
Found 9 test results
Found 96 test results
Found 8 test results
Found 17 test results
Found 45 test results
Found 34 test results
Found 9 test results
Found 94 test results
Found 75 test results
Found 10 test results
Found 49 test results
Found 35 test results
Found 210 test results
Found 24 test results
Found 81 test results
Found 27 test results
Found 24 test results
Found 13 test results
Found 2 test results
Found 28 test results
Found 44 test results
Found 92 test results
Found 18 test results
Found 2 test results

Build failed in Jenkins: sling-trunk-1.8 #3791

Posted by Apache Jenkins Server <je...@builds.apache.org>.
See <https://builds.apache.org/job/sling-trunk-1.8/3791/changes>

Changes:

[sseifert] Update to 3.0.2 to avoid heap space problem

------------------------------------------
[...truncated 147931 lines...]
[INFO] Apache Sling API ................................... SUCCESS [ 13.707 s]
[INFO] Apache Sling Resource Resolver ..................... SUCCESS [ 15.230 s]
[INFO] Apache Sling System Bundle Extension: Java Transaction API SUCCESS [  3.906 s]
[INFO] Apache Sling System Bundle Extension: XML APIs ..... SUCCESS [  5.433 s]
[INFO] Apache Sling System Bundle Extension: Activation API SUCCESS [  2.032 s]
[INFO] Apache Sling System Bundle Extension: WS APIs ...... SUCCESS [  2.295 s]
[INFO] Apache Sling Dynamic Class Loader Support .......... SUCCESS [ 13.703 s]
[INFO] Apache Sling Commons FileSystem ClassLoader ........ SUCCESS [  4.766 s]
[INFO] Apache Sling Commons Java Compiler ................. SUCCESS [  6.449 s]
[INFO] Apache Sling JSON Library .......................... SUCCESS [  9.407 s]
[INFO] Apache Sling SLF4J Implementation (Logback) ........ SUCCESS [ 48.490 s]
[INFO] Apache Sling OSGi LogService Implementation ........ SUCCESS [  3.380 s]
[INFO] Apache Sling MIME type mapping support ............. SUCCESS [  5.107 s]
[INFO] Apache Sling Content Detection Support ............. SUCCESS [ 53.527 s]
[INFO] Apache Sling Commons OSGi support .................. SUCCESS [  9.647 s]
[INFO] Apache Sling Scheduler Support ..................... SUCCESS [  8.395 s]
[INFO] Apache Sling Thread Dumper ......................... SUCCESS [  2.314 s]
[INFO] Apache Sling Thread Support ........................ SUCCESS [  8.203 s]
[INFO] Apache Sling Metrics ............................... SUCCESS [  6.493 s]
[INFO] Apache Sling Authentication Service ................ SUCCESS [  5.648 s]
[INFO] Apache Sling Form Based Authentication Handler ..... SUCCESS [ 10.938 s]
[INFO] Apache Sling Engine Implementation ................. SUCCESS [ 20.119 s]
[INFO] Apache Sling Repository API Bundle ................. SUCCESS [  2.174 s]
[INFO] Apache Sling JCR Base Bundle ....................... SUCCESS [  5.955 s]
[INFO] Apache Sling Pax Exam Utilities .................... SUCCESS [ 49.388 s]
[INFO] Apache Sling Initial Content Loader ................ SUCCESS [01:27 min]
[INFO] Apache Sling Jackrabbit Embedded Repository ........ SUCCESS [ 11.235 s]
[INFO] Apache Sling Jackrabbit UserManager Support ........ SUCCESS [  4.570 s]
[INFO] Apache Sling Jackrabbit JSR-283 Access Control Manager Support SUCCESS [  3.374 s]
[INFO] Apache Sling Wrapper Bundle for the JCR API ........ SUCCESS [  2.590 s]
[INFO] Apache Sling JCR Resource Resolver ................. SUCCESS [ 52.245 s]
[INFO] Apache Sling Versioning Integration Tests .......... SUCCESS [ 12.791 s]
[INFO] Apache Sling JCR Repository Registration ........... SUCCESS [  6.240 s]
[INFO] Apache Sling Simple WebDAV Access to repositories .. SUCCESS [  3.642 s]
[INFO] Apache Sling DavEx Access to repositories .......... SUCCESS [  4.181 s]
[INFO] Apache Sling JCR WebConsole Bundle ................. SUCCESS [  2.187 s]
[INFO] Apache Sling Testing PaxExam ....................... SUCCESS [ 27.123 s]
[INFO] Apache Sling JCR Oak Repository Server ............. SUCCESS [ 31.393 s]
[INFO] Apache Sling SlingRepository Integration Tests ..... SUCCESS [01:40 min]
[INFO] Apache Sling RepoInit Parser ....................... SUCCESS [  4.989 s]
[INFO] Apache Sling RepoInit JCR module ................... SUCCESS [ 25.049 s]
[INFO] Apache Sling Servlet Resolver ...................... SUCCESS [  4.535 s]
[INFO] Apache Sling Default GET Servlets .................. SUCCESS [  4.519 s]
[INFO] Apache Sling Default POST Servlets ................. SUCCESS [ 11.030 s]
[INFO] Apache Sling Compat Servlets ....................... SUCCESS [  2.184 s]
[INFO] Apache Sling Scripting Implementation API .......... SUCCESS [  2.232 s]
[INFO] Apache Sling Scripting Core implementation ......... SUCCESS [ 24.889 s]
[INFO] Apache Sling Scripting JavaScript Support .......... SUCCESS [ 23.182 s]
[INFO] Apache Sling Scripting JSP Support ................. SUCCESS [  6.656 s]
[INFO] Apache Sling JSP Tag Library ....................... SUCCESS [  6.030 s]
[INFO] Apache Sling JSP Standard Tag Library .............. SUCCESS [  2.468 s]
[INFO] Apache Sling Scripting Sightly Compiler ............ SUCCESS [ 36.658 s]
[INFO] Apache Sling Scripting Sightly Java Compiler ....... SUCCESS [ 21.458 s]
[INFO] Apache Sling Scripting Sightly Engine .............. SUCCESS [ 22.479 s]
[INFO] Apache Sling Scripting Sightly JavaScript Use Provider SUCCESS [  6.190 s]
[INFO] Apache Sling Scripting Sightly Models Use Provider . SUCCESS [  2.171 s]
[INFO] Apache Sling Scripting Sightly Read-Eval-Print Loop Environment SUCCESS [  2.174 s]
[INFO] Apache Sling Scripting Sightly Integration Tests Content SUCCESS [  4.955 s]
[INFO] Apache Sling Launchpad Base ........................ SUCCESS [ 18.302 s]
[INFO] Apache Sling Subsystems Base Installer ............. SUCCESS [  3.715 s]
[INFO] Apache Sling Filesystem Resource Provider .......... SUCCESS [  2.522 s]
[INFO] Apache Sling Internationalization Support .......... SUCCESS [01:02 min]
[INFO] Apache Sling Installer WebConsole Plugin ........... SUCCESS [  2.225 s]
[INFO] Apache Sling JCR Installer ......................... SUCCESS [02:01 min]
[INFO] Apache Sling Launchpad Application Builder ......... SUCCESS [ 48.643 s]
[INFO] Apache Sling Scripting Sightly Integration Tests ... SUCCESS [02:49 min]
[INFO] Apache Sling Scripting Sightly Reactor ............. SUCCESS [  2.018 s]
[INFO] Apache Sling Adapter Manager Implementation ........ SUCCESS [  3.604 s]
[INFO] Apache Sling Bundle Resource Provider .............. SUCCESS [  2.175 s]
[INFO] Apache Sling Distributed Event Admin ............... SUCCESS [  3.434 s]
[INFO] Apache Sling Discovery API ......................... SUCCESS [  1.978 s]
[INFO] Apache Sling Discovery Commons ..................... SUCCESS [01:08 min]
[INFO] Apache Sling Discovery Base ........................ SUCCESS [ 50.671 s]
[INFO] Apache Sling Resource-Based Discovery Service ...... SUCCESS [02:53 min]
[INFO] Apache Sling Oak-Based Discovery Service ........... SUCCESS [02:38 min]
[INFO] Apache Sling Discovery Support Bundle .............. SUCCESS [  2.507 s]
[INFO] Apache Sling Discovery Standalone Implementation ... SUCCESS [  2.805 s]
[INFO] Apache Sling Event Support ......................... SUCCESS [09:59 min]
[INFO] Apache Sling Feature Flags ......................... SUCCESS [  4.617 s]
[INFO] Apache Sling javax.activation bundle ............... SUCCESS [  2.910 s]
[INFO] Apache Sling Service User Mapper ................... SUCCESS [  3.935 s]
[INFO] Apache Sling Settings .............................. SUCCESS [  4.682 s]
[INFO] Apache Sling Web Console Branding .................. SUCCESS [  4.947 s]
[INFO] Apache Sling Web Console Security Provider ......... SUCCESS [  2.273 s]
[INFO] Apache Sling Explorer .............................. SUCCESS [  2.168 s]
[INFO] Apache Sling Health Check Core ..................... SUCCESS [02:50 min]
[INFO] Apache Sling Health Check Samples .................. SUCCESS [  3.481 s]
[INFO] Apache Sling Health Check Support Components ....... SUCCESS [  3.706 s]
[INFO] Apache Sling Health Check Webconsole Plugin ........ SUCCESS [  2.138 s]
[INFO] Apache Sling Health Check JUnit Bridge ............. SUCCESS [  3.413 s]
[INFO] Apache Sling Health Check Annotations .............. SUCCESS [  2.108 s]
[INFO] Apache Sling Health Check Integration Tests ........ SUCCESS [  5.810 s]
[INFO] Apache Sling Health Check Reactor POM .............. SUCCESS [  1.523 s]
[INFO] Apache Sling Resource Access Security .............. SUCCESS [  2.488 s]
[INFO] Apache Sling Resource Access Security Integration Tests SUCCESS [ 34.016 s]
[INFO] Apache Sling Models API ............................ SUCCESS [  2.404 s]
[INFO] Apache Sling Models Implementation ................. SUCCESS [  6.720 s]
[INFO] Apache Sling Models Integration Tests .............. SUCCESS [ 41.276 s]
[INFO] Apache Sling XSS Protection Bundle ................. SUCCESS [ 13.216 s]
[INFO] Apache Sling JUnit Core ............................ SUCCESS [  5.284 s]
[INFO] Apache Sling JUnit Tests Teleporter ................ SUCCESS [  8.843 s]
[INFO] Apache Sling Resource Builder ...................... SUCCESS [ 36.749 s]
[INFO] Apache Sling Servlet Helpers ....................... SUCCESS [  5.996 s]
[INFO] Apache Sling RepoInit Integration Tests ............ SUCCESS [ 28.648 s]
[INFO] Apache Sling RepoInit Reactor ...................... SUCCESS [  3.252 s]
[INFO] Apache Sling Test Tools ............................ SUCCESS [  4.348 s]
[INFO] Apache Sling Testing Clients ....................... SUCCESS [  7.528 s]
[INFO] Apache Sling Testing Hamcrest ...................... SUCCESS [  3.797 s]
[INFO] Apache Sling Server Setup Tools .................... SUCCESS [  3.907 s]
[INFO] Apache Sling Testing Rules ......................... SUCCESS [  6.251 s]
[INFO] Apache Sling JUnit Scriptable Tests Provider ....... SUCCESS [  3.095 s]
[INFO] Apache Sling JUnit Health Checks ................... SUCCESS [  4.494 s]
[INFO] Apache Sling JUnit Remote Tests Runners ............ SUCCESS [  3.946 s]
[INFO] Apache Sling JUnit Performance ..................... SUCCESS [  3.490 s]
[INFO] Apache Sling Testing Mock Log Configuration ........ SUCCESS [  2.332 s]
[INFO] Apache Sling Testing Resource Resolver Mock ........ SUCCESS [  3.203 s]
[INFO] Apache Sling Testing JCR Mock ...................... SUCCESS [  4.113 s]
[INFO] Apache Sling Testing OSGi Mock ..................... SUCCESS [ 10.171 s]
[INFO] Apache Sling Testing Sling Mock .................... SUCCESS [ 16.020 s]
[INFO] Apache Sling Testing Sling Mock Oak-based Resource Resolver FAILURE [ 51.047 s]
[INFO] Apache Sling Testing Mocks Modules Reactor ......... SKIPPED
[INFO] Apache Sling Testing - sample bundle with integration tests SKIPPED
[INFO] Apache Sling Testing - sample module with integration tests SKIPPED
[INFO] Apache Sling Testing Modules Reactor ............... SKIPPED
[INFO] Apache Sling Installer ............................. SKIPPED
[INFO] Apache Sling File Installer ........................ SKIPPED
[INFO] Apache Sling Installer Configuration Admin Support . SKIPPED
[INFO] Apache Sling Deployment Package Installer .......... SKIPPED
[INFO] Apache Sling Subsystems Installer .................. SKIPPED
[INFO] Apache Sling Installer Integration Tests ........... SKIPPED
[INFO] Apache Sling Launchpad API ......................... SKIPPED
[INFO] Apache Sling Launchpad Installer ................... SKIPPED
[INFO] Apache Sling Launchpad Content ..................... SKIPPED
[INFO] Apache Sling Validation Framework API .............. SKIPPED
[INFO] Apache Sling Validation Framework Core Implementation SKIPPED
[INFO] Apache Sling Validation Framework Testing Services . SKIPPED
[INFO] Apache Sling Validation Framework Integration Tests  SKIPPED
[INFO] Apache Sling Validation Framework Examples ......... SKIPPED
[INFO] Apache Sling Validation Framework Builder .......... SKIPPED
[INFO] Apache Sling Models Validation Implementation ...... SKIPPED
[INFO] Apache Sling Launchpad Testing Services ............ SKIPPED
[INFO] Apache Sling Launchpad Testing Services WAR ........ SKIPPED
[INFO] Apache Sling Launchpad Testing Fragment Bundle ..... SKIPPED
[INFO] Apache Sling Launchpad Test Bundles ................ SKIPPED
[INFO] Apache Sling Integration Tests ..................... SKIPPED
[INFO] Apache Sling Launchpad Testing ..................... SKIPPED
[INFO] Apache Sling (Builder) ............................. SKIPPED
[INFO] ------------------------------------------------------------------------
[INFO] BUILD FAILURE
[INFO] ------------------------------------------------------------------------
[INFO] Total time: 01:57 h
[INFO] Finished at: 2016-08-17T09:49:59+00:00
[INFO] Final Memory: 408M/455M
[INFO] ------------------------------------------------------------------------
[ERROR] Failed to execute goal org.apache.maven.plugins:maven-jar-plugin:3.0.0:test-jar (default) on project org.apache.sling.testing.sling-mock-oak: Error assembling JAR: Problem creating jar: Execution exception: Java heap space -> [Help 1]
[ERROR] 
[ERROR] To see the full stack trace of the errors, re-run Maven with the -e switch.
[ERROR] Re-run Maven using the -X switch to enable full debug logging.
[ERROR] 
[ERROR] For more information about the errors and possible solutions, please read the following articles:
[ERROR] [Help 1] http://cwiki.apache.org/confluence/display/MAVEN/MojoExecutionException
[ERROR] 
[ERROR] After correcting the problems, you can resume the build with the command
[ERROR]   mvn <goals> -rf :org.apache.sling.testing.sling-mock-oak
channel stopped
Found 18 test results
Found 95 test results
Found 45 test results
Found 8 test results
Found 4 test results
Found 2 test results
Found 17 test results
Found 4 test results
Found 94 test results
Found 44 test results
Found 10 test results
Found 21 test results
Found 9 test results
Found 36 test results
Found 42 test results
Found 22 test results
Found 10 test results
Found 31 test results
Found 83 test results
Found 50 test results
Found 30 test results
Found 5 test results
Found 95 test results
Found 77 test results
Found 4 test results
Found 94 test results
Found 3 test results
Found 8 test results
Found 2 test results
Found 13 test results
Found 31 test results
Found 3 test results
Found 38 test results
Found 9 test results
Found 96 test results
Found 8 test results
Found 17 test results
Found 45 test results
Found 34 test results
Found 9 test results
Found 94 test results
Found 37 test results
Found 4 test results
Found 16 test results
Found 3 test results
Found 2 test results
Found 23 test results
Found 3 test results
Found 75 test results
Found 184 test results
Found 16 test results
Found 10 test results
Found 49 test results
Found 8 test results
Found 35 test results
Found 21 test results
Found 36 test results
Found 210 test results
Found 24 test results
Found 81 test results
Found 27 test results
Found 24 test results
Found 13 test results
Found 2 test results
Found 392 test results
Found 17 test results
Found 58 test results
Found 28 test results
Found 44 test results
Found 92 test results
Found 18 test results
Found 164 test results
Found 8 test results
Found 70 test results
Found 103 test results
Found 18 test results
Found 50 test results
Found 77 test results
Found 13 test results
Found 154 test results
Found 47 test results
Found 26 test results
Found 2 test results
Found 27 test results

Build failed in Jenkins: sling-trunk-1.8 #3790

Posted by Apache Jenkins Server <je...@builds.apache.org>.
See <https://builds.apache.org/job/sling-trunk-1.8/3790/>

------------------------------------------
[...truncated 141212 lines...]
[INFO] Apache Sling System Bundle Extension: XML APIs ..... SUCCESS [  2.192 s]
[INFO] Apache Sling System Bundle Extension: Activation API SUCCESS [  2.119 s]
[INFO] Apache Sling System Bundle Extension: WS APIs ...... SUCCESS [  2.203 s]
[INFO] Apache Sling Dynamic Class Loader Support .......... SUCCESS [ 14.735 s]
[INFO] Apache Sling Commons FileSystem ClassLoader ........ SUCCESS [  5.377 s]
[INFO] Apache Sling Commons Java Compiler ................. SUCCESS [  6.405 s]
[INFO] Apache Sling JSON Library .......................... SUCCESS [  9.972 s]
[INFO] Apache Sling SLF4J Implementation (Logback) ........ SUCCESS [ 48.674 s]
[INFO] Apache Sling OSGi LogService Implementation ........ SUCCESS [  3.387 s]
[INFO] Apache Sling MIME type mapping support ............. SUCCESS [  5.203 s]
[INFO] Apache Sling Content Detection Support ............. SUCCESS [ 52.161 s]
[INFO] Apache Sling Commons OSGi support .................. SUCCESS [  9.522 s]
[INFO] Apache Sling Scheduler Support ..................... SUCCESS [  7.941 s]
[INFO] Apache Sling Thread Dumper ......................... SUCCESS [  2.187 s]
[INFO] Apache Sling Thread Support ........................ SUCCESS [  7.463 s]
[INFO] Apache Sling Metrics ............................... SUCCESS [ 18.499 s]
[INFO] Apache Sling Authentication Service ................ SUCCESS [  6.115 s]
[INFO] Apache Sling Form Based Authentication Handler ..... SUCCESS [  8.840 s]
[INFO] Apache Sling Engine Implementation ................. SUCCESS [ 21.161 s]
[INFO] Apache Sling Repository API Bundle ................. SUCCESS [  2.208 s]
[INFO] Apache Sling JCR Base Bundle ....................... SUCCESS [  5.715 s]
[INFO] Apache Sling Pax Exam Utilities .................... SUCCESS [ 51.437 s]
[INFO] Apache Sling Initial Content Loader ................ SUCCESS [01:24 min]
[INFO] Apache Sling Jackrabbit Embedded Repository ........ SUCCESS [ 10.574 s]
[INFO] Apache Sling Jackrabbit UserManager Support ........ SUCCESS [  3.395 s]
[INFO] Apache Sling Jackrabbit JSR-283 Access Control Manager Support SUCCESS [  2.743 s]
[INFO] Apache Sling Wrapper Bundle for the JCR API ........ SUCCESS [  2.054 s]
[INFO] Apache Sling JCR Resource Resolver ................. SUCCESS [ 46.512 s]
[INFO] Apache Sling Versioning Integration Tests .......... SUCCESS [ 13.164 s]
[INFO] Apache Sling JCR Repository Registration ........... SUCCESS [  4.575 s]
[INFO] Apache Sling Simple WebDAV Access to repositories .. SUCCESS [  3.815 s]
[INFO] Apache Sling DavEx Access to repositories .......... SUCCESS [  4.487 s]
[INFO] Apache Sling JCR WebConsole Bundle ................. SUCCESS [  2.132 s]
[INFO] Apache Sling Testing PaxExam ....................... SUCCESS [ 26.029 s]
[INFO] Apache Sling JCR Oak Repository Server ............. SUCCESS [ 31.557 s]
[INFO] Apache Sling SlingRepository Integration Tests ..... SUCCESS [01:39 min]
[INFO] Apache Sling RepoInit Parser ....................... SUCCESS [  5.061 s]
[INFO] Apache Sling RepoInit JCR module ................... SUCCESS [ 23.138 s]
[INFO] Apache Sling Servlet Resolver ...................... SUCCESS [  4.506 s]
[INFO] Apache Sling Default GET Servlets .................. SUCCESS [  4.546 s]
[INFO] Apache Sling Default POST Servlets ................. SUCCESS [  9.816 s]
[INFO] Apache Sling Compat Servlets ....................... SUCCESS [  2.308 s]
[INFO] Apache Sling Scripting Implementation API .......... SUCCESS [  2.146 s]
[INFO] Apache Sling Scripting Core implementation ......... SUCCESS [ 24.203 s]
[INFO] Apache Sling Scripting JavaScript Support .......... SUCCESS [ 24.621 s]
[INFO] Apache Sling Scripting JSP Support ................. SUCCESS [  6.967 s]
[INFO] Apache Sling JSP Tag Library ....................... SUCCESS [  5.941 s]
[INFO] Apache Sling JSP Standard Tag Library .............. SUCCESS [  2.521 s]
[INFO] Apache Sling Scripting Sightly Compiler ............ SUCCESS [ 35.159 s]
[INFO] Apache Sling Scripting Sightly Java Compiler ....... SUCCESS [ 20.525 s]
[INFO] Apache Sling Scripting Sightly Engine .............. SUCCESS [ 23.510 s]
[INFO] Apache Sling Scripting Sightly JavaScript Use Provider SUCCESS [  2.873 s]
[INFO] Apache Sling Scripting Sightly Models Use Provider . SUCCESS [  2.049 s]
[INFO] Apache Sling Scripting Sightly Read-Eval-Print Loop Environment SUCCESS [  2.415 s]
[INFO] Apache Sling Scripting Sightly Integration Tests Content SUCCESS [  4.971 s]
[INFO] Apache Sling Launchpad Base ........................ SUCCESS [ 17.906 s]
[INFO] Apache Sling Subsystems Base Installer ............. SUCCESS [  3.380 s]
[INFO] Apache Sling Filesystem Resource Provider .......... SUCCESS [  2.512 s]
[INFO] Apache Sling Internationalization Support .......... SUCCESS [01:05 min]
[INFO] Apache Sling Installer WebConsole Plugin ........... SUCCESS [  2.831 s]
[INFO] Apache Sling JCR Installer ......................... SUCCESS [02:03 min]
[INFO] Apache Sling Launchpad Application Builder ......... SUCCESS [ 54.748 s]
[INFO] Apache Sling Scripting Sightly Integration Tests ... SUCCESS [02:49 min]
[INFO] Apache Sling Scripting Sightly Reactor ............. SUCCESS [  1.643 s]
[INFO] Apache Sling Adapter Manager Implementation ........ SUCCESS [  6.202 s]
[INFO] Apache Sling Bundle Resource Provider .............. SUCCESS [  2.766 s]
[INFO] Apache Sling Distributed Event Admin ............... SUCCESS [  4.455 s]
[INFO] Apache Sling Discovery API ......................... SUCCESS [  2.543 s]
[INFO] Apache Sling Discovery Commons ..................... SUCCESS [ 49.868 s]
[INFO] Apache Sling Discovery Base ........................ SUCCESS [ 52.128 s]
[INFO] Apache Sling Resource-Based Discovery Service ...... SUCCESS [02:57 min]
[INFO] Apache Sling Oak-Based Discovery Service ........... SUCCESS [02:40 min]
[INFO] Apache Sling Discovery Support Bundle .............. SUCCESS [  2.884 s]
[INFO] Apache Sling Discovery Standalone Implementation ... SUCCESS [  3.317 s]
[INFO] Apache Sling Event Support ......................... SUCCESS [24:09 min]
[INFO] Apache Sling Feature Flags ......................... SUCCESS [  7.797 s]
[INFO] Apache Sling javax.activation bundle ............... SUCCESS [  2.641 s]
[INFO] Apache Sling Service User Mapper ................... SUCCESS [  4.337 s]
[INFO] Apache Sling Settings .............................. SUCCESS [  3.976 s]
[INFO] Apache Sling Web Console Branding .................. SUCCESS [  2.420 s]
[INFO] Apache Sling Web Console Security Provider ......... SUCCESS [  3.252 s]
[INFO] Apache Sling Explorer .............................. SUCCESS [  2.496 s]
[INFO] Apache Sling Health Check Core ..................... SUCCESS [02:45 min]
[INFO] Apache Sling Health Check Samples .................. SUCCESS [  4.617 s]
[INFO] Apache Sling Health Check Support Components ....... SUCCESS [  3.973 s]
[INFO] Apache Sling Health Check Webconsole Plugin ........ SUCCESS [  2.776 s]
[INFO] Apache Sling Health Check JUnit Bridge ............. SUCCESS [  3.971 s]
[INFO] Apache Sling Health Check Annotations .............. SUCCESS [  2.210 s]
[INFO] Apache Sling Health Check Integration Tests ........ SUCCESS [  9.955 s]
[INFO] Apache Sling Health Check Reactor POM .............. SUCCESS [  1.413 s]
[INFO] Apache Sling Resource Access Security .............. SUCCESS [  2.836 s]
[INFO] Apache Sling Resource Access Security Integration Tests SUCCESS [ 35.034 s]
[INFO] Apache Sling Models API ............................ SUCCESS [  3.093 s]
[INFO] Apache Sling Models Implementation ................. SUCCESS [  7.961 s]
[INFO] Apache Sling Models Integration Tests .............. SUCCESS [ 40.446 s]
[INFO] Apache Sling XSS Protection Bundle ................. SUCCESS [ 14.466 s]
[INFO] Apache Sling JUnit Core ............................ SUCCESS [  4.595 s]
[INFO] Apache Sling JUnit Tests Teleporter ................ SUCCESS [  9.209 s]
[INFO] Apache Sling Resource Builder ...................... SUCCESS [ 36.510 s]
[INFO] Apache Sling Servlet Helpers ....................... SUCCESS [  5.092 s]
[INFO] Apache Sling RepoInit Integration Tests ............ SUCCESS [ 29.654 s]
[INFO] Apache Sling RepoInit Reactor ...................... SUCCESS [  1.932 s]
[INFO] Apache Sling Test Tools ............................ SUCCESS [  5.414 s]
[INFO] Apache Sling Testing Clients ....................... SUCCESS [ 10.614 s]
[INFO] Apache Sling Testing Hamcrest ...................... SUCCESS [  3.942 s]
[INFO] Apache Sling Server Setup Tools .................... SUCCESS [  4.703 s]
[INFO] Apache Sling Testing Rules ......................... SUCCESS [  6.211 s]
[INFO] Apache Sling JUnit Scriptable Tests Provider ....... SUCCESS [  4.510 s]
[INFO] Apache Sling JUnit Health Checks ................... SUCCESS [  7.994 s]
[INFO] Apache Sling JUnit Remote Tests Runners ............ SUCCESS [  4.079 s]
[INFO] Apache Sling JUnit Performance ..................... SUCCESS [  3.382 s]
[INFO] Apache Sling Testing Mock Log Configuration ........ SUCCESS [  2.796 s]
[INFO] Apache Sling Testing Resource Resolver Mock ........ SUCCESS [  3.458 s]
[INFO] Apache Sling Testing JCR Mock ...................... SUCCESS [  4.706 s]
[INFO] Apache Sling Testing OSGi Mock ..................... SUCCESS [  9.447 s]
[INFO] Apache Sling Testing Sling Mock .................... FAILURE [ 36.571 s]
[INFO] Apache Sling Testing Sling Mock Oak-based Resource Resolver SKIPPED
[INFO] Apache Sling Testing Mocks Modules Reactor ......... SKIPPED
[INFO] Apache Sling Testing - sample bundle with integration tests SKIPPED
[INFO] Apache Sling Testing - sample module with integration tests SKIPPED
[INFO] Apache Sling Testing Modules Reactor ............... SKIPPED
[INFO] Apache Sling Installer ............................. SKIPPED
[INFO] Apache Sling File Installer ........................ SKIPPED
[INFO] Apache Sling Installer Configuration Admin Support . SKIPPED
[INFO] Apache Sling Deployment Package Installer .......... SKIPPED
[INFO] Apache Sling Subsystems Installer .................. SKIPPED
[INFO] Apache Sling Installer Integration Tests ........... SKIPPED
[INFO] Apache Sling Launchpad API ......................... SKIPPED
[INFO] Apache Sling Launchpad Installer ................... SKIPPED
[INFO] Apache Sling Launchpad Content ..................... SKIPPED
[INFO] Apache Sling Validation Framework API .............. SKIPPED
[INFO] Apache Sling Validation Framework Core Implementation SKIPPED
[INFO] Apache Sling Validation Framework Testing Services . SKIPPED
[INFO] Apache Sling Validation Framework Integration Tests  SKIPPED
[INFO] Apache Sling Validation Framework Examples ......... SKIPPED
[INFO] Apache Sling Validation Framework Builder .......... SKIPPED
[INFO] Apache Sling Models Validation Implementation ...... SKIPPED
[INFO] Apache Sling Launchpad Testing Services ............ SKIPPED
[INFO] Apache Sling Launchpad Testing Services WAR ........ SKIPPED
[INFO] Apache Sling Launchpad Testing Fragment Bundle ..... SKIPPED
[INFO] Apache Sling Launchpad Test Bundles ................ SKIPPED
[INFO] Apache Sling Integration Tests ..................... SKIPPED
[INFO] Apache Sling Launchpad Testing ..................... SKIPPED
[INFO] Apache Sling (Builder) ............................. SKIPPED
[INFO] ------------------------------------------------------------------------
[INFO] BUILD FAILURE
[INFO] ------------------------------------------------------------------------
[INFO] Total time: 01:05 h
[INFO] Finished at: 2016-08-17T07:48:29+00:00

[INFO] Final Memory: 370M/449M
[INFO] ------------------------------------------------------------------------
Waiting for Jenkins to finish collecting data
[ERROR] Failed to execute goal org.apache.maven.plugins:maven-jar-plugin:3.0.0:test-jar (default) on project org.apache.sling.testing.sling-mock: Error assembling JAR: Problem creating jar: Execution exception: Java heap space -> [Help 1]
[ERROR] 
[ERROR] To see the full stack trace of the errors, re-run Maven with the -e switch.
[ERROR] Re-run Maven using the -X switch to enable full debug logging.
[ERROR] 
[ERROR] For more information about the errors and possible solutions, please read the following articles:
[ERROR] [Help 1] http://cwiki.apache.org/confluence/display/MAVEN/MojoExecutionException
[ERROR] 
[ERROR] After correcting the problems, you can resume the build with the command
[ERROR]   mvn <goals> -rf :org.apache.sling.testing.sling-mock
channel stopped
Found 18 test results
Found 95 test results
Found 45 test results
Found 8 test results
Found 4 test results
Found 2 test results
Found 17 test results
Found 4 test results
Found 94 test results
Found 44 test results
Found 10 test results
Found 21 test results
Found 9 test results
Found 36 test results
Found 42 test results
Found 22 test results
Found 10 test results
Found 31 test results
Found 83 test results
Found 50 test results
Found 30 test results
Found 5 test results
Found 95 test results
Found 77 test results
Found failed test junit/org.apache.sling.event.it/ChaosTest
Found failed test junit/org.apache.sling.event.it/ChaosTest/testDoChaos
Found 4 test results
Found 94 test results
Found 3 test results
Found 8 test results
Found 2 test results
Found 13 test results
Found 31 test results
Found 3 test results
Found 38 test results
Found 9 test results
Found 96 test results
Found 8 test results
Found 17 test results
Found 45 test results
Found 34 test results
Found 9 test results
Found 94 test results
Found 37 test results
Found 4 test results
Found 16 test results
Found 3 test results
Found 2 test results
Found 23 test results
Found 3 test results
Found 75 test results
Found 184 test results
Found 16 test results
Found 10 test results
Found 49 test results
Found 8 test results
Found 35 test results
Found 21 test results
Found 36 test results
Found 210 test results
Found 24 test results
Found 81 test results
Found 27 test results
Found 24 test results
Found 13 test results
Found 2 test results
Found 392 test results
Found 17 test results
Found 58 test results
Found 28 test results
Found 44 test results
Found 92 test results
Found 18 test results
Found 164 test results
Found 8 test results
Found 70 test results
Found 103 test results
Found 18 test results
Found 50 test results
Found 77 test results
Found 13 test results
Found 154 test results
Found 26 test results
Found 2 test results
Found 27 test results

Build failed in Jenkins: sling-trunk-1.8 #3789

Posted by Apache Jenkins Server <je...@builds.apache.org>.
See <https://builds.apache.org/job/sling-trunk-1.8/3789/changes>

Changes:

[cziegeler] SLING-5792 : API to manage Authentication Requirement. Fix dependency to commons.osgi

------------------------------------------
[...truncated 71160 lines...]
[JENKINS] Archiving disabled
[JENKINS] Archiving disabled
[JENKINS] Archiving disabled
[JENKINS] Archiving disabled
[JENKINS] Archiving disabled
[JENKINS] Archiving disabled
[JENKINS] Archiving disabled
[JENKINS] Archiving disabled
[JENKINS] Archiving disabled
[JENKINS] Archiving disabled
[JENKINS] Archiving disabled
[JENKINS] Archiving disabled
[JENKINS] Archiving disabled
[JENKINS] Archiving disabled
[JENKINS] Archiving disabled
[JENKINS] Archiving disabled
[JENKINS] Archiving disabled
[JENKINS] Archiving disabled
[JENKINS] Archiving disabled
[JENKINS] Archiving disabled
[JENKINS] Archiving disabled
[JENKINS] Archiving disabled
[JENKINS] Archiving disabled
[JENKINS] Archiving disabled
[JENKINS] Archiving disabled
[JENKINS] Archiving disabled
[JENKINS] Archiving disabled
[JENKINS] Archiving disabled
[JENKINS] Archiving disabled[INFO] ------------------------------------------------------------------------
[INFO] Reactor Summary:
[INFO] 
[INFO] Apache Sling JAR Resource Bundle ................... SUCCESS [  7.636 s]
[INFO] Apache Sling (Parent) .............................. SUCCESS [ 12.500 s]
[INFO] Apache Sling Tooling Support Install ............... SUCCESS [ 12.350 s]
[INFO] Apache Sling Provisioning Model .................... SUCCESS [ 16.614 s]
[INFO] Apache Sling Tooling Support Source ................ SUCCESS [  4.771 s]
[INFO] Apache Sling Testing Utilities ..................... SUCCESS [ 25.696 s]
[INFO] Apache Sling API ................................... SUCCESS [ 13.792 s]
[INFO] Apache Sling Resource Resolver ..................... SUCCESS [ 17.209 s]
[INFO] Apache Sling System Bundle Extension: Java Transaction API SUCCESS [  5.315 s]
[INFO] Apache Sling System Bundle Extension: XML APIs ..... SUCCESS [  2.828 s]
[INFO] Apache Sling System Bundle Extension: Activation API SUCCESS [  2.519 s]
[INFO] Apache Sling System Bundle Extension: WS APIs ...... SUCCESS [  2.757 s]
[INFO] Apache Sling Dynamic Class Loader Support .......... SUCCESS [ 33.358 s]
[INFO] Apache Sling Commons FileSystem ClassLoader ........ SUCCESS [  6.283 s]
[INFO] Apache Sling Commons Java Compiler ................. SUCCESS [  8.706 s]
[INFO] Apache Sling JSON Library .......................... SUCCESS [ 12.952 s]
[INFO] Apache Sling SLF4J Implementation (Logback) ........ SUCCESS [ 51.703 s]
[INFO] Apache Sling OSGi LogService Implementation ........ SUCCESS [  4.071 s]
[INFO] Apache Sling MIME type mapping support ............. SUCCESS [  5.316 s]
[INFO] Apache Sling Content Detection Support ............. SUCCESS [01:07 min]
[INFO] Apache Sling Commons OSGi support .................. SUCCESS [ 13.025 s]
[INFO] Apache Sling Scheduler Support ..................... SUCCESS [ 10.129 s]
[INFO] Apache Sling Thread Dumper ......................... SUCCESS [  3.670 s]
[INFO] Apache Sling Thread Support ........................ SUCCESS [  8.582 s]
[INFO] Apache Sling Metrics ............................... SUCCESS [  9.163 s]
[INFO] Apache Sling Authentication Service ................ SUCCESS [  8.079 s]
[INFO] Apache Sling Form Based Authentication Handler ..... SUCCESS [ 16.344 s]
[INFO] Apache Sling Engine Implementation ................. SUCCESS [ 28.178 s]
[INFO] Apache Sling Repository API Bundle ................. SUCCESS [  3.878 s]
[INFO] Apache Sling JCR Base Bundle ....................... SUCCESS [  7.460 s]
[INFO] Apache Sling Pax Exam Utilities .................... SUCCESS [01:05 min]
[INFO] Apache Sling Initial Content Loader ................ SUCCESS [01:44 min]
[INFO] Apache Sling Jackrabbit Embedded Repository ........ SUCCESS [ 12.178 s]
[INFO] Apache Sling Jackrabbit UserManager Support ........ SUCCESS [  4.465 s]
[INFO] Apache Sling Jackrabbit JSR-283 Access Control Manager Support SUCCESS [  4.230 s]
[INFO] Apache Sling Wrapper Bundle for the JCR API ........ SUCCESS [  2.867 s]
[INFO] Apache Sling JCR Resource Resolver ................. SUCCESS [ 50.710 s]
[INFO] Apache Sling Versioning Integration Tests .......... SUCCESS [ 15.822 s]
[INFO] Apache Sling JCR Repository Registration ........... SUCCESS [  5.270 s]
[INFO] Apache Sling Simple WebDAV Access to repositories .. SUCCESS [  4.127 s]
[INFO] Apache Sling DavEx Access to repositories .......... SUCCESS [  4.719 s]
[INFO] Apache Sling JCR WebConsole Bundle ................. SUCCESS [  7.792 s]
[INFO] Apache Sling Testing PaxExam ....................... SUCCESS [ 36.478 s]
[INFO] Apache Sling JCR Oak Repository Server ............. SUCCESS [ 40.705 s]
[INFO] Apache Sling SlingRepository Integration Tests ..... SUCCESS [01:52 min]
[INFO] Apache Sling RepoInit Parser ....................... SUCCESS [  5.712 s]
[INFO] Apache Sling RepoInit JCR module ................... SUCCESS [ 28.942 s]
[INFO] Apache Sling Servlet Resolver ...................... SUCCESS [  6.337 s]
[INFO] Apache Sling Default GET Servlets .................. SUCCESS [  6.714 s]
[INFO] Apache Sling Default POST Servlets ................. SUCCESS [ 13.286 s]
[INFO] Apache Sling Compat Servlets ....................... SUCCESS [  3.710 s]
[INFO] Apache Sling Scripting Implementation API .......... SUCCESS [  2.666 s]
[INFO] Apache Sling Scripting Core implementation ......... SUCCESS [ 31.863 s]
[INFO] Apache Sling Scripting JavaScript Support .......... SUCCESS [ 29.717 s]
[INFO] Apache Sling Scripting JSP Support ................. SUCCESS [  9.607 s]
[INFO] Apache Sling JSP Tag Library ....................... SUCCESS [  8.433 s]
[INFO] Apache Sling JSP Standard Tag Library .............. SUCCESS [  3.987 s]
[INFO] Apache Sling Scripting Sightly Compiler ............ SUCCESS [ 52.383 s]
[INFO] Apache Sling Scripting Sightly Java Compiler ....... SUCCESS [ 27.222 s]
[INFO] Apache Sling Scripting Sightly Engine .............. SUCCESS [ 28.798 s]
[INFO] Apache Sling Scripting Sightly JavaScript Use Provider SUCCESS [  4.334 s]
[INFO] Apache Sling Scripting Sightly Models Use Provider . SUCCESS [  3.041 s]
[INFO] Apache Sling Scripting Sightly Read-Eval-Print Loop Environment SUCCESS [  3.170 s]
[INFO] Apache Sling Scripting Sightly Integration Tests Content SUCCESS [  7.843 s]
[INFO] Apache Sling Launchpad Base ........................ SUCCESS [ 49.632 s]
[INFO] Apache Sling Subsystems Base Installer ............. SUCCESS [  6.182 s]
[INFO] Apache Sling Filesystem Resource Provider .......... SUCCESS [  3.771 s]
[INFO] Apache Sling Internationalization Support .......... FAILURE [ 45.445 s]
[INFO] Apache Sling Installer WebConsole Plugin ........... SKIPPED
[INFO] Apache Sling JCR Installer ......................... SKIPPED
[INFO] Apache Sling Launchpad Application Builder ......... SKIPPED
[INFO] Apache Sling Scripting Sightly Integration Tests ... SKIPPED
[INFO] Apache Sling Scripting Sightly Reactor ............. SKIPPED
[INFO] Apache Sling Adapter Manager Implementation ........ SKIPPED
[INFO] Apache Sling Bundle Resource Provider .............. SKIPPED
[INFO] Apache Sling Distributed Event Admin ............... SKIPPED
[INFO] Apache Sling Discovery API ......................... SKIPPED
[INFO] Apache Sling Discovery Commons ..................... SKIPPED
[INFO] Apache Sling Discovery Base ........................ SKIPPED
[INFO] Apache Sling Resource-Based Discovery Service ...... SKIPPED
[INFO] Apache Sling Oak-Based Discovery Service ........... SKIPPED
[INFO] Apache Sling Discovery Support Bundle .............. SKIPPED
[INFO] Apache Sling Discovery Standalone Implementation ... SKIPPED
[INFO] Apache Sling Event Support ......................... SKIPPED
[INFO] Apache Sling Feature Flags ......................... SKIPPED
[INFO] Apache Sling javax.activation bundle ............... SKIPPED
[INFO] Apache Sling Service User Mapper ................... SKIPPED
[INFO] Apache Sling Settings .............................. SKIPPED
[INFO] Apache Sling Web Console Branding .................. SKIPPED
[INFO] Apache Sling Web Console Security Provider ......... SKIPPED
[INFO] Apache Sling Explorer .............................. SKIPPED
[INFO] Apache Sling Health Check Core ..................... SKIPPED
[INFO] Apache Sling Health Check Samples .................. SKIPPED
[INFO] Apache Sling Health Check Support Components ....... SKIPPED
[INFO] Apache Sling Health Check Webconsole Plugin ........ SKIPPED
[INFO] Apache Sling Health Check JUnit Bridge ............. SKIPPED
[INFO] Apache Sling Health Check Annotations .............. SKIPPED
[INFO] Apache Sling Health Check Integration Tests ........ SKIPPED
[INFO] Apache Sling Health Check Reactor POM .............. SKIPPED
[INFO] Apache Sling Resource Access Security .............. SKIPPED
[INFO] Apache Sling Resource Access Security Integration Tests SKIPPED
[INFO] Apache Sling Models API ............................ SKIPPED
[INFO] Apache Sling Models Implementation ................. SKIPPED
[INFO] Apache Sling Models Integration Tests .............. SKIPPED
[INFO] Apache Sling XSS Protection Bundle ................. SKIPPED
[INFO] Apache Sling JUnit Core ............................ SKIPPED
[INFO] Apache Sling JUnit Tests Teleporter ................ SKIPPED
[INFO] Apache Sling Resource Builder ...................... SKIPPED
[INFO] Apache Sling Servlet Helpers ....................... SKIPPED
[INFO] Apache Sling RepoInit Integration Tests ............ SKIPPED
[INFO] Apache Sling RepoInit Reactor ...................... SKIPPED
[INFO] Apache Sling Test Tools ............................ SKIPPED
[INFO] Apache Sling Testing Clients ....................... SKIPPED
[INFO] Apache Sling Testing Hamcrest ...................... SKIPPED
[INFO] Apache Sling Server Setup Tools .................... SKIPPED
[INFO] Apache Sling Testing Rules ......................... SKIPPED
[INFO] Apache Sling JUnit Scriptable Tests Provider ....... SKIPPED
[INFO] Apache Sling JUnit Health Checks ................... SKIPPED
[INFO] Apache Sling JUnit Remote Tests Runners ............ SKIPPED
[INFO] Apache Sling JUnit Performance ..................... SKIPPED
[INFO] Apache Sling Testing Mock Log Configuration ........ SKIPPED
[INFO] Apache Sling Testing Resource Resolver Mock ........ SKIPPED
[INFO] Apache Sling Testing JCR Mock ...................... SKIPPED
[INFO] Apache Sling Testing OSGi Mock ..................... SKIPPED
[INFO] Apache Sling Testing Sling Mock .................... SKIPPED
[INFO] Apache Sling Testing Sling Mock Oak-based Resource Resolver SKIPPED
[INFO] Apache Sling Testing Mocks Modules Reactor ......... SKIPPED
[INFO] Apache Sling Testing - sample bundle with integration tests SKIPPED
[INFO] Apache Sling Testing - sample module with integration tests SKIPPED
[INFO] Apache Sling Testing Modules Reactor ............... SKIPPED
[INFO] Apache Sling Installer ............................. SKIPPED
[INFO] Apache Sling File Installer ........................ SKIPPED
[INFO] Apache Sling Installer Configuration Admin Support . SKIPPED
[INFO] Apache Sling Deployment Package Installer .......... SKIPPED
[INFO] Apache Sling Subsystems Installer .................. SKIPPED
[INFO] Apache Sling Installer Integration Tests ........... SKIPPED
[INFO] Apache Sling Launchpad API ......................... SKIPPED
[INFO] Apache Sling Launchpad Installer ................... SKIPPED
[INFO] Apache Sling Launchpad Content ..................... SKIPPED
[INFO] Apache Sling Validation Framework API .............. SKIPPED
[INFO] Apache Sling Validation Framework Core Implementation SKIPPED
[INFO] Apache Sling Validation Framework Testing Services . SKIPPED
[INFO] Apache Sling Validation Framework Integration Tests  SKIPPED
[INFO] Apache Sling Validation Framework Examples ......... SKIPPED
[INFO] Apache Sling Validation Framework Builder .......... SKIPPED
[INFO] Apache Sling Models Validation Implementation ...... SKIPPED
[INFO] Apache Sling Launchpad Testing Services ............ SKIPPED
[INFO] Apache Sling Launchpad Testing Services WAR ........ SKIPPED
[INFO] Apache Sling Launchpad Testing Fragment Bundle ..... SKIPPED
[INFO] Apache Sling Launchpad Test Bundles ................ SKIPPED
[INFO] Apache Sling Integration Tests ..................... SKIPPED
[INFO] Apache Sling Launchpad Testing ..................... SKIPPED
[INFO] Apache Sling (Builder) ............................. SKIPPED
[INFO] ------------------------------------------------------------------------
[INFO] BUILD FAILURE
[INFO] ------------------------------------------------------------------------
[INFO] Total time: 22:48 min
[INFO] Finished at: 2016-08-17T06:09:25+00:00

[INFO] Final Memory: 258M/439M
[INFO] ------------------------------------------------------------------------
Waiting for Jenkins to finish collecting data
[ERROR] Failed to execute goal org.apache.maven.plugins:maven-failsafe-plugin:2.19.1:integration-test (default) on project org.apache.sling.i18n: Execution default of goal org.apache.maven.plugins:maven-failsafe-plugin:2.19.1:integration-test failed: The forked VM terminated without properly saying goodbye. VM crash or System.exit called?
[ERROR] Command was /bin/sh -c cd <https://builds.apache.org/job/sling-trunk-1.8/ws/trunk/bundles/extensions/i18n> && /usr/local/asfpackages/java/jdk1.8.0_102/jre/bin/java -jar <https://builds.apache.org/job/sling-trunk-1.8/ws/trunk/bundles/extensions/i18n/target/surefire/surefirebooter3740838041144611919.jar> <https://builds.apache.org/job/sling-trunk-1.8/ws/trunk/bundles/extensions/i18n/target/surefire/surefire8724870383466320149tmp> <https://builds.apache.org/job/sling-trunk-1.8/ws/trunk/bundles/extensions/i18n/target/surefire/surefire_12071784449010089500tmp>
[ERROR] -> [Help 1]
[ERROR] 
[ERROR] To see the full stack trace of the errors, re-run Maven with the -e switch.
[ERROR] Re-run Maven using the -X switch to enable full debug logging.
[ERROR] 
[ERROR] For more information about the errors and possible solutions, please read the following articles:
[ERROR] [Help 1] http://cwiki.apache.org/confluence/display/MAVEN/PluginExecutionException
[ERROR] 
[ERROR] After correcting the problems, you can resume the build with the command
[ERROR]   mvn <goals> -rf :org.apache.sling.i18n
channel stopped
Found 95 test results
Found 45 test results
Found 8 test results
Found 4 test results
Found 2 test results
Found 17 test results
Found 4 test results
Found 94 test results
Found 44 test results
Found 10 test results
Found 21 test results
Found 9 test results
Found 36 test results
Found 42 test results
Found 22 test results
Found 10 test results
Found 95 test results
Found 27 test results
Found 3 test results
Found 9 test results
Found 96 test results
Found 8 test results
Found 17 test results
Found 45 test results
Found 34 test results
Found 9 test results
Found 94 test results
Found 75 test results
Found 10 test results
Found 49 test results
Found 35 test results
Found 210 test results
Found 24 test results
Found 81 test results
Found 27 test results
Found 24 test results
Found 13 test results
Found 2 test results
Found 28 test results
Found 44 test results
Found 92 test results
Found 18 test results
Found 2 test results

RE: Build failed in Jenkins: sling-trunk-1.8 #3788

Posted by Stefan Seifert <ss...@pro-vision.de>.
this solved the problem in sling-mock.
still failing because the same problem occurred in sling-mock-oak, should be fixed in rev. 1756606

i will create a ticket for updating to the latest maven-jar-plugin in our parent pom.

the reason it failed only in sling-mock is that there a tests jar is additionally published as artifact. may affect other projects as well where this is the case.

stefan

>-----Original Message-----
>From: Stefan Seifert [mailto:sseifert@pro-vision.de]
>Sent: Wednesday, August 17, 2016 9:17 AM
>To: dev@sling.apache.org
>Subject: RE: Build failed in Jenkins: sling-trunk-1.8 #3788
>
>updated to maven-jar-plugin 3.0.2 in the sling-mock project in rev.
>1756581
>let's see if this helps on jenkins.
>
>stefan
>
>>-----Original Message-----
>>From: Konrad Windszus [mailto:konrad_w@gmx.de]
>>Sent: Wednesday, August 17, 2016 8:55 AM
>>To: dev@sling.apache.org
>>Subject: Re: Build failed in Jenkins: sling-trunk-1.8 #3788
>>
>>Probably it is related to https://issues.apache.org/jira/browse/MJAR-
>227
>><https://issues.apache.org/jira/browse/MJAR-227> and
>>https://github.com/codehaus-plexus/plexus-archiver/issues/5
>><https://github.com/codehaus-plexus/plexus-archiver/issues/5> which is
>only
>>fixed with maven-jar-plugin 3.0.0.
>>Try if upgrading to 3.0.1 helps in your case.
>>Konrad
>>
>>> On 17 Aug 2016, at 08:43, Stefan Seifert <ss...@pro-vision.de>
>wrote:
>>>
>>>
>>>> [INFO] Apache Sling Testing Sling Mock .................... FAILURE
>[
>>>> 54.843 s]
>>> ...
>>>> [ERROR] Failed to execute goal org.apache.maven.plugins:maven-jar-
>>>> plugin:3.0.0:test-jar (default) on project
>>org.apache.sling.testing.sling-
>>>> mock: Error assembling JAR: Problem creating jar: Execution
>exception:
>>Java
>>>> heap space -> [Help 1]
>>>
>>>
>>> hmm... this happens since i updated to sling parent pom 28 yesterday
>on
>>this project.
>>>
>>> can anyone reproduce this heap space problem on building locally? (i
>>cannot currently)
>>>
>>> is 512MB heap space not engough for the maven build?
>>>
>>> stefan
>
>



RE: Build failed in Jenkins: sling-trunk-1.8 #3788

Posted by Stefan Seifert <ss...@pro-vision.de>.
updated to maven-jar-plugin 3.0.2 in the sling-mock project in rev. 1756581  
let's see if this helps on jenkins.

stefan

>-----Original Message-----
>From: Konrad Windszus [mailto:konrad_w@gmx.de]
>Sent: Wednesday, August 17, 2016 8:55 AM
>To: dev@sling.apache.org
>Subject: Re: Build failed in Jenkins: sling-trunk-1.8 #3788
>
>Probably it is related to https://issues.apache.org/jira/browse/MJAR-227
><https://issues.apache.org/jira/browse/MJAR-227> and
>https://github.com/codehaus-plexus/plexus-archiver/issues/5
><https://github.com/codehaus-plexus/plexus-archiver/issues/5> which is only
>fixed with maven-jar-plugin 3.0.0.
>Try if upgrading to 3.0.1 helps in your case.
>Konrad
>
>> On 17 Aug 2016, at 08:43, Stefan Seifert <ss...@pro-vision.de> wrote:
>>
>>
>>> [INFO] Apache Sling Testing Sling Mock .................... FAILURE [
>>> 54.843 s]
>> ...
>>> [ERROR] Failed to execute goal org.apache.maven.plugins:maven-jar-
>>> plugin:3.0.0:test-jar (default) on project
>org.apache.sling.testing.sling-
>>> mock: Error assembling JAR: Problem creating jar: Execution exception:
>Java
>>> heap space -> [Help 1]
>>
>>
>> hmm... this happens since i updated to sling parent pom 28 yesterday on
>this project.
>>
>> can anyone reproduce this heap space problem on building locally? (i
>cannot currently)
>>
>> is 512MB heap space not engough for the maven build?
>>
>> stefan



Re: Build failed in Jenkins: sling-trunk-1.8 #3788

Posted by Konrad Windszus <ko...@gmx.de>.
Probably it is related to https://issues.apache.org/jira/browse/MJAR-227 <https://issues.apache.org/jira/browse/MJAR-227> and https://github.com/codehaus-plexus/plexus-archiver/issues/5 <https://github.com/codehaus-plexus/plexus-archiver/issues/5> which is only fixed with maven-jar-plugin 3.0.0.
Try if upgrading to 3.0.1 helps in your case.
Konrad

> On 17 Aug 2016, at 08:43, Stefan Seifert <ss...@pro-vision.de> wrote:
> 
> 
>> [INFO] Apache Sling Testing Sling Mock .................... FAILURE [
>> 54.843 s]
> ...
>> [ERROR] Failed to execute goal org.apache.maven.plugins:maven-jar-
>> plugin:3.0.0:test-jar (default) on project org.apache.sling.testing.sling-
>> mock: Error assembling JAR: Problem creating jar: Execution exception: Java
>> heap space -> [Help 1]
> 
> 
> hmm... this happens since i updated to sling parent pom 28 yesterday on this project.
> 
> can anyone reproduce this heap space problem on building locally? (i cannot currently)
> 
> is 512MB heap space not engough for the maven build?
> 
> stefan


RE: Build failed in Jenkins: sling-trunk-1.8 #3788

Posted by Stefan Seifert <ss...@pro-vision.de>.
>[INFO] Apache Sling Testing Sling Mock .................... FAILURE [
>54.843 s]
...
>[ERROR] Failed to execute goal org.apache.maven.plugins:maven-jar-
>plugin:3.0.0:test-jar (default) on project org.apache.sling.testing.sling-
>mock: Error assembling JAR: Problem creating jar: Execution exception: Java
>heap space -> [Help 1]


hmm... this happens since i updated to sling parent pom 28 yesterday on this project.

can anyone reproduce this heap space problem on building locally? (i cannot currently)

is 512MB heap space not engough for the maven build?

stefan

Build failed in Jenkins: sling-trunk-1.8 #3788

Posted by Apache Jenkins Server <je...@builds.apache.org>.
See <https://builds.apache.org/job/sling-trunk-1.8/3788/>

------------------------------------------
[...truncated 147240 lines...]
[INFO] Apache Sling System Bundle Extension: WS APIs ...... SUCCESS [  2.652 s]
[INFO] Apache Sling Dynamic Class Loader Support .......... SUCCESS [ 17.878 s]
[INFO] Apache Sling Commons FileSystem ClassLoader ........ SUCCESS [  9.018 s]
[INFO] Apache Sling Commons Java Compiler ................. SUCCESS [  9.074 s]
[INFO] Apache Sling JSON Library .......................... SUCCESS [ 10.220 s]
[INFO] Apache Sling SLF4J Implementation (Logback) ........ SUCCESS [ 52.873 s]
[INFO] Apache Sling OSGi LogService Implementation ........ SUCCESS [  9.781 s]
[INFO] Apache Sling MIME type mapping support ............. SUCCESS [  6.087 s]
[INFO] Apache Sling Content Detection Support ............. SUCCESS [01:18 min]
[INFO] Apache Sling Commons OSGi support .................. SUCCESS [ 10.256 s]
[INFO] Apache Sling Scheduler Support ..................... SUCCESS [  8.595 s]
[INFO] Apache Sling Thread Dumper ......................... SUCCESS [  3.036 s]
[INFO] Apache Sling Thread Support ........................ SUCCESS [  7.657 s]
[INFO] Apache Sling Metrics ............................... SUCCESS [  7.567 s]
[INFO] Apache Sling Authentication Service ................ SUCCESS [  5.892 s]
[INFO] Apache Sling Form Based Authentication Handler ..... SUCCESS [ 10.372 s]
[INFO] Apache Sling Engine Implementation ................. SUCCESS [ 21.583 s]
[INFO] Apache Sling Repository API Bundle ................. SUCCESS [  2.609 s]
[INFO] Apache Sling JCR Base Bundle ....................... SUCCESS [  6.059 s]
[INFO] Apache Sling Pax Exam Utilities .................... SUCCESS [ 49.239 s]
[INFO] Apache Sling Initial Content Loader ................ SUCCESS [01:29 min]
[INFO] Apache Sling Jackrabbit Embedded Repository ........ SUCCESS [ 10.669 s]
[INFO] Apache Sling Jackrabbit UserManager Support ........ SUCCESS [  4.001 s]
[INFO] Apache Sling Jackrabbit JSR-283 Access Control Manager Support SUCCESS [  2.988 s]
[INFO] Apache Sling Wrapper Bundle for the JCR API ........ SUCCESS [  3.064 s]
[INFO] Apache Sling JCR Resource Resolver ................. SUCCESS [ 43.968 s]
[INFO] Apache Sling Versioning Integration Tests .......... SUCCESS [ 12.418 s]
[INFO] Apache Sling JCR Repository Registration ........... SUCCESS [  4.850 s]
[INFO] Apache Sling Simple WebDAV Access to repositories .. SUCCESS [  4.019 s]
[INFO] Apache Sling DavEx Access to repositories .......... SUCCESS [  4.732 s]
[INFO] Apache Sling JCR WebConsole Bundle ................. SUCCESS [  2.550 s]
[INFO] Apache Sling Testing PaxExam ....................... SUCCESS [ 26.596 s]
[INFO] Apache Sling JCR Oak Repository Server ............. SUCCESS [ 31.683 s]
[INFO] Apache Sling SlingRepository Integration Tests ..... SUCCESS [01:41 min]
[INFO] Apache Sling RepoInit Parser ....................... SUCCESS [  5.381 s]
[INFO] Apache Sling RepoInit JCR module ................... SUCCESS [ 25.087 s]
[INFO] Apache Sling Servlet Resolver ...................... SUCCESS [  5.477 s]
[INFO] Apache Sling Default GET Servlets .................. SUCCESS [  5.604 s]
[INFO] Apache Sling Default POST Servlets ................. SUCCESS [ 10.605 s]
[INFO] Apache Sling Compat Servlets ....................... SUCCESS [  3.070 s]
[INFO] Apache Sling Scripting Implementation API .......... SUCCESS [  3.770 s]
[INFO] Apache Sling Scripting Core implementation ......... SUCCESS [ 27.581 s]
[INFO] Apache Sling Scripting JavaScript Support .......... SUCCESS [ 23.043 s]
[INFO] Apache Sling Scripting JSP Support ................. SUCCESS [  8.521 s]
[INFO] Apache Sling JSP Tag Library ....................... SUCCESS [  7.000 s]
[INFO] Apache Sling JSP Standard Tag Library .............. SUCCESS [  2.848 s]
[INFO] Apache Sling Scripting Sightly Compiler ............ SUCCESS [ 35.895 s]
[INFO] Apache Sling Scripting Sightly Java Compiler ....... SUCCESS [ 20.842 s]
[INFO] Apache Sling Scripting Sightly Engine .............. SUCCESS [ 24.321 s]
[INFO] Apache Sling Scripting Sightly JavaScript Use Provider SUCCESS [  3.812 s]
[INFO] Apache Sling Scripting Sightly Models Use Provider . SUCCESS [  2.886 s]
[INFO] Apache Sling Scripting Sightly Read-Eval-Print Loop Environment SUCCESS [  2.672 s]
[INFO] Apache Sling Scripting Sightly Integration Tests Content SUCCESS [  5.827 s]
[INFO] Apache Sling Launchpad Base ........................ SUCCESS [ 20.917 s]
[INFO] Apache Sling Subsystems Base Installer ............. SUCCESS [  3.888 s]
[INFO] Apache Sling Filesystem Resource Provider .......... SUCCESS [  3.139 s]
[INFO] Apache Sling Internationalization Support .......... SUCCESS [ 54.424 s]
[INFO] Apache Sling Installer WebConsole Plugin ........... SUCCESS [  2.622 s]
[INFO] Apache Sling JCR Installer ......................... SUCCESS [02:04 min]
[INFO] Apache Sling Launchpad Application Builder ......... SUCCESS [ 50.083 s]
[INFO] Apache Sling Scripting Sightly Integration Tests ... SUCCESS [02:50 min]
[INFO] Apache Sling Scripting Sightly Reactor ............. SUCCESS [  1.730 s]
[INFO] Apache Sling Adapter Manager Implementation ........ SUCCESS [  5.550 s]
[INFO] Apache Sling Bundle Resource Provider .............. SUCCESS [  2.813 s]
[INFO] Apache Sling Distributed Event Admin ............... SUCCESS [  3.733 s]
[INFO] Apache Sling Discovery API ......................... SUCCESS [  3.504 s]
[INFO] Apache Sling Discovery Commons ..................... SUCCESS [ 52.014 s]
[INFO] Apache Sling Discovery Base ........................ SUCCESS [ 51.877 s]
[INFO] Apache Sling Resource-Based Discovery Service ...... SUCCESS [03:00 min]
[INFO] Apache Sling Oak-Based Discovery Service ........... SUCCESS [02:34 min]
[INFO] Apache Sling Discovery Support Bundle .............. SUCCESS [  2.565 s]
[INFO] Apache Sling Discovery Standalone Implementation ... SUCCESS [  3.317 s]
[INFO] Apache Sling Event Support ......................... SUCCESS [24:49 min]
[INFO] Apache Sling Feature Flags ......................... SUCCESS [ 10.995 s]
[INFO] Apache Sling javax.activation bundle ............... SUCCESS [  2.644 s]
[INFO] Apache Sling Service User Mapper ................... SUCCESS [  4.044 s]
[INFO] Apache Sling Settings .............................. SUCCESS [  5.236 s]
[INFO] Apache Sling Web Console Branding .................. SUCCESS [  2.333 s]
[INFO] Apache Sling Web Console Security Provider ......... SUCCESS [  2.967 s]
[INFO] Apache Sling Explorer .............................. SUCCESS [  2.519 s]
[INFO] Apache Sling Health Check Core ..................... SUCCESS [02:47 min]
[INFO] Apache Sling Health Check Samples .................. SUCCESS [  4.715 s]
[INFO] Apache Sling Health Check Support Components ....... SUCCESS [  7.587 s]
[INFO] Apache Sling Health Check Webconsole Plugin ........ SUCCESS [  3.526 s]
[INFO] Apache Sling Health Check JUnit Bridge ............. SUCCESS [  3.626 s]
[INFO] Apache Sling Health Check Annotations .............. SUCCESS [  5.657 s]
[INFO] Apache Sling Health Check Integration Tests ........ SUCCESS [  7.875 s]
[INFO] Apache Sling Health Check Reactor POM .............. SUCCESS [  2.173 s]
[INFO] Apache Sling Resource Access Security .............. SUCCESS [  2.802 s]
[INFO] Apache Sling Resource Access Security Integration Tests SUCCESS [ 34.770 s]
[INFO] Apache Sling Models API ............................ SUCCESS [  2.911 s]
[INFO] Apache Sling Models Implementation ................. SUCCESS [  8.488 s]
[INFO] Apache Sling Models Integration Tests .............. SUCCESS [ 40.830 s]
[INFO] Apache Sling XSS Protection Bundle ................. SUCCESS [ 14.300 s]
[INFO] Apache Sling JUnit Core ............................ SUCCESS [  4.313 s]
[INFO] Apache Sling JUnit Tests Teleporter ................ SUCCESS [  8.529 s]
[INFO] Apache Sling Resource Builder ...................... SUCCESS [ 35.630 s]
[INFO] Apache Sling Servlet Helpers ....................... SUCCESS [  4.651 s]
[INFO] Apache Sling RepoInit Integration Tests ............ SUCCESS [ 27.078 s]
[INFO] Apache Sling RepoInit Reactor ...................... SUCCESS [  1.710 s]
[INFO] Apache Sling Test Tools ............................ SUCCESS [  4.186 s]
[INFO] Apache Sling Testing Clients ....................... SUCCESS [  8.972 s]
[INFO] Apache Sling Testing Hamcrest ...................... SUCCESS [  4.352 s]
[INFO] Apache Sling Server Setup Tools .................... SUCCESS [  4.873 s]
[INFO] Apache Sling Testing Rules ......................... SUCCESS [  6.751 s]
[INFO] Apache Sling JUnit Scriptable Tests Provider ....... SUCCESS [  3.886 s]
[INFO] Apache Sling JUnit Health Checks ................... SUCCESS [  3.113 s]
[INFO] Apache Sling JUnit Remote Tests Runners ............ SUCCESS [  3.987 s]
[INFO] Apache Sling JUnit Performance ..................... SUCCESS [  3.511 s]
[INFO] Apache Sling Testing Mock Log Configuration ........ SUCCESS [  2.613 s]
[INFO] Apache Sling Testing Resource Resolver Mock ........ SUCCESS [  3.667 s]
[INFO] Apache Sling Testing JCR Mock ...................... SUCCESS [  5.933 s]
[INFO] Apache Sling Testing OSGi Mock ..................... SUCCESS [ 10.069 s]
[INFO] Apache Sling Testing Sling Mock .................... FAILURE [ 54.843 s]
[INFO] Apache Sling Testing Sling Mock Oak-based Resource Resolver SKIPPED
[INFO] Apache Sling Testing Mocks Modules Reactor ......... SKIPPED
[INFO] Apache Sling Testing - sample bundle with integration tests SKIPPED
[INFO] Apache Sling Testing - sample module with integration tests SKIPPED
[INFO] Apache Sling Testing Modules Reactor ............... SKIPPED
[INFO] Apache Sling Installer ............................. SKIPPED
[INFO] Apache Sling File Installer ........................ SKIPPED
[INFO] Apache Sling Installer Configuration Admin Support . SKIPPED
[INFO] Apache Sling Deployment Package Installer .......... SKIPPED
[INFO] Apache Sling Subsystems Installer .................. SKIPPED
[INFO] Apache Sling Installer Integration Tests ........... SKIPPED
[INFO] Apache Sling Launchpad API ......................... SKIPPED
[INFO] Apache Sling Launchpad Installer ................... SKIPPED
[INFO] Apache Sling Launchpad Content ..................... SKIPPED
[INFO] Apache Sling Validation Framework API .............. SKIPPED
[INFO] Apache Sling Validation Framework Core Implementation SKIPPED
[INFO] Apache Sling Validation Framework Testing Services . SKIPPED
[INFO] Apache Sling Validation Framework Integration Tests  SKIPPED
[INFO] Apache Sling Validation Framework Examples ......... SKIPPED
[INFO] Apache Sling Validation Framework Builder .......... SKIPPED
[INFO] Apache Sling Models Validation Implementation ...... SKIPPED
[INFO] Apache Sling Launchpad Testing Services ............ SKIPPED
[INFO] Apache Sling Launchpad Testing Services WAR ........ SKIPPED
[INFO] Apache Sling Launchpad Testing Fragment Bundle ..... SKIPPED
[INFO] Apache Sling Launchpad Test Bundles ................ SKIPPED
[INFO] Apache Sling Integration Tests ..................... SKIPPED
[INFO] Apache Sling Launchpad Testing ..................... SKIPPED
[INFO] Apache Sling (Builder) ............................. SKIPPED
[INFO] ------------------------------------------------------------------------
[INFO] BUILD FAILURE
[INFO] ------------------------------------------------------------------------
[INFO] Total time: 01:07 h
[INFO] Finished at: 2016-08-17T01:51:10+00:00
[INFO] Final Memory: 380M/466M
[INFO] ------------------------------------------------------------------------
Waiting for Jenkins to finish collecting data
[ERROR] Failed to execute goal org.apache.maven.plugins:maven-jar-plugin:3.0.0:test-jar (default) on project org.apache.sling.testing.sling-mock: Error assembling JAR: Problem creating jar: Execution exception: Java heap space -> [Help 1]
[ERROR] 
[ERROR] To see the full stack trace of the errors, re-run Maven with the -e switch.
[ERROR] Re-run Maven using the -X switch to enable full debug logging.
[ERROR] 
[ERROR] For more information about the errors and possible solutions, please read the following articles:
[ERROR] [Help 1] http://cwiki.apache.org/confluence/display/MAVEN/MojoExecutionException
[ERROR] 
[ERROR] After correcting the problems, you can resume the build with the command
[ERROR]   mvn <goals> -rf :org.apache.sling.testing.sling-mock
channel stopped
Found 18 test results
Found 95 test results
Found 45 test results
Found 8 test results
Found 4 test results
Found 2 test results
Found 17 test results
Found 4 test results
Found 94 test results
Found 44 test results
Found 10 test results
Found 21 test results
Found 9 test results
Found 36 test results
Found 42 test results
Found 22 test results
Found 10 test results
Found 31 test results
Found 83 test results
Found 50 test results
Found 30 test results
Found 5 test results
Found 95 test results
Found 77 test results
Found failed test junit/org.apache.sling.event.it/ChaosTest
Found failed test junit/org.apache.sling.event.it/ChaosTest/testDoChaos
Found 4 test results
Found 94 test results
Found 3 test results
Found 8 test results
Found 2 test results
Found 13 test results
Found 31 test results
Found failed test junit/org.apache.sling.i18n.it/ResourceBundleProviderIT
Found failed test junit/org.apache.sling.i18n.it/ResourceBundleProviderIT/testChangesDetection
Found failed test junit/org.apache.sling.i18n.it/ResourceBundleProviderIT/test_dummy
Found 3 test results
Found 38 test results
Found 9 test results
Found 96 test results
Found 8 test results
Found 17 test results
Found 45 test results
Found 34 test results
Found 9 test results
Found 94 test results
Found 37 test results
Found 4 test results
Found 16 test results
Found 3 test results
Found 2 test results
Found 23 test results
Found 3 test results
Found 75 test results
Found 184 test results
Found 16 test results
Found 10 test results
Found 49 test results
Found 8 test results
Found 35 test results
Found 21 test results
Found 36 test results
Found 210 test results
Found 24 test results
Found 81 test results
Found 27 test results
Found 24 test results
Found 13 test results
Found 2 test results
Found 392 test results
Found 17 test results
Found 58 test results
Found 28 test results
Found 44 test results
Found 92 test results
Found 18 test results
Found 164 test results
Found 8 test results
Found 70 test results
Found 103 test results
Found 18 test results
Found 50 test results
Found 77 test results
Found 13 test results
Found 154 test results
Found 26 test results
Found 2 test results
Found 27 test results