You are viewing a plain text version of this content. The canonical link for it is here.
Posted to dev@bookkeeper.apache.org by Apache Jenkins Server <je...@builds.apache.org> on 2014/09/18 07:30:46 UTC

Build failed in Jenkins: bookkeeper-trunk #784

See <https://builds.apache.org/job/bookkeeper-trunk/784/changes>

Changes:

[sijie] BOOKKEEPER-782: Use builder pattern for Cookie (rakeshr via sijie)

[sijie] BOOKKEEPER-784: BookKeeperCloseTest#testLedgerCheck is failing intermittently (ivank via sijie)

[sijie] BOOKKEEPER-785: Fix javadoc warnings in trunk (ivank via sijie)

------------------------------------------
[...truncated 1418 lines...]
[INFO] Done FindBugs Analysis....
[INFO] 
[INFO] <<< findbugs-maven-plugin:2.5.2:check (default-cli) @ bookkeeper-benchmark <<<
[INFO] 
[INFO] --- findbugs-maven-plugin:2.5.2:check (default-cli) @ bookkeeper-benchmark ---
[INFO] BugInstance size is 0
[INFO] Error size is 0
[INFO] No errors/warnings found
[INFO]                                                                         
[INFO] ------------------------------------------------------------------------
[INFO] Building Stats provider for twitter-stats package 4.3.0-SNAPSHOT
[INFO] ------------------------------------------------------------------------
[INFO] 
[INFO] --- maven-clean-plugin:2.4.1:clean (default-clean) @ twitter-science-provider ---
[INFO] 
[INFO] --- apache-rat-plugin:0.7:check (default-cli) @ twitter-science-provider ---
[INFO] Exclude: .git/**/*
[INFO] Exclude: **/.svn/**/*
[INFO] Exclude: CHANGES.txt
[INFO] Exclude: **/README
[INFO] Exclude: **/apidocs/*
[INFO] Exclude: test-patch/**/*
[INFO] 
[INFO] --- maven-remote-resources-plugin:1.1:process (default) @ twitter-science-provider ---
[INFO] 
[INFO] --- maven-resources-plugin:2.4.3:resources (default-resources) @ twitter-science-provider ---
[INFO] Using 'UTF-8' encoding to copy filtered resources.
[INFO] skip non existing resourceDirectory <https://builds.apache.org/job/bookkeeper-trunk/ws/bookkeeper-stats-providers/twitter-science-provider/src/main/resources>
[INFO] Copying 3 resources
[INFO] 
[INFO] --- maven-compiler-plugin:3.0:compile (default-compile) @ twitter-science-provider ---
[INFO] Changes detected - recompiling the module!
[INFO] Compiling 5 source files to <https://builds.apache.org/job/bookkeeper-trunk/ws/bookkeeper-stats-providers/twitter-science-provider/target/classes>
[INFO] 
[INFO] --- maven-resources-plugin:2.4.3:testResources (default-testResources) @ twitter-science-provider ---
[INFO] Using 'UTF-8' encoding to copy filtered resources.
[INFO] skip non existing resourceDirectory <https://builds.apache.org/job/bookkeeper-trunk/ws/bookkeeper-stats-providers/twitter-science-provider/src/test/resources>
[INFO] Copying 3 resources
[INFO] 
[INFO] --- maven-compiler-plugin:3.0:testCompile (default-testCompile) @ twitter-science-provider ---
[INFO] No sources to compile
[INFO] 
[INFO] --- maven-surefire-plugin:2.9:test (default-test) @ twitter-science-provider ---
[INFO] Surefire report directory: <https://builds.apache.org/job/bookkeeper-trunk/ws/bookkeeper-stats-providers/twitter-science-provider/target/surefire-reports>

-------------------------------------------------------
 T E S T S
-------------------------------------------------------

-------------------------------------------------------
 T E S T S
-------------------------------------------------------

Results :

Tests run: 0, Failures: 0, Errors: 0, Skipped: 0

[INFO] 
[INFO] --- maven-jar-plugin:2.3.1:jar (default-jar) @ twitter-science-provider ---
[INFO] Building jar: <https://builds.apache.org/job/bookkeeper-trunk/ws/bookkeeper-stats-providers/twitter-science-provider/target/twitter-science-provider-4.3.0-SNAPSHOT.jar>
[INFO] 
[INFO] >>> findbugs-maven-plugin:2.5.2:check (default-cli) @ twitter-science-provider >>>
[INFO] 
[INFO] --- findbugs-maven-plugin:2.5.2:findbugs (findbugs) @ twitter-science-provider ---
[INFO] Fork Value is true
[INFO] Done FindBugs Analysis....
[INFO] 
[INFO] <<< findbugs-maven-plugin:2.5.2:check (default-cli) @ twitter-science-provider <<<
[INFO] 
[INFO] --- findbugs-maven-plugin:2.5.2:check (default-cli) @ twitter-science-provider ---
[INFO] BugInstance size is 0
[INFO] Error size is 0
[INFO] No errors/warnings found
[INFO]                                                                         
[INFO] ------------------------------------------------------------------------
[INFO] Building Stats provider for twitter-ostrich package 4.3.0-SNAPSHOT
[INFO] ------------------------------------------------------------------------
[INFO] 
[INFO] --- maven-clean-plugin:2.4.1:clean (default-clean) @ twitter-ostrich-provider ---
[INFO] 
[INFO] --- apache-rat-plugin:0.7:check (default-cli) @ twitter-ostrich-provider ---
[INFO] Exclude: .git/**/*
[INFO] Exclude: **/.svn/**/*
[INFO] Exclude: CHANGES.txt
[INFO] Exclude: **/README
[INFO] Exclude: **/apidocs/*
[INFO] Exclude: test-patch/**/*
[INFO] 
[INFO] --- maven-remote-resources-plugin:1.1:process (default) @ twitter-ostrich-provider ---
[INFO] 
[INFO] --- maven-resources-plugin:2.4.3:resources (default-resources) @ twitter-ostrich-provider ---
[INFO] Using 'UTF-8' encoding to copy filtered resources.
[INFO] skip non existing resourceDirectory <https://builds.apache.org/job/bookkeeper-trunk/ws/bookkeeper-stats-providers/twitter-ostrich-provider/src/main/resources>
[INFO] Copying 3 resources
[INFO] 
[INFO] --- maven-compiler-plugin:3.0:compile (default-compile) @ twitter-ostrich-provider ---
[INFO] Changes detected - recompiling the module!
[INFO] Compiling 4 source files to <https://builds.apache.org/job/bookkeeper-trunk/ws/bookkeeper-stats-providers/twitter-ostrich-provider/target/classes>
[INFO] 
[INFO] --- maven-resources-plugin:2.4.3:testResources (default-testResources) @ twitter-ostrich-provider ---
[INFO] Using 'UTF-8' encoding to copy filtered resources.
[INFO] skip non existing resourceDirectory <https://builds.apache.org/job/bookkeeper-trunk/ws/bookkeeper-stats-providers/twitter-ostrich-provider/src/test/resources>
[INFO] Copying 3 resources
[INFO] 
[INFO] --- maven-compiler-plugin:3.0:testCompile (default-testCompile) @ twitter-ostrich-provider ---
[INFO] No sources to compile
[INFO] 
[INFO] --- maven-surefire-plugin:2.9:test (default-test) @ twitter-ostrich-provider ---
[INFO] Surefire report directory: <https://builds.apache.org/job/bookkeeper-trunk/ws/bookkeeper-stats-providers/twitter-ostrich-provider/target/surefire-reports>

-------------------------------------------------------
 T E S T S
-------------------------------------------------------

-------------------------------------------------------
 T E S T S
-------------------------------------------------------

Results :

Tests run: 0, Failures: 0, Errors: 0, Skipped: 0

[INFO] 
[INFO] --- maven-jar-plugin:2.3.1:jar (default-jar) @ twitter-ostrich-provider ---
[INFO] Building jar: <https://builds.apache.org/job/bookkeeper-trunk/ws/bookkeeper-stats-providers/twitter-ostrich-provider/target/twitter-ostrich-provider-4.3.0-SNAPSHOT.jar>
[INFO] 
[INFO] >>> findbugs-maven-plugin:2.5.2:check (default-cli) @ twitter-ostrich-provider >>>
[INFO] 
[INFO] --- findbugs-maven-plugin:2.5.2:findbugs (findbugs) @ twitter-ostrich-provider ---
[INFO] Fork Value is true
[INFO] Done FindBugs Analysis....
[INFO] 
[INFO] <<< findbugs-maven-plugin:2.5.2:check (default-cli) @ twitter-ostrich-provider <<<
[INFO] 
[INFO] --- findbugs-maven-plugin:2.5.2:check (default-cli) @ twitter-ostrich-provider ---
[INFO] BugInstance size is 0
[INFO] Error size is 0
[INFO] No errors/warnings found
[INFO]                                                                         
[INFO] ------------------------------------------------------------------------
[INFO] Building Stats provider for codahale metrics 4.3.0-SNAPSHOT
[INFO] ------------------------------------------------------------------------
[INFO] 
[INFO] --- maven-clean-plugin:2.4.1:clean (default-clean) @ codahale-metrics-provider ---
[INFO] 
[INFO] --- apache-rat-plugin:0.7:check (default-cli) @ codahale-metrics-provider ---
[INFO] Exclude: .git/**/*
[INFO] Exclude: **/.svn/**/*
[INFO] Exclude: CHANGES.txt
[INFO] Exclude: **/README
[INFO] Exclude: **/apidocs/*
[INFO] Exclude: test-patch/**/*
[INFO] 
[INFO] --- maven-remote-resources-plugin:1.1:process (default) @ codahale-metrics-provider ---
[INFO] 
[INFO] --- maven-resources-plugin:2.4.3:resources (default-resources) @ codahale-metrics-provider ---
[INFO] Using 'UTF-8' encoding to copy filtered resources.
[INFO] skip non existing resourceDirectory <https://builds.apache.org/job/bookkeeper-trunk/ws/bookkeeper-stats-providers/codahale-metrics-provider/src/main/resources>
[INFO] Copying 3 resources
[INFO] 
[INFO] --- maven-compiler-plugin:3.0:compile (default-compile) @ codahale-metrics-provider ---
[INFO] Changes detected - recompiling the module!
[INFO] Compiling 3 source files to <https://builds.apache.org/job/bookkeeper-trunk/ws/bookkeeper-stats-providers/codahale-metrics-provider/target/classes>
[INFO] 
[INFO] --- maven-resources-plugin:2.4.3:testResources (default-testResources) @ codahale-metrics-provider ---
[INFO] Using 'UTF-8' encoding to copy filtered resources.
[INFO] skip non existing resourceDirectory <https://builds.apache.org/job/bookkeeper-trunk/ws/bookkeeper-stats-providers/codahale-metrics-provider/src/test/resources>
[INFO] Copying 3 resources
[INFO] 
[INFO] --- maven-compiler-plugin:3.0:testCompile (default-testCompile) @ codahale-metrics-provider ---
[INFO] No sources to compile
[INFO] 
[INFO] --- maven-surefire-plugin:2.9:test (default-test) @ codahale-metrics-provider ---
[INFO] Surefire report directory: <https://builds.apache.org/job/bookkeeper-trunk/ws/bookkeeper-stats-providers/codahale-metrics-provider/target/surefire-reports>

-------------------------------------------------------
 T E S T S
-------------------------------------------------------

-------------------------------------------------------
 T E S T S
-------------------------------------------------------

Results :

Tests run: 0, Failures: 0, Errors: 0, Skipped: 0

[INFO] 
[INFO] --- maven-jar-plugin:2.3.1:jar (default-jar) @ codahale-metrics-provider ---
[INFO] Building jar: <https://builds.apache.org/job/bookkeeper-trunk/ws/bookkeeper-stats-providers/codahale-metrics-provider/target/codahale-metrics-provider-4.3.0-SNAPSHOT.jar>
[INFO] 
[INFO] >>> findbugs-maven-plugin:2.5.2:check (default-cli) @ codahale-metrics-provider >>>
[INFO] 
[INFO] --- findbugs-maven-plugin:2.5.2:findbugs (findbugs) @ codahale-metrics-provider ---
[INFO] Fork Value is true
     [java] Warnings generated: 1
[INFO] Done FindBugs Analysis....
[INFO] 
[INFO] <<< findbugs-maven-plugin:2.5.2:check (default-cli) @ codahale-metrics-provider <<<
[INFO] 
[INFO] --- findbugs-maven-plugin:2.5.2:check (default-cli) @ codahale-metrics-provider ---
[INFO] BugInstance size is 1
[INFO] Error size is 0
[INFO] Total bugs: 1
[INFO] Inconsistent synchronization of org.apache.bookkeeper.stats.CodahaleMetricsProvider.metrics; locked 83% of time ["org.apache.bookkeeper.stats.CodahaleMetricsProvider"] At CodahaleMetricsProvider.java:[lines 49-145]
[INFO] ------------------------------------------------------------------------
[INFO] Reactor Summary:
[INFO] 
[INFO] bookkeeper ........................................ SUCCESS [  2.394 s]
[INFO] compability dependencies .......................... SUCCESS [  0.074 s]
[INFO] bookkeeper-server-compat400 ....................... SUCCESS [  6.073 s]
[INFO] bookkeeper-server-compat410 ....................... SUCCESS [  2.437 s]
[INFO] bookkeeper-server-compat420 ....................... SUCCESS [  2.628 s]
[INFO] hedwig-server-compat400 ........................... SUCCESS [  3.921 s]
[INFO] hedwig-server-compat410 ........................... SUCCESS [  3.764 s]
[INFO] hedwig-server-compat420 ........................... SUCCESS [  4.270 s]
[INFO] hedwig-protocol ................................... SUCCESS [ 25.564 s]
[INFO] Stats API for bookkeeper .......................... SUCCESS [  8.373 s]
[INFO] bookkeeper-server ................................. SUCCESS [14:34 min]
[INFO] hedwig-client ..................................... SUCCESS [ 22.378 s]
[INFO] hedwig-server ..................................... SUCCESS [11:14 min]
[INFO] hedwig-client-jms ................................. SUCCESS [ 39.793 s]
[INFO] bookkeeper-benchmark .............................. SUCCESS [01:10 min]
[INFO] Stats provider for twitter-stats package .......... SUCCESS [  9.705 s]
[INFO] Stats provider for twitter-ostrich package ........ SUCCESS [  8.880 s]
[INFO] Stats provider for codahale metrics ............... FAILURE [  8.912 s]
[INFO] bookkeeper-stats-providers ........................ SKIPPED
[INFO] ------------------------------------------------------------------------
[INFO] BUILD FAILURE
[INFO] ------------------------------------------------------------------------
[INFO] Total time: 29:29 min
[INFO] Finished at: 2014-09-18T05:30:33+00:00
[INFO] Final Memory: 67M/933M
[INFO] ------------------------------------------------------------------------
[ERROR] Failed to execute goal org.codehaus.mojo:findbugs-maven-plugin:2.5.2:check (default-cli) on project codahale-metrics-provider: failed with 1 bugs and 0 errors -> [Help 1]
[ERROR] 
[ERROR] To see the full stack trace of the errors, re-run Maven with the -e switch.
[ERROR] Re-run Maven using the -X switch to enable full debug logging.
[ERROR] 
[ERROR] For more information about the errors and possible solutions, please read the following articles:
[ERROR] [Help 1] http://cwiki.apache.org/confluence/display/MAVEN/MojoExecutionException
[ERROR] 
[ERROR] After correcting the problems, you can resume the build with the command
[ERROR]   mvn <goals> -rf :codahale-metrics-provider
Build step 'Execute shell' marked build as failure
Recording test results
Updating BOOKKEEPER-784
Updating BOOKKEEPER-785
Updating BOOKKEEPER-782

Re: Jenkins build is back to normal : bookkeeper-trunk #789

Posted by Flavio Junqueira <fp...@yahoo.com.INVALID>.
Yey!


On Tuesday, September 23, 2014 12:30 AM, Sijie Guo <gu...@gmail.com> wrote:
 

>
>
>finally, we are back to normal now.
>
>On Mon, Sep 22, 2014 at 3:46 AM, Apache Jenkins Server <
>jenkins@builds.apache.org> wrote:
>
>> See <https://builds.apache.org/job/bookkeeper-trunk/789/changes>
>>
>>
>
>
>

Re: Jenkins build is back to normal : bookkeeper-trunk #789

Posted by Sijie Guo <gu...@gmail.com>.
finally, we are back to normal now.

On Mon, Sep 22, 2014 at 3:46 AM, Apache Jenkins Server <
jenkins@builds.apache.org> wrote:

> See <https://builds.apache.org/job/bookkeeper-trunk/789/changes>
>
>

Jenkins build is back to normal : bookkeeper-trunk #789

Posted by Apache Jenkins Server <je...@builds.apache.org>.
See <https://builds.apache.org/job/bookkeeper-trunk/789/changes>


Build failed in Jenkins: bookkeeper-trunk #788

Posted by Apache Jenkins Server <je...@builds.apache.org>.
See <https://builds.apache.org/job/bookkeeper-trunk/788/>

------------------------------------------
[...truncated 1406 lines...]
[INFO] 
[INFO] --- findbugs-maven-plugin:2.5.2:findbugs (findbugs) @ bookkeeper-benchmark ---
[INFO] Fork Value is true
[INFO] Done FindBugs Analysis....
[INFO] 
[INFO] <<< findbugs-maven-plugin:2.5.2:check (default-cli) @ bookkeeper-benchmark <<<
[INFO] 
[INFO] --- findbugs-maven-plugin:2.5.2:check (default-cli) @ bookkeeper-benchmark ---
[INFO] BugInstance size is 0
[INFO] Error size is 0
[INFO] No errors/warnings found
[INFO]                                                                         
[INFO] ------------------------------------------------------------------------
[INFO] Building Stats provider for twitter-stats package 4.3.0-SNAPSHOT
[INFO] ------------------------------------------------------------------------
[INFO] 
[INFO] --- maven-clean-plugin:2.4.1:clean (default-clean) @ twitter-science-provider ---
[INFO] 
[INFO] --- apache-rat-plugin:0.7:check (default-cli) @ twitter-science-provider ---
[INFO] Exclude: .git/**/*
[INFO] Exclude: **/.svn/**/*
[INFO] Exclude: CHANGES.txt
[INFO] Exclude: **/README
[INFO] Exclude: **/apidocs/*
[INFO] Exclude: test-patch/**/*
[INFO] 
[INFO] --- maven-remote-resources-plugin:1.1:process (default) @ twitter-science-provider ---
[INFO] 
[INFO] --- maven-resources-plugin:2.4.3:resources (default-resources) @ twitter-science-provider ---
[INFO] Using 'UTF-8' encoding to copy filtered resources.
[INFO] skip non existing resourceDirectory <https://builds.apache.org/job/bookkeeper-trunk/ws/bookkeeper-stats-providers/twitter-science-provider/src/main/resources>
[INFO] Copying 3 resources
[INFO] 
[INFO] --- maven-compiler-plugin:3.0:compile (default-compile) @ twitter-science-provider ---
[INFO] Changes detected - recompiling the module!
[INFO] Compiling 5 source files to <https://builds.apache.org/job/bookkeeper-trunk/ws/bookkeeper-stats-providers/twitter-science-provider/target/classes>
[INFO] 
[INFO] --- maven-resources-plugin:2.4.3:testResources (default-testResources) @ twitter-science-provider ---
[INFO] Using 'UTF-8' encoding to copy filtered resources.
[INFO] skip non existing resourceDirectory <https://builds.apache.org/job/bookkeeper-trunk/ws/bookkeeper-stats-providers/twitter-science-provider/src/test/resources>
[INFO] Copying 3 resources
[INFO] 
[INFO] --- maven-compiler-plugin:3.0:testCompile (default-testCompile) @ twitter-science-provider ---
[INFO] No sources to compile
[INFO] 
[INFO] --- maven-surefire-plugin:2.9:test (default-test) @ twitter-science-provider ---
[INFO] Surefire report directory: <https://builds.apache.org/job/bookkeeper-trunk/ws/bookkeeper-stats-providers/twitter-science-provider/target/surefire-reports>

-------------------------------------------------------
 T E S T S
-------------------------------------------------------

-------------------------------------------------------
 T E S T S
-------------------------------------------------------

Results :

Tests run: 0, Failures: 0, Errors: 0, Skipped: 0

[INFO] 
[INFO] --- maven-jar-plugin:2.3.1:jar (default-jar) @ twitter-science-provider ---
[INFO] Building jar: <https://builds.apache.org/job/bookkeeper-trunk/ws/bookkeeper-stats-providers/twitter-science-provider/target/twitter-science-provider-4.3.0-SNAPSHOT.jar>
[INFO] 
[INFO] >>> findbugs-maven-plugin:2.5.2:check (default-cli) @ twitter-science-provider >>>
[INFO] 
[INFO] --- findbugs-maven-plugin:2.5.2:findbugs (findbugs) @ twitter-science-provider ---
[INFO] Fork Value is true
[INFO] Done FindBugs Analysis....
[INFO] 
[INFO] <<< findbugs-maven-plugin:2.5.2:check (default-cli) @ twitter-science-provider <<<
[INFO] 
[INFO] --- findbugs-maven-plugin:2.5.2:check (default-cli) @ twitter-science-provider ---
[INFO] BugInstance size is 0
[INFO] Error size is 0
[INFO] No errors/warnings found
[INFO]                                                                         
[INFO] ------------------------------------------------------------------------
[INFO] Building Stats provider for twitter-ostrich package 4.3.0-SNAPSHOT
[INFO] ------------------------------------------------------------------------
[INFO] 
[INFO] --- maven-clean-plugin:2.4.1:clean (default-clean) @ twitter-ostrich-provider ---
[INFO] 
[INFO] --- apache-rat-plugin:0.7:check (default-cli) @ twitter-ostrich-provider ---
[INFO] Exclude: .git/**/*
[INFO] Exclude: **/.svn/**/*
[INFO] Exclude: CHANGES.txt
[INFO] Exclude: **/README
[INFO] Exclude: **/apidocs/*
[INFO] Exclude: test-patch/**/*
[INFO] 
[INFO] --- maven-remote-resources-plugin:1.1:process (default) @ twitter-ostrich-provider ---
[INFO] 
[INFO] --- maven-resources-plugin:2.4.3:resources (default-resources) @ twitter-ostrich-provider ---
[INFO] Using 'UTF-8' encoding to copy filtered resources.
[INFO] skip non existing resourceDirectory <https://builds.apache.org/job/bookkeeper-trunk/ws/bookkeeper-stats-providers/twitter-ostrich-provider/src/main/resources>
[INFO] Copying 3 resources
[INFO] 
[INFO] --- maven-compiler-plugin:3.0:compile (default-compile) @ twitter-ostrich-provider ---
[INFO] Changes detected - recompiling the module!
[INFO] Compiling 4 source files to <https://builds.apache.org/job/bookkeeper-trunk/ws/bookkeeper-stats-providers/twitter-ostrich-provider/target/classes>
[INFO] 
[INFO] --- maven-resources-plugin:2.4.3:testResources (default-testResources) @ twitter-ostrich-provider ---
[INFO] Using 'UTF-8' encoding to copy filtered resources.
[INFO] skip non existing resourceDirectory <https://builds.apache.org/job/bookkeeper-trunk/ws/bookkeeper-stats-providers/twitter-ostrich-provider/src/test/resources>
[INFO] Copying 3 resources
[INFO] 
[INFO] --- maven-compiler-plugin:3.0:testCompile (default-testCompile) @ twitter-ostrich-provider ---
[INFO] No sources to compile
[INFO] 
[INFO] --- maven-surefire-plugin:2.9:test (default-test) @ twitter-ostrich-provider ---
[INFO] Surefire report directory: <https://builds.apache.org/job/bookkeeper-trunk/ws/bookkeeper-stats-providers/twitter-ostrich-provider/target/surefire-reports>

-------------------------------------------------------
 T E S T S
-------------------------------------------------------

-------------------------------------------------------
 T E S T S
-------------------------------------------------------

Results :

Tests run: 0, Failures: 0, Errors: 0, Skipped: 0

[INFO] 
[INFO] --- maven-jar-plugin:2.3.1:jar (default-jar) @ twitter-ostrich-provider ---
[INFO] Building jar: <https://builds.apache.org/job/bookkeeper-trunk/ws/bookkeeper-stats-providers/twitter-ostrich-provider/target/twitter-ostrich-provider-4.3.0-SNAPSHOT.jar>
[INFO] 
[INFO] >>> findbugs-maven-plugin:2.5.2:check (default-cli) @ twitter-ostrich-provider >>>
[INFO] 
[INFO] --- findbugs-maven-plugin:2.5.2:findbugs (findbugs) @ twitter-ostrich-provider ---
[INFO] Fork Value is true
[INFO] Done FindBugs Analysis....
[INFO] 
[INFO] <<< findbugs-maven-plugin:2.5.2:check (default-cli) @ twitter-ostrich-provider <<<
[INFO] 
[INFO] --- findbugs-maven-plugin:2.5.2:check (default-cli) @ twitter-ostrich-provider ---
[INFO] BugInstance size is 0
[INFO] Error size is 0
[INFO] No errors/warnings found
[INFO]                                                                         
[INFO] ------------------------------------------------------------------------
[INFO] Building Stats provider for codahale metrics 4.3.0-SNAPSHOT
[INFO] ------------------------------------------------------------------------
[INFO] 
[INFO] --- maven-clean-plugin:2.4.1:clean (default-clean) @ codahale-metrics-provider ---
[INFO] 
[INFO] --- apache-rat-plugin:0.7:check (default-cli) @ codahale-metrics-provider ---
[INFO] Exclude: .git/**/*
[INFO] Exclude: **/.svn/**/*
[INFO] Exclude: CHANGES.txt
[INFO] Exclude: **/README
[INFO] Exclude: **/apidocs/*
[INFO] Exclude: test-patch/**/*
[INFO] 
[INFO] --- maven-remote-resources-plugin:1.1:process (default) @ codahale-metrics-provider ---
[INFO] 
[INFO] --- maven-resources-plugin:2.4.3:resources (default-resources) @ codahale-metrics-provider ---
[INFO] Using 'UTF-8' encoding to copy filtered resources.
[INFO] skip non existing resourceDirectory <https://builds.apache.org/job/bookkeeper-trunk/ws/bookkeeper-stats-providers/codahale-metrics-provider/src/main/resources>
[INFO] Copying 3 resources
[INFO] 
[INFO] --- maven-compiler-plugin:3.0:compile (default-compile) @ codahale-metrics-provider ---
[INFO] Changes detected - recompiling the module!
[INFO] Compiling 3 source files to <https://builds.apache.org/job/bookkeeper-trunk/ws/bookkeeper-stats-providers/codahale-metrics-provider/target/classes>
[INFO] 
[INFO] --- maven-resources-plugin:2.4.3:testResources (default-testResources) @ codahale-metrics-provider ---
[INFO] Using 'UTF-8' encoding to copy filtered resources.
[INFO] skip non existing resourceDirectory <https://builds.apache.org/job/bookkeeper-trunk/ws/bookkeeper-stats-providers/codahale-metrics-provider/src/test/resources>
[INFO] Copying 3 resources
[INFO] 
[INFO] --- maven-compiler-plugin:3.0:testCompile (default-testCompile) @ codahale-metrics-provider ---
[INFO] No sources to compile
[INFO] 
[INFO] --- maven-surefire-plugin:2.9:test (default-test) @ codahale-metrics-provider ---
[INFO] Surefire report directory: <https://builds.apache.org/job/bookkeeper-trunk/ws/bookkeeper-stats-providers/codahale-metrics-provider/target/surefire-reports>

-------------------------------------------------------
 T E S T S
-------------------------------------------------------

-------------------------------------------------------
 T E S T S
-------------------------------------------------------

Results :

Tests run: 0, Failures: 0, Errors: 0, Skipped: 0

[INFO] 
[INFO] --- maven-jar-plugin:2.3.1:jar (default-jar) @ codahale-metrics-provider ---
[INFO] Building jar: <https://builds.apache.org/job/bookkeeper-trunk/ws/bookkeeper-stats-providers/codahale-metrics-provider/target/codahale-metrics-provider-4.3.0-SNAPSHOT.jar>
[INFO] 
[INFO] >>> findbugs-maven-plugin:2.5.2:check (default-cli) @ codahale-metrics-provider >>>
[INFO] 
[INFO] --- findbugs-maven-plugin:2.5.2:findbugs (findbugs) @ codahale-metrics-provider ---
[INFO] Fork Value is true
     [java] Warnings generated: 1
[INFO] Done FindBugs Analysis....
[INFO] 
[INFO] <<< findbugs-maven-plugin:2.5.2:check (default-cli) @ codahale-metrics-provider <<<
[INFO] 
[INFO] --- findbugs-maven-plugin:2.5.2:check (default-cli) @ codahale-metrics-provider ---
[INFO] BugInstance size is 1
[INFO] Error size is 0
[INFO] Total bugs: 1
[INFO] Inconsistent synchronization of org.apache.bookkeeper.stats.CodahaleMetricsProvider.metrics; locked 83% of time ["org.apache.bookkeeper.stats.CodahaleMetricsProvider"] At CodahaleMetricsProvider.java:[lines 49-145]
[INFO] ------------------------------------------------------------------------
[INFO] Reactor Summary:
[INFO] 
[INFO] bookkeeper ........................................ SUCCESS [  2.387 s]
[INFO] compability dependencies .......................... SUCCESS [  0.073 s]
[INFO] bookkeeper-server-compat400 ....................... SUCCESS [  5.330 s]
[INFO] bookkeeper-server-compat410 ....................... SUCCESS [  2.427 s]
[INFO] bookkeeper-server-compat420 ....................... SUCCESS [  2.640 s]
[INFO] hedwig-server-compat400 ........................... SUCCESS [  4.185 s]
[INFO] hedwig-server-compat410 ........................... SUCCESS [  3.881 s]
[INFO] hedwig-server-compat420 ........................... SUCCESS [  4.351 s]
[INFO] hedwig-protocol ................................... SUCCESS [ 24.339 s]
[INFO] Stats API for bookkeeper .......................... SUCCESS [  7.517 s]
[INFO] bookkeeper-server ................................. SUCCESS [14:30 min]
[INFO] hedwig-client ..................................... SUCCESS [ 17.735 s]
[INFO] hedwig-server ..................................... SUCCESS [11:17 min]
[INFO] hedwig-client-jms ................................. SUCCESS [ 29.414 s]
[INFO] bookkeeper-benchmark .............................. SUCCESS [01:12 min]
[INFO] Stats provider for twitter-stats package .......... SUCCESS [ 10.238 s]
[INFO] Stats provider for twitter-ostrich package ........ SUCCESS [  9.098 s]
[INFO] Stats provider for codahale metrics ............... FAILURE [  9.043 s]
[INFO] bookkeeper-stats-providers ........................ SKIPPED
[INFO] ------------------------------------------------------------------------
[INFO] BUILD FAILURE
[INFO] ------------------------------------------------------------------------
[INFO] Total time: 29:13 min
[INFO] Finished at: 2014-09-21T12:46:54+00:00
[INFO] Final Memory: 67M/764M
[INFO] ------------------------------------------------------------------------
[ERROR] Failed to execute goal org.codehaus.mojo:findbugs-maven-plugin:2.5.2:check (default-cli) on project codahale-metrics-provider: failed with 1 bugs and 0 errors -> [Help 1]
[ERROR] 
[ERROR] To see the full stack trace of the errors, re-run Maven with the -e switch.
[ERROR] Re-run Maven using the -X switch to enable full debug logging.
[ERROR] 
[ERROR] For more information about the errors and possible solutions, please read the following articles:
[ERROR] [Help 1] http://cwiki.apache.org/confluence/display/MAVEN/MojoExecutionException
[ERROR] 
[ERROR] After correcting the problems, you can resume the build with the command
[ERROR]   mvn <goals> -rf :codahale-metrics-provider
Build step 'Execute shell' marked build as failure
Recording test results

Build failed in Jenkins: bookkeeper-trunk #787

Posted by Apache Jenkins Server <je...@builds.apache.org>.
See <https://builds.apache.org/job/bookkeeper-trunk/787/>

------------------------------------------
[...truncated 1406 lines...]
[INFO] 
[INFO] --- findbugs-maven-plugin:2.5.2:findbugs (findbugs) @ bookkeeper-benchmark ---
[INFO] Fork Value is true
[INFO] Done FindBugs Analysis....
[INFO] 
[INFO] <<< findbugs-maven-plugin:2.5.2:check (default-cli) @ bookkeeper-benchmark <<<
[INFO] 
[INFO] --- findbugs-maven-plugin:2.5.2:check (default-cli) @ bookkeeper-benchmark ---
[INFO] BugInstance size is 0
[INFO] Error size is 0
[INFO] No errors/warnings found
[INFO]                                                                         
[INFO] ------------------------------------------------------------------------
[INFO] Building Stats provider for twitter-stats package 4.3.0-SNAPSHOT
[INFO] ------------------------------------------------------------------------
[INFO] 
[INFO] --- maven-clean-plugin:2.4.1:clean (default-clean) @ twitter-science-provider ---
[INFO] 
[INFO] --- apache-rat-plugin:0.7:check (default-cli) @ twitter-science-provider ---
[INFO] Exclude: .git/**/*
[INFO] Exclude: **/.svn/**/*
[INFO] Exclude: CHANGES.txt
[INFO] Exclude: **/README
[INFO] Exclude: **/apidocs/*
[INFO] Exclude: test-patch/**/*
[INFO] 
[INFO] --- maven-remote-resources-plugin:1.1:process (default) @ twitter-science-provider ---
[INFO] 
[INFO] --- maven-resources-plugin:2.4.3:resources (default-resources) @ twitter-science-provider ---
[INFO] Using 'UTF-8' encoding to copy filtered resources.
[INFO] skip non existing resourceDirectory <https://builds.apache.org/job/bookkeeper-trunk/ws/bookkeeper-stats-providers/twitter-science-provider/src/main/resources>
[INFO] Copying 3 resources
[INFO] 
[INFO] --- maven-compiler-plugin:3.0:compile (default-compile) @ twitter-science-provider ---
[INFO] Changes detected - recompiling the module!
[INFO] Compiling 5 source files to <https://builds.apache.org/job/bookkeeper-trunk/ws/bookkeeper-stats-providers/twitter-science-provider/target/classes>
[INFO] 
[INFO] --- maven-resources-plugin:2.4.3:testResources (default-testResources) @ twitter-science-provider ---
[INFO] Using 'UTF-8' encoding to copy filtered resources.
[INFO] skip non existing resourceDirectory <https://builds.apache.org/job/bookkeeper-trunk/ws/bookkeeper-stats-providers/twitter-science-provider/src/test/resources>
[INFO] Copying 3 resources
[INFO] 
[INFO] --- maven-compiler-plugin:3.0:testCompile (default-testCompile) @ twitter-science-provider ---
[INFO] No sources to compile
[INFO] 
[INFO] --- maven-surefire-plugin:2.9:test (default-test) @ twitter-science-provider ---
[INFO] Surefire report directory: <https://builds.apache.org/job/bookkeeper-trunk/ws/bookkeeper-stats-providers/twitter-science-provider/target/surefire-reports>

-------------------------------------------------------
 T E S T S
-------------------------------------------------------

-------------------------------------------------------
 T E S T S
-------------------------------------------------------

Results :

Tests run: 0, Failures: 0, Errors: 0, Skipped: 0

[INFO] 
[INFO] --- maven-jar-plugin:2.3.1:jar (default-jar) @ twitter-science-provider ---
[INFO] Building jar: <https://builds.apache.org/job/bookkeeper-trunk/ws/bookkeeper-stats-providers/twitter-science-provider/target/twitter-science-provider-4.3.0-SNAPSHOT.jar>
[INFO] 
[INFO] >>> findbugs-maven-plugin:2.5.2:check (default-cli) @ twitter-science-provider >>>
[INFO] 
[INFO] --- findbugs-maven-plugin:2.5.2:findbugs (findbugs) @ twitter-science-provider ---
[INFO] Fork Value is true
[INFO] Done FindBugs Analysis....
[INFO] 
[INFO] <<< findbugs-maven-plugin:2.5.2:check (default-cli) @ twitter-science-provider <<<
[INFO] 
[INFO] --- findbugs-maven-plugin:2.5.2:check (default-cli) @ twitter-science-provider ---
[INFO] BugInstance size is 0
[INFO] Error size is 0
[INFO] No errors/warnings found
[INFO]                                                                         
[INFO] ------------------------------------------------------------------------
[INFO] Building Stats provider for twitter-ostrich package 4.3.0-SNAPSHOT
[INFO] ------------------------------------------------------------------------
[INFO] 
[INFO] --- maven-clean-plugin:2.4.1:clean (default-clean) @ twitter-ostrich-provider ---
[INFO] 
[INFO] --- apache-rat-plugin:0.7:check (default-cli) @ twitter-ostrich-provider ---
[INFO] Exclude: .git/**/*
[INFO] Exclude: **/.svn/**/*
[INFO] Exclude: CHANGES.txt
[INFO] Exclude: **/README
[INFO] Exclude: **/apidocs/*
[INFO] Exclude: test-patch/**/*
[INFO] 
[INFO] --- maven-remote-resources-plugin:1.1:process (default) @ twitter-ostrich-provider ---
[INFO] 
[INFO] --- maven-resources-plugin:2.4.3:resources (default-resources) @ twitter-ostrich-provider ---
[INFO] Using 'UTF-8' encoding to copy filtered resources.
[INFO] skip non existing resourceDirectory <https://builds.apache.org/job/bookkeeper-trunk/ws/bookkeeper-stats-providers/twitter-ostrich-provider/src/main/resources>
[INFO] Copying 3 resources
[INFO] 
[INFO] --- maven-compiler-plugin:3.0:compile (default-compile) @ twitter-ostrich-provider ---
[INFO] Changes detected - recompiling the module!
[INFO] Compiling 4 source files to <https://builds.apache.org/job/bookkeeper-trunk/ws/bookkeeper-stats-providers/twitter-ostrich-provider/target/classes>
[INFO] 
[INFO] --- maven-resources-plugin:2.4.3:testResources (default-testResources) @ twitter-ostrich-provider ---
[INFO] Using 'UTF-8' encoding to copy filtered resources.
[INFO] skip non existing resourceDirectory <https://builds.apache.org/job/bookkeeper-trunk/ws/bookkeeper-stats-providers/twitter-ostrich-provider/src/test/resources>
[INFO] Copying 3 resources
[INFO] 
[INFO] --- maven-compiler-plugin:3.0:testCompile (default-testCompile) @ twitter-ostrich-provider ---
[INFO] No sources to compile
[INFO] 
[INFO] --- maven-surefire-plugin:2.9:test (default-test) @ twitter-ostrich-provider ---
[INFO] Surefire report directory: <https://builds.apache.org/job/bookkeeper-trunk/ws/bookkeeper-stats-providers/twitter-ostrich-provider/target/surefire-reports>

-------------------------------------------------------
 T E S T S
-------------------------------------------------------

-------------------------------------------------------
 T E S T S
-------------------------------------------------------

Results :

Tests run: 0, Failures: 0, Errors: 0, Skipped: 0

[INFO] 
[INFO] --- maven-jar-plugin:2.3.1:jar (default-jar) @ twitter-ostrich-provider ---
[INFO] Building jar: <https://builds.apache.org/job/bookkeeper-trunk/ws/bookkeeper-stats-providers/twitter-ostrich-provider/target/twitter-ostrich-provider-4.3.0-SNAPSHOT.jar>
[INFO] 
[INFO] >>> findbugs-maven-plugin:2.5.2:check (default-cli) @ twitter-ostrich-provider >>>
[INFO] 
[INFO] --- findbugs-maven-plugin:2.5.2:findbugs (findbugs) @ twitter-ostrich-provider ---
[INFO] Fork Value is true
[INFO] Done FindBugs Analysis....
[INFO] 
[INFO] <<< findbugs-maven-plugin:2.5.2:check (default-cli) @ twitter-ostrich-provider <<<
[INFO] 
[INFO] --- findbugs-maven-plugin:2.5.2:check (default-cli) @ twitter-ostrich-provider ---
[INFO] BugInstance size is 0
[INFO] Error size is 0
[INFO] No errors/warnings found
[INFO]                                                                         
[INFO] ------------------------------------------------------------------------
[INFO] Building Stats provider for codahale metrics 4.3.0-SNAPSHOT
[INFO] ------------------------------------------------------------------------
[INFO] 
[INFO] --- maven-clean-plugin:2.4.1:clean (default-clean) @ codahale-metrics-provider ---
[INFO] 
[INFO] --- apache-rat-plugin:0.7:check (default-cli) @ codahale-metrics-provider ---
[INFO] Exclude: .git/**/*
[INFO] Exclude: **/.svn/**/*
[INFO] Exclude: CHANGES.txt
[INFO] Exclude: **/README
[INFO] Exclude: **/apidocs/*
[INFO] Exclude: test-patch/**/*
[INFO] 
[INFO] --- maven-remote-resources-plugin:1.1:process (default) @ codahale-metrics-provider ---
[INFO] 
[INFO] --- maven-resources-plugin:2.4.3:resources (default-resources) @ codahale-metrics-provider ---
[INFO] Using 'UTF-8' encoding to copy filtered resources.
[INFO] skip non existing resourceDirectory <https://builds.apache.org/job/bookkeeper-trunk/ws/bookkeeper-stats-providers/codahale-metrics-provider/src/main/resources>
[INFO] Copying 3 resources
[INFO] 
[INFO] --- maven-compiler-plugin:3.0:compile (default-compile) @ codahale-metrics-provider ---
[INFO] Changes detected - recompiling the module!
[INFO] Compiling 3 source files to <https://builds.apache.org/job/bookkeeper-trunk/ws/bookkeeper-stats-providers/codahale-metrics-provider/target/classes>
[INFO] 
[INFO] --- maven-resources-plugin:2.4.3:testResources (default-testResources) @ codahale-metrics-provider ---
[INFO] Using 'UTF-8' encoding to copy filtered resources.
[INFO] skip non existing resourceDirectory <https://builds.apache.org/job/bookkeeper-trunk/ws/bookkeeper-stats-providers/codahale-metrics-provider/src/test/resources>
[INFO] Copying 3 resources
[INFO] 
[INFO] --- maven-compiler-plugin:3.0:testCompile (default-testCompile) @ codahale-metrics-provider ---
[INFO] No sources to compile
[INFO] 
[INFO] --- maven-surefire-plugin:2.9:test (default-test) @ codahale-metrics-provider ---
[INFO] Surefire report directory: <https://builds.apache.org/job/bookkeeper-trunk/ws/bookkeeper-stats-providers/codahale-metrics-provider/target/surefire-reports>

-------------------------------------------------------
 T E S T S
-------------------------------------------------------

-------------------------------------------------------
 T E S T S
-------------------------------------------------------

Results :

Tests run: 0, Failures: 0, Errors: 0, Skipped: 0

[INFO] 
[INFO] --- maven-jar-plugin:2.3.1:jar (default-jar) @ codahale-metrics-provider ---
[INFO] Building jar: <https://builds.apache.org/job/bookkeeper-trunk/ws/bookkeeper-stats-providers/codahale-metrics-provider/target/codahale-metrics-provider-4.3.0-SNAPSHOT.jar>
[INFO] 
[INFO] >>> findbugs-maven-plugin:2.5.2:check (default-cli) @ codahale-metrics-provider >>>
[INFO] 
[INFO] --- findbugs-maven-plugin:2.5.2:findbugs (findbugs) @ codahale-metrics-provider ---
[INFO] Fork Value is true
     [java] Warnings generated: 1
[INFO] Done FindBugs Analysis....
[INFO] 
[INFO] <<< findbugs-maven-plugin:2.5.2:check (default-cli) @ codahale-metrics-provider <<<
[INFO] 
[INFO] --- findbugs-maven-plugin:2.5.2:check (default-cli) @ codahale-metrics-provider ---
[INFO] BugInstance size is 1
[INFO] Error size is 0
[INFO] Total bugs: 1
[INFO] Inconsistent synchronization of org.apache.bookkeeper.stats.CodahaleMetricsProvider.metrics; locked 83% of time ["org.apache.bookkeeper.stats.CodahaleMetricsProvider"] At CodahaleMetricsProvider.java:[lines 49-145]
[INFO] ------------------------------------------------------------------------
[INFO] Reactor Summary:
[INFO] 
[INFO] bookkeeper ........................................ SUCCESS [  2.420 s]
[INFO] compability dependencies .......................... SUCCESS [  0.075 s]
[INFO] bookkeeper-server-compat400 ....................... SUCCESS [  5.186 s]
[INFO] bookkeeper-server-compat410 ....................... SUCCESS [  2.454 s]
[INFO] bookkeeper-server-compat420 ....................... SUCCESS [  2.648 s]
[INFO] hedwig-server-compat400 ........................... SUCCESS [  3.949 s]
[INFO] hedwig-server-compat410 ........................... SUCCESS [  3.845 s]
[INFO] hedwig-server-compat420 ........................... SUCCESS [  4.384 s]
[INFO] hedwig-protocol ................................... SUCCESS [ 25.380 s]
[INFO] Stats API for bookkeeper .......................... SUCCESS [  8.716 s]
[INFO] bookkeeper-server ................................. SUCCESS [14:33 min]
[INFO] hedwig-client ..................................... SUCCESS [ 18.879 s]
[INFO] hedwig-server ..................................... SUCCESS [11:15 min]
[INFO] hedwig-client-jms ................................. SUCCESS [ 28.954 s]
[INFO] bookkeeper-benchmark .............................. SUCCESS [01:11 min]
[INFO] Stats provider for twitter-stats package .......... SUCCESS [  9.880 s]
[INFO] Stats provider for twitter-ostrich package ........ SUCCESS [  9.841 s]
[INFO] Stats provider for codahale metrics ............... FAILURE [  8.962 s]
[INFO] bookkeeper-stats-providers ........................ SKIPPED
[INFO] ------------------------------------------------------------------------
[INFO] BUILD FAILURE
[INFO] ------------------------------------------------------------------------
[INFO] Total time: 29:15 min
[INFO] Finished at: 2014-09-20T12:46:56+00:00
[INFO] Final Memory: 67M/809M
[INFO] ------------------------------------------------------------------------
[ERROR] Failed to execute goal org.codehaus.mojo:findbugs-maven-plugin:2.5.2:check (default-cli) on project codahale-metrics-provider: failed with 1 bugs and 0 errors -> [Help 1]
[ERROR] 
[ERROR] To see the full stack trace of the errors, re-run Maven with the -e switch.
[ERROR] Re-run Maven using the -X switch to enable full debug logging.
[ERROR] 
[ERROR] For more information about the errors and possible solutions, please read the following articles:
[ERROR] [Help 1] http://cwiki.apache.org/confluence/display/MAVEN/MojoExecutionException
[ERROR] 
[ERROR] After correcting the problems, you can resume the build with the command
[ERROR]   mvn <goals> -rf :codahale-metrics-provider
Build step 'Execute shell' marked build as failure
Recording test results

Build failed in Jenkins: bookkeeper-trunk #786

Posted by Apache Jenkins Server <je...@builds.apache.org>.
See <https://builds.apache.org/job/bookkeeper-trunk/786/>

------------------------------------------
[...truncated 1406 lines...]
[INFO] 
[INFO] --- findbugs-maven-plugin:2.5.2:findbugs (findbugs) @ bookkeeper-benchmark ---
[INFO] Fork Value is true
[INFO] Done FindBugs Analysis....
[INFO] 
[INFO] <<< findbugs-maven-plugin:2.5.2:check (default-cli) @ bookkeeper-benchmark <<<
[INFO] 
[INFO] --- findbugs-maven-plugin:2.5.2:check (default-cli) @ bookkeeper-benchmark ---
[INFO] BugInstance size is 0
[INFO] Error size is 0
[INFO] No errors/warnings found
[INFO]                                                                         
[INFO] ------------------------------------------------------------------------
[INFO] Building Stats provider for twitter-stats package 4.3.0-SNAPSHOT
[INFO] ------------------------------------------------------------------------
[INFO] 
[INFO] --- maven-clean-plugin:2.4.1:clean (default-clean) @ twitter-science-provider ---
[INFO] 
[INFO] --- apache-rat-plugin:0.7:check (default-cli) @ twitter-science-provider ---
[INFO] Exclude: .git/**/*
[INFO] Exclude: **/.svn/**/*
[INFO] Exclude: CHANGES.txt
[INFO] Exclude: **/README
[INFO] Exclude: **/apidocs/*
[INFO] Exclude: test-patch/**/*
[INFO] 
[INFO] --- maven-remote-resources-plugin:1.1:process (default) @ twitter-science-provider ---
[INFO] 
[INFO] --- maven-resources-plugin:2.4.3:resources (default-resources) @ twitter-science-provider ---
[INFO] Using 'UTF-8' encoding to copy filtered resources.
[INFO] skip non existing resourceDirectory <https://builds.apache.org/job/bookkeeper-trunk/ws/bookkeeper-stats-providers/twitter-science-provider/src/main/resources>
[INFO] Copying 3 resources
[INFO] 
[INFO] --- maven-compiler-plugin:3.0:compile (default-compile) @ twitter-science-provider ---
[INFO] Changes detected - recompiling the module!
[INFO] Compiling 5 source files to <https://builds.apache.org/job/bookkeeper-trunk/ws/bookkeeper-stats-providers/twitter-science-provider/target/classes>
[INFO] 
[INFO] --- maven-resources-plugin:2.4.3:testResources (default-testResources) @ twitter-science-provider ---
[INFO] Using 'UTF-8' encoding to copy filtered resources.
[INFO] skip non existing resourceDirectory <https://builds.apache.org/job/bookkeeper-trunk/ws/bookkeeper-stats-providers/twitter-science-provider/src/test/resources>
[INFO] Copying 3 resources
[INFO] 
[INFO] --- maven-compiler-plugin:3.0:testCompile (default-testCompile) @ twitter-science-provider ---
[INFO] No sources to compile
[INFO] 
[INFO] --- maven-surefire-plugin:2.9:test (default-test) @ twitter-science-provider ---
[INFO] Surefire report directory: <https://builds.apache.org/job/bookkeeper-trunk/ws/bookkeeper-stats-providers/twitter-science-provider/target/surefire-reports>

-------------------------------------------------------
 T E S T S
-------------------------------------------------------

-------------------------------------------------------
 T E S T S
-------------------------------------------------------

Results :

Tests run: 0, Failures: 0, Errors: 0, Skipped: 0

[INFO] 
[INFO] --- maven-jar-plugin:2.3.1:jar (default-jar) @ twitter-science-provider ---
[INFO] Building jar: <https://builds.apache.org/job/bookkeeper-trunk/ws/bookkeeper-stats-providers/twitter-science-provider/target/twitter-science-provider-4.3.0-SNAPSHOT.jar>
[INFO] 
[INFO] >>> findbugs-maven-plugin:2.5.2:check (default-cli) @ twitter-science-provider >>>
[INFO] 
[INFO] --- findbugs-maven-plugin:2.5.2:findbugs (findbugs) @ twitter-science-provider ---
[INFO] Fork Value is true
[INFO] Done FindBugs Analysis....
[INFO] 
[INFO] <<< findbugs-maven-plugin:2.5.2:check (default-cli) @ twitter-science-provider <<<
[INFO] 
[INFO] --- findbugs-maven-plugin:2.5.2:check (default-cli) @ twitter-science-provider ---
[INFO] BugInstance size is 0
[INFO] Error size is 0
[INFO] No errors/warnings found
[INFO]                                                                         
[INFO] ------------------------------------------------------------------------
[INFO] Building Stats provider for twitter-ostrich package 4.3.0-SNAPSHOT
[INFO] ------------------------------------------------------------------------
[INFO] 
[INFO] --- maven-clean-plugin:2.4.1:clean (default-clean) @ twitter-ostrich-provider ---
[INFO] 
[INFO] --- apache-rat-plugin:0.7:check (default-cli) @ twitter-ostrich-provider ---
[INFO] Exclude: .git/**/*
[INFO] Exclude: **/.svn/**/*
[INFO] Exclude: CHANGES.txt
[INFO] Exclude: **/README
[INFO] Exclude: **/apidocs/*
[INFO] Exclude: test-patch/**/*
[INFO] 
[INFO] --- maven-remote-resources-plugin:1.1:process (default) @ twitter-ostrich-provider ---
[INFO] 
[INFO] --- maven-resources-plugin:2.4.3:resources (default-resources) @ twitter-ostrich-provider ---
[INFO] Using 'UTF-8' encoding to copy filtered resources.
[INFO] skip non existing resourceDirectory <https://builds.apache.org/job/bookkeeper-trunk/ws/bookkeeper-stats-providers/twitter-ostrich-provider/src/main/resources>
[INFO] Copying 3 resources
[INFO] 
[INFO] --- maven-compiler-plugin:3.0:compile (default-compile) @ twitter-ostrich-provider ---
[INFO] Changes detected - recompiling the module!
[INFO] Compiling 4 source files to <https://builds.apache.org/job/bookkeeper-trunk/ws/bookkeeper-stats-providers/twitter-ostrich-provider/target/classes>
[INFO] 
[INFO] --- maven-resources-plugin:2.4.3:testResources (default-testResources) @ twitter-ostrich-provider ---
[INFO] Using 'UTF-8' encoding to copy filtered resources.
[INFO] skip non existing resourceDirectory <https://builds.apache.org/job/bookkeeper-trunk/ws/bookkeeper-stats-providers/twitter-ostrich-provider/src/test/resources>
[INFO] Copying 3 resources
[INFO] 
[INFO] --- maven-compiler-plugin:3.0:testCompile (default-testCompile) @ twitter-ostrich-provider ---
[INFO] No sources to compile
[INFO] 
[INFO] --- maven-surefire-plugin:2.9:test (default-test) @ twitter-ostrich-provider ---
[INFO] Surefire report directory: <https://builds.apache.org/job/bookkeeper-trunk/ws/bookkeeper-stats-providers/twitter-ostrich-provider/target/surefire-reports>

-------------------------------------------------------
 T E S T S
-------------------------------------------------------

-------------------------------------------------------
 T E S T S
-------------------------------------------------------

Results :

Tests run: 0, Failures: 0, Errors: 0, Skipped: 0

[INFO] 
[INFO] --- maven-jar-plugin:2.3.1:jar (default-jar) @ twitter-ostrich-provider ---
[INFO] Building jar: <https://builds.apache.org/job/bookkeeper-trunk/ws/bookkeeper-stats-providers/twitter-ostrich-provider/target/twitter-ostrich-provider-4.3.0-SNAPSHOT.jar>
[INFO] 
[INFO] >>> findbugs-maven-plugin:2.5.2:check (default-cli) @ twitter-ostrich-provider >>>
[INFO] 
[INFO] --- findbugs-maven-plugin:2.5.2:findbugs (findbugs) @ twitter-ostrich-provider ---
[INFO] Fork Value is true
[INFO] Done FindBugs Analysis....
[INFO] 
[INFO] <<< findbugs-maven-plugin:2.5.2:check (default-cli) @ twitter-ostrich-provider <<<
[INFO] 
[INFO] --- findbugs-maven-plugin:2.5.2:check (default-cli) @ twitter-ostrich-provider ---
[INFO] BugInstance size is 0
[INFO] Error size is 0
[INFO] No errors/warnings found
[INFO]                                                                         
[INFO] ------------------------------------------------------------------------
[INFO] Building Stats provider for codahale metrics 4.3.0-SNAPSHOT
[INFO] ------------------------------------------------------------------------
[INFO] 
[INFO] --- maven-clean-plugin:2.4.1:clean (default-clean) @ codahale-metrics-provider ---
[INFO] 
[INFO] --- apache-rat-plugin:0.7:check (default-cli) @ codahale-metrics-provider ---
[INFO] Exclude: .git/**/*
[INFO] Exclude: **/.svn/**/*
[INFO] Exclude: CHANGES.txt
[INFO] Exclude: **/README
[INFO] Exclude: **/apidocs/*
[INFO] Exclude: test-patch/**/*
[INFO] 
[INFO] --- maven-remote-resources-plugin:1.1:process (default) @ codahale-metrics-provider ---
[INFO] 
[INFO] --- maven-resources-plugin:2.4.3:resources (default-resources) @ codahale-metrics-provider ---
[INFO] Using 'UTF-8' encoding to copy filtered resources.
[INFO] skip non existing resourceDirectory <https://builds.apache.org/job/bookkeeper-trunk/ws/bookkeeper-stats-providers/codahale-metrics-provider/src/main/resources>
[INFO] Copying 3 resources
[INFO] 
[INFO] --- maven-compiler-plugin:3.0:compile (default-compile) @ codahale-metrics-provider ---
[INFO] Changes detected - recompiling the module!
[INFO] Compiling 3 source files to <https://builds.apache.org/job/bookkeeper-trunk/ws/bookkeeper-stats-providers/codahale-metrics-provider/target/classes>
[INFO] 
[INFO] --- maven-resources-plugin:2.4.3:testResources (default-testResources) @ codahale-metrics-provider ---
[INFO] Using 'UTF-8' encoding to copy filtered resources.
[INFO] skip non existing resourceDirectory <https://builds.apache.org/job/bookkeeper-trunk/ws/bookkeeper-stats-providers/codahale-metrics-provider/src/test/resources>
[INFO] Copying 3 resources
[INFO] 
[INFO] --- maven-compiler-plugin:3.0:testCompile (default-testCompile) @ codahale-metrics-provider ---
[INFO] No sources to compile
[INFO] 
[INFO] --- maven-surefire-plugin:2.9:test (default-test) @ codahale-metrics-provider ---
[INFO] Surefire report directory: <https://builds.apache.org/job/bookkeeper-trunk/ws/bookkeeper-stats-providers/codahale-metrics-provider/target/surefire-reports>

-------------------------------------------------------
 T E S T S
-------------------------------------------------------

-------------------------------------------------------
 T E S T S
-------------------------------------------------------

Results :

Tests run: 0, Failures: 0, Errors: 0, Skipped: 0

[INFO] 
[INFO] --- maven-jar-plugin:2.3.1:jar (default-jar) @ codahale-metrics-provider ---
[INFO] Building jar: <https://builds.apache.org/job/bookkeeper-trunk/ws/bookkeeper-stats-providers/codahale-metrics-provider/target/codahale-metrics-provider-4.3.0-SNAPSHOT.jar>
[INFO] 
[INFO] >>> findbugs-maven-plugin:2.5.2:check (default-cli) @ codahale-metrics-provider >>>
[INFO] 
[INFO] --- findbugs-maven-plugin:2.5.2:findbugs (findbugs) @ codahale-metrics-provider ---
[INFO] Fork Value is true
     [java] Warnings generated: 1
[INFO] Done FindBugs Analysis....
[INFO] 
[INFO] <<< findbugs-maven-plugin:2.5.2:check (default-cli) @ codahale-metrics-provider <<<
[INFO] 
[INFO] --- findbugs-maven-plugin:2.5.2:check (default-cli) @ codahale-metrics-provider ---
[INFO] BugInstance size is 1
[INFO] Error size is 0
[INFO] Total bugs: 1
[INFO] Inconsistent synchronization of org.apache.bookkeeper.stats.CodahaleMetricsProvider.metrics; locked 83% of time ["org.apache.bookkeeper.stats.CodahaleMetricsProvider"] At CodahaleMetricsProvider.java:[lines 49-145]
[INFO] ------------------------------------------------------------------------
[INFO] Reactor Summary:
[INFO] 
[INFO] bookkeeper ........................................ SUCCESS [  2.346 s]
[INFO] compability dependencies .......................... SUCCESS [  0.080 s]
[INFO] bookkeeper-server-compat400 ....................... SUCCESS [  5.209 s]
[INFO] bookkeeper-server-compat410 ....................... SUCCESS [  2.413 s]
[INFO] bookkeeper-server-compat420 ....................... SUCCESS [  2.627 s]
[INFO] hedwig-server-compat400 ........................... SUCCESS [  3.915 s]
[INFO] hedwig-server-compat410 ........................... SUCCESS [  3.821 s]
[INFO] hedwig-server-compat420 ........................... SUCCESS [  4.347 s]
[INFO] hedwig-protocol ................................... SUCCESS [ 25.503 s]
[INFO] Stats API for bookkeeper .......................... SUCCESS [  8.028 s]
[INFO] bookkeeper-server ................................. SUCCESS [14:33 min]
[INFO] hedwig-client ..................................... SUCCESS [ 18.200 s]
[INFO] hedwig-server ..................................... SUCCESS [11:15 min]
[INFO] hedwig-client-jms ................................. SUCCESS [ 30.027 s]
[INFO] bookkeeper-benchmark .............................. SUCCESS [01:10 min]
[INFO] Stats provider for twitter-stats package .......... SUCCESS [  9.391 s]
[INFO] Stats provider for twitter-ostrich package ........ SUCCESS [  7.913 s]
[INFO] Stats provider for codahale metrics ............... FAILURE [  8.738 s]
[INFO] bookkeeper-stats-providers ........................ SKIPPED
[INFO] ------------------------------------------------------------------------
[INFO] BUILD FAILURE
[INFO] ------------------------------------------------------------------------
[INFO] Total time: 29:12 min
[INFO] Finished at: 2014-09-19T12:46:53+00:00
[INFO] Final Memory: 67M/811M
[INFO] ------------------------------------------------------------------------
[ERROR] Failed to execute goal org.codehaus.mojo:findbugs-maven-plugin:2.5.2:check (default-cli) on project codahale-metrics-provider: failed with 1 bugs and 0 errors -> [Help 1]
[ERROR] 
[ERROR] To see the full stack trace of the errors, re-run Maven with the -e switch.
[ERROR] Re-run Maven using the -X switch to enable full debug logging.
[ERROR] 
[ERROR] For more information about the errors and possible solutions, please read the following articles:
[ERROR] [Help 1] http://cwiki.apache.org/confluence/display/MAVEN/MojoExecutionException
[ERROR] 
[ERROR] After correcting the problems, you can resume the build with the command
[ERROR]   mvn <goals> -rf :codahale-metrics-provider
Build step 'Execute shell' marked build as failure
Recording test results

Build failed in Jenkins: bookkeeper-trunk #785

Posted by Apache Jenkins Server <je...@builds.apache.org>.
See <https://builds.apache.org/job/bookkeeper-trunk/785/>

------------------------------------------
[...truncated 9228 lines...]
10934/11182 KB   
10938/11182 KB   
10942/11182 KB   
10946/11182 KB   
10950/11182 KB   
10954/11182 KB   
10958/11182 KB   
10962/11182 KB   
10966/11182 KB   
10970/11182 KB   
10974/11182 KB   
10978/11182 KB   
10982/11182 KB   
10986/11182 KB   
10990/11182 KB   
10994/11182 KB   
10996/11182 KB   
10997/11182 KB   
11001/11182 KB   
11005/11182 KB   
11009/11182 KB   
11013/11182 KB   
11017/11182 KB   
11021/11182 KB   
11025/11182 KB   
11029/11182 KB   
11033/11182 KB   
11037/11182 KB   
11041/11182 KB   
11045/11182 KB   
11049/11182 KB   
11053/11182 KB   
11057/11182 KB   
11061/11182 KB   
11065/11182 KB   
11069/11182 KB   
11073/11182 KB   
11077/11182 KB   
11081/11182 KB   
11085/11182 KB   
11089/11182 KB   
11093/11182 KB   
11097/11182 KB   
11101/11182 KB   
11105/11182 KB   
11109/11182 KB   
11113/11182 KB   
11117/11182 KB   
11121/11182 KB   
11123/11182 KB   
11127/11182 KB   
11129/11182 KB   
11133/11182 KB   
11137/11182 KB   
11137/11182 KB   
11140/11182 KB   
11144/11182 KB   
11148/11182 KB   
11151/11182 KB   
11155/11182 KB   
11159/11182 KB   
11163/11182 KB   
11167/11182 KB   
11171/11182 KB   
11175/11182 KB   
11179/11182 KB   
11182/11182 KB   
                 
Downloaded: http://repo.maven.apache.org/maven2/org/scala-lang/scala-compiler/2.9.2/scala-compiler-2.9.2.jar (11182 KB at 7494.1 KB/sec)
[INFO] 
[INFO] --- maven-clean-plugin:2.4.1:clean (default-clean) @ twitter-ostrich-provider ---
[INFO] 
[INFO] --- apache-rat-plugin:0.7:check (default-cli) @ twitter-ostrich-provider ---
[INFO] Exclude: .git/**/*
[INFO] Exclude: **/.svn/**/*
[INFO] Exclude: CHANGES.txt
[INFO] Exclude: **/README
[INFO] Exclude: **/apidocs/*
[INFO] Exclude: test-patch/**/*
[INFO] 
[INFO] --- maven-remote-resources-plugin:1.1:process (default) @ twitter-ostrich-provider ---
[INFO] 
[INFO] --- maven-resources-plugin:2.4.3:resources (default-resources) @ twitter-ostrich-provider ---
[INFO] Using 'UTF-8' encoding to copy filtered resources.
[INFO] skip non existing resourceDirectory <https://builds.apache.org/job/bookkeeper-trunk/ws/bookkeeper-stats-providers/twitter-ostrich-provider/src/main/resources>
[INFO] Copying 3 resources
[INFO] 
[INFO] --- maven-compiler-plugin:3.0:compile (default-compile) @ twitter-ostrich-provider ---
[INFO] Changes detected - recompiling the module!
[INFO] Compiling 4 source files to <https://builds.apache.org/job/bookkeeper-trunk/ws/bookkeeper-stats-providers/twitter-ostrich-provider/target/classes>
[INFO] 
[INFO] --- maven-resources-plugin:2.4.3:testResources (default-testResources) @ twitter-ostrich-provider ---
[INFO] Using 'UTF-8' encoding to copy filtered resources.
[INFO] skip non existing resourceDirectory <https://builds.apache.org/job/bookkeeper-trunk/ws/bookkeeper-stats-providers/twitter-ostrich-provider/src/test/resources>
[INFO] Copying 3 resources
[INFO] 
[INFO] --- maven-compiler-plugin:3.0:testCompile (default-testCompile) @ twitter-ostrich-provider ---
[INFO] No sources to compile
[INFO] 
[INFO] --- maven-surefire-plugin:2.9:test (default-test) @ twitter-ostrich-provider ---
[INFO] Surefire report directory: <https://builds.apache.org/job/bookkeeper-trunk/ws/bookkeeper-stats-providers/twitter-ostrich-provider/target/surefire-reports>

-------------------------------------------------------
 T E S T S
-------------------------------------------------------

-------------------------------------------------------
 T E S T S
-------------------------------------------------------

Results :

Tests run: 0, Failures: 0, Errors: 0, Skipped: 0

[INFO] 
[INFO] --- maven-jar-plugin:2.3.1:jar (default-jar) @ twitter-ostrich-provider ---
[INFO] Building jar: <https://builds.apache.org/job/bookkeeper-trunk/ws/bookkeeper-stats-providers/twitter-ostrich-provider/target/twitter-ostrich-provider-4.3.0-SNAPSHOT.jar>
[INFO] 
[INFO] >>> findbugs-maven-plugin:2.5.2:check (default-cli) @ twitter-ostrich-provider >>>
[INFO] 
[INFO] --- findbugs-maven-plugin:2.5.2:findbugs (findbugs) @ twitter-ostrich-provider ---
[INFO] Fork Value is true
[INFO] Done FindBugs Analysis....
[INFO] 
[INFO] <<< findbugs-maven-plugin:2.5.2:check (default-cli) @ twitter-ostrich-provider <<<
[INFO] 
[INFO] --- findbugs-maven-plugin:2.5.2:check (default-cli) @ twitter-ostrich-provider ---
[INFO] BugInstance size is 0
[INFO] Error size is 0
[INFO] No errors/warnings found
[INFO]                                                                         
[INFO] ------------------------------------------------------------------------
[INFO] Building Stats provider for codahale metrics 4.3.0-SNAPSHOT
[INFO] ------------------------------------------------------------------------
Downloading: http://repo.maven.apache.org/maven2/com/codahale/metrics/metrics-graphite/3.0.1/metrics-graphite-3.0.1.pom
936/936 B        
            
Downloaded: http://repo.maven.apache.org/maven2/com/codahale/metrics/metrics-graphite/3.0.1/metrics-graphite-3.0.1.pom (936 B at 12.4 KB/sec)
Downloading: http://repo.maven.apache.org/maven2/com/codahale/metrics/metrics-graphite/3.0.1/metrics-graphite-3.0.1.jar
4/10 KB     
6/10 KB   
10/10 KB   
10/10 KB   
           
Downloaded: http://repo.maven.apache.org/maven2/com/codahale/metrics/metrics-graphite/3.0.1/metrics-graphite-3.0.1.jar (10 KB at 130.0 KB/sec)
[INFO] 
[INFO] --- maven-clean-plugin:2.4.1:clean (default-clean) @ codahale-metrics-provider ---
[INFO] 
[INFO] --- apache-rat-plugin:0.7:check (default-cli) @ codahale-metrics-provider ---
[INFO] Exclude: .git/**/*
[INFO] Exclude: **/.svn/**/*
[INFO] Exclude: CHANGES.txt
[INFO] Exclude: **/README
[INFO] Exclude: **/apidocs/*
[INFO] Exclude: test-patch/**/*
[INFO] 
[INFO] --- maven-remote-resources-plugin:1.1:process (default) @ codahale-metrics-provider ---
[INFO] 
[INFO] --- maven-resources-plugin:2.4.3:resources (default-resources) @ codahale-metrics-provider ---
[INFO] Using 'UTF-8' encoding to copy filtered resources.
[INFO] skip non existing resourceDirectory <https://builds.apache.org/job/bookkeeper-trunk/ws/bookkeeper-stats-providers/codahale-metrics-provider/src/main/resources>
[INFO] Copying 3 resources
[INFO] 
[INFO] --- maven-compiler-plugin:3.0:compile (default-compile) @ codahale-metrics-provider ---
[INFO] Changes detected - recompiling the module!
[INFO] Compiling 3 source files to <https://builds.apache.org/job/bookkeeper-trunk/ws/bookkeeper-stats-providers/codahale-metrics-provider/target/classes>
[INFO] 
[INFO] --- maven-resources-plugin:2.4.3:testResources (default-testResources) @ codahale-metrics-provider ---
[INFO] Using 'UTF-8' encoding to copy filtered resources.
[INFO] skip non existing resourceDirectory <https://builds.apache.org/job/bookkeeper-trunk/ws/bookkeeper-stats-providers/codahale-metrics-provider/src/test/resources>
[INFO] Copying 3 resources
[INFO] 
[INFO] --- maven-compiler-plugin:3.0:testCompile (default-testCompile) @ codahale-metrics-provider ---
[INFO] No sources to compile
[INFO] 
[INFO] --- maven-surefire-plugin:2.9:test (default-test) @ codahale-metrics-provider ---
[INFO] Surefire report directory: <https://builds.apache.org/job/bookkeeper-trunk/ws/bookkeeper-stats-providers/codahale-metrics-provider/target/surefire-reports>

-------------------------------------------------------
 T E S T S
-------------------------------------------------------

-------------------------------------------------------
 T E S T S
-------------------------------------------------------

Results :

Tests run: 0, Failures: 0, Errors: 0, Skipped: 0

[INFO] 
[INFO] --- maven-jar-plugin:2.3.1:jar (default-jar) @ codahale-metrics-provider ---
[INFO] Building jar: <https://builds.apache.org/job/bookkeeper-trunk/ws/bookkeeper-stats-providers/codahale-metrics-provider/target/codahale-metrics-provider-4.3.0-SNAPSHOT.jar>
[INFO] 
[INFO] >>> findbugs-maven-plugin:2.5.2:check (default-cli) @ codahale-metrics-provider >>>
[INFO] 
[INFO] --- findbugs-maven-plugin:2.5.2:findbugs (findbugs) @ codahale-metrics-provider ---
[INFO] Fork Value is true
     [java] Warnings generated: 1
[INFO] Done FindBugs Analysis....
[INFO] 
[INFO] <<< findbugs-maven-plugin:2.5.2:check (default-cli) @ codahale-metrics-provider <<<
[INFO] 
[INFO] --- findbugs-maven-plugin:2.5.2:check (default-cli) @ codahale-metrics-provider ---
[INFO] BugInstance size is 1
[INFO] Error size is 0
[INFO] Total bugs: 1
[INFO] Inconsistent synchronization of org.apache.bookkeeper.stats.CodahaleMetricsProvider.metrics; locked 83% of time ["org.apache.bookkeeper.stats.CodahaleMetricsProvider"] At CodahaleMetricsProvider.java:[lines 49-145]
[INFO] ------------------------------------------------------------------------
[INFO] Reactor Summary:
[INFO] 
[INFO] bookkeeper ........................................ SUCCESS [  2.568 s]
[INFO] compability dependencies .......................... SUCCESS [  0.075 s]
[INFO] bookkeeper-server-compat400 ....................... SUCCESS [  5.261 s]
[INFO] bookkeeper-server-compat410 ....................... SUCCESS [  2.428 s]
[INFO] bookkeeper-server-compat420 ....................... SUCCESS [  2.682 s]
[INFO] hedwig-server-compat400 ........................... SUCCESS [  3.927 s]
[INFO] hedwig-server-compat410 ........................... SUCCESS [  3.814 s]
[INFO] hedwig-server-compat420 ........................... SUCCESS [  4.344 s]
[INFO] hedwig-protocol ................................... SUCCESS [ 24.942 s]
[INFO] Stats API for bookkeeper .......................... SUCCESS [  8.472 s]
[INFO] bookkeeper-server ................................. SUCCESS [14:39 min]
[INFO] hedwig-client ..................................... SUCCESS [ 18.619 s]
[INFO] hedwig-server ..................................... SUCCESS [11:18 min]
[INFO] hedwig-client-jms ................................. SUCCESS [ 31.363 s]
[INFO] bookkeeper-benchmark .............................. SUCCESS [01:14 min]
[INFO] Stats provider for twitter-stats package .......... SUCCESS [ 18.541 s]
[INFO] Stats provider for twitter-ostrich package ........ SUCCESS [ 13.944 s]
[INFO] Stats provider for codahale metrics ............... FAILURE [  9.414 s]
[INFO] bookkeeper-stats-providers ........................ SKIPPED
[INFO] ------------------------------------------------------------------------
[INFO] BUILD FAILURE
[INFO] ------------------------------------------------------------------------
[INFO] Total time: 29:43 min
[INFO] Finished at: 2014-09-18T12:47:25+00:00
[INFO] Final Memory: 68M/833M
[INFO] ------------------------------------------------------------------------
[ERROR] Failed to execute goal org.codehaus.mojo:findbugs-maven-plugin:2.5.2:check (default-cli) on project codahale-metrics-provider: failed with 1 bugs and 0 errors -> [Help 1]
[ERROR] 
[ERROR] To see the full stack trace of the errors, re-run Maven with the -e switch.
[ERROR] Re-run Maven using the -X switch to enable full debug logging.
[ERROR] 
[ERROR] For more information about the errors and possible solutions, please read the following articles:
[ERROR] [Help 1] http://cwiki.apache.org/confluence/display/MAVEN/MojoExecutionException
[ERROR] 
[ERROR] After correcting the problems, you can resume the build with the command
[ERROR]   mvn <goals> -rf :codahale-metrics-provider
Build step 'Execute shell' marked build as failure
Recording test results