You are viewing a plain text version of this content. The canonical link for it is here.
Posted to dev@lucene.apache.org by Policeman Jenkins Server <je...@thetaphi.de> on 2015/10/18 13:10:32 UTC
[JENKINS] Lucene-Solr-5.x-Windows (32bit/jdk1.8.0_60) - Build #
5213 - Failure!
Build: http://jenkins.thetaphi.de/job/Lucene-Solr-5.x-Windows/5213/
Java: 32bit/jdk1.8.0_60 -client -XX:+UseSerialGC
1 tests failed.
FAILED: org.apache.solr.handler.PingRequestHandlerTest.testPingInClusterWithNoHealthCheck
Error Message:
Could not find a healthy node to handle the request.
Stack Trace:
org.apache.solr.common.SolrException: Could not find a healthy node to handle the request.
at __randomizedtesting.SeedInfo.seed([50E075818B0B71E2:BE33CB510EE74B06]:0)
at org.apache.solr.client.solrj.impl.CloudSolrClient.sendRequest(CloudSolrClient.java:1084)
at org.apache.solr.client.solrj.impl.CloudSolrClient.requestWithRetryOnStaleState(CloudSolrClient.java:870)
at org.apache.solr.client.solrj.impl.CloudSolrClient.requestWithRetryOnStaleState(CloudSolrClient.java:953)
at org.apache.solr.client.solrj.impl.CloudSolrClient.requestWithRetryOnStaleState(CloudSolrClient.java:953)
at org.apache.solr.client.solrj.impl.CloudSolrClient.requestWithRetryOnStaleState(CloudSolrClient.java:953)
at org.apache.solr.client.solrj.impl.CloudSolrClient.requestWithRetryOnStaleState(CloudSolrClient.java:953)
at org.apache.solr.client.solrj.impl.CloudSolrClient.requestWithRetryOnStaleState(CloudSolrClient.java:953)
at org.apache.solr.client.solrj.impl.CloudSolrClient.request(CloudSolrClient.java:806)
at org.apache.solr.client.solrj.SolrRequest.process(SolrRequest.java:150)
at org.apache.solr.handler.PingRequestHandlerTest.testPingInClusterWithNoHealthCheck(PingRequestHandlerTest.java:201)
at sun.reflect.NativeMethodAccessorImpl.invoke0(Native Method)
at sun.reflect.NativeMethodAccessorImpl.invoke(NativeMethodAccessorImpl.java:62)
at sun.reflect.DelegatingMethodAccessorImpl.invoke(DelegatingMethodAccessorImpl.java:43)
at java.lang.reflect.Method.invoke(Method.java:497)
at com.carrotsearch.randomizedtesting.RandomizedRunner.invoke(RandomizedRunner.java:1665)
at com.carrotsearch.randomizedtesting.RandomizedRunner$8.evaluate(RandomizedRunner.java:864)
at com.carrotsearch.randomizedtesting.RandomizedRunner$9.evaluate(RandomizedRunner.java:900)
at com.carrotsearch.randomizedtesting.RandomizedRunner$10.evaluate(RandomizedRunner.java:914)
at com.carrotsearch.randomizedtesting.rules.SystemPropertiesRestoreRule$1.evaluate(SystemPropertiesRestoreRule.java:57)
at org.apache.lucene.util.TestRuleSetupTeardownChained$1.evaluate(TestRuleSetupTeardownChained.java:50)
at org.apache.lucene.util.AbstractBeforeAfterRule$1.evaluate(AbstractBeforeAfterRule.java:46)
at org.apache.lucene.util.TestRuleThreadAndTestName$1.evaluate(TestRuleThreadAndTestName.java:49)
at org.apache.lucene.util.TestRuleIgnoreAfterMaxFailures$1.evaluate(TestRuleIgnoreAfterMaxFailures.java:65)
at org.apache.lucene.util.TestRuleMarkFailure$1.evaluate(TestRuleMarkFailure.java:48)
at com.carrotsearch.randomizedtesting.rules.StatementAdapter.evaluate(StatementAdapter.java:36)
at com.carrotsearch.randomizedtesting.ThreadLeakControl$StatementRunner.run(ThreadLeakControl.java:367)
at com.carrotsearch.randomizedtesting.ThreadLeakControl.forkTimeoutingTask(ThreadLeakControl.java:809)
at com.carrotsearch.randomizedtesting.ThreadLeakControl$3.evaluate(ThreadLeakControl.java:460)
at com.carrotsearch.randomizedtesting.RandomizedRunner.runSingleTest(RandomizedRunner.java:873)
at com.carrotsearch.randomizedtesting.RandomizedRunner$5.evaluate(RandomizedRunner.java:775)
at com.carrotsearch.randomizedtesting.RandomizedRunner$6.evaluate(RandomizedRunner.java:809)
at com.carrotsearch.randomizedtesting.RandomizedRunner$7.evaluate(RandomizedRunner.java:820)
at com.carrotsearch.randomizedtesting.rules.StatementAdapter.evaluate(StatementAdapter.java:36)
at com.carrotsearch.randomizedtesting.rules.SystemPropertiesRestoreRule$1.evaluate(SystemPropertiesRestoreRule.java:57)
at org.apache.lucene.util.AbstractBeforeAfterRule$1.evaluate(AbstractBeforeAfterRule.java:46)
at com.carrotsearch.randomizedtesting.rules.StatementAdapter.evaluate(StatementAdapter.java:36)
at org.apache.lucene.util.TestRuleStoreClassName$1.evaluate(TestRuleStoreClassName.java:42)
at com.carrotsearch.randomizedtesting.rules.NoShadowingOrOverridesOnMethodsRule$1.evaluate(NoShadowingOrOverridesOnMethodsRule.java:39)
at com.carrotsearch.randomizedtesting.rules.NoShadowingOrOverridesOnMethodsRule$1.evaluate(NoShadowingOrOverridesOnMethodsRule.java:39)
at com.carrotsearch.randomizedtesting.rules.StatementAdapter.evaluate(StatementAdapter.java:36)
at com.carrotsearch.randomizedtesting.rules.StatementAdapter.evaluate(StatementAdapter.java:36)
at com.carrotsearch.randomizedtesting.rules.StatementAdapter.evaluate(StatementAdapter.java:36)
at org.apache.lucene.util.TestRuleAssertionsRequired$1.evaluate(TestRuleAssertionsRequired.java:54)
at org.apache.lucene.util.TestRuleMarkFailure$1.evaluate(TestRuleMarkFailure.java:48)
at org.apache.lucene.util.TestRuleIgnoreAfterMaxFailures$1.evaluate(TestRuleIgnoreAfterMaxFailures.java:65)
at org.apache.lucene.util.TestRuleIgnoreTestSuites$1.evaluate(TestRuleIgnoreTestSuites.java:55)
at com.carrotsearch.randomizedtesting.rules.StatementAdapter.evaluate(StatementAdapter.java:36)
at com.carrotsearch.randomizedtesting.ThreadLeakControl$StatementRunner.run(ThreadLeakControl.java:367)
at java.lang.Thread.run(Thread.java:745)
Build Log:
[...truncated 9970 lines...]
[junit4] Suite: org.apache.solr.handler.PingRequestHandlerTest
[junit4] 2> Creating dataDir: C:\Users\JenkinsSlave\workspace\Lucene-Solr-5.x-Windows\solr\build\solr-core\test\J0\temp\solr.handler.PingRequestHandlerTest_50E075818B0B71E2-001\init-core-data-001
[junit4] 2> 630166 INFO (SUITE-PingRequestHandlerTest-seed#[50E075818B0B71E2]-worker) [ ] o.a.s.SolrTestCaseJ4 Randomized ssl (true) and clientAuth (false)
[junit4] 2> 630167 INFO (SUITE-PingRequestHandlerTest-seed#[50E075818B0B71E2]-worker) [ ] o.a.s.SolrTestCaseJ4 ####initCore
[junit4] 2> 630167 INFO (SUITE-PingRequestHandlerTest-seed#[50E075818B0B71E2]-worker) [ ] o.a.s.c.SolrResourceLoader new SolrResourceLoader for directory: 'C:\Users\JenkinsSlave\workspace\Lucene-Solr-5.x-Windows\solr\core\src\test-files\solr\collection1\'
[junit4] 2> 630167 INFO (SUITE-PingRequestHandlerTest-seed#[50E075818B0B71E2]-worker) [ ] o.a.s.c.SolrResourceLoader JNDI not configured for solr (NoInitialContextEx)
[junit4] 2> 630167 INFO (SUITE-PingRequestHandlerTest-seed#[50E075818B0B71E2]-worker) [ ] o.a.s.c.SolrResourceLoader using system property solr.solr.home: C:\Users\JenkinsSlave\workspace\Lucene-Solr-5.x-Windows\solr\core\src\test-files\solr
[junit4] 2> 630168 INFO (SUITE-PingRequestHandlerTest-seed#[50E075818B0B71E2]-worker) [ ] o.a.s.c.SolrResourceLoader Adding 'file:/C:/Users/JenkinsSlave/workspace/Lucene-Solr-5.x-Windows/solr/core/src/test-files/solr/collection1/lib/classes/' to classloader
[junit4] 2> 630169 INFO (SUITE-PingRequestHandlerTest-seed#[50E075818B0B71E2]-worker) [ ] o.a.s.c.SolrResourceLoader Adding 'file:/C:/Users/JenkinsSlave/workspace/Lucene-Solr-5.x-Windows/solr/core/src/test-files/solr/collection1/lib/README' to classloader
[junit4] 2> 630214 INFO (SUITE-PingRequestHandlerTest-seed#[50E075818B0B71E2]-worker) [ ] o.a.s.c.SolrConfig current version of requestparams : -1
[junit4] 2> 630223 INFO (SUITE-PingRequestHandlerTest-seed#[50E075818B0B71E2]-worker) [ ] o.a.s.c.SolrConfig Using Lucene MatchVersion: 5.4.0
[junit4] 2> 630251 INFO (SUITE-PingRequestHandlerTest-seed#[50E075818B0B71E2]-worker) [ ] o.a.s.c.Config Loaded SolrConfig: solrconfig.xml
[junit4] 2> 630252 INFO (SUITE-PingRequestHandlerTest-seed#[50E075818B0B71E2]-worker) [ ] o.a.s.s.IndexSchema Reading Solr Schema from C:\Users\JenkinsSlave\workspace\Lucene-Solr-5.x-Windows\solr\core\src\test-files\solr\collection1\conf\schema.xml
[junit4] 2> 630256 INFO (SUITE-PingRequestHandlerTest-seed#[50E075818B0B71E2]-worker) [ ] o.a.s.s.IndexSchema [null] Schema name=test
[junit4] 2> 630350 INFO (SUITE-PingRequestHandlerTest-seed#[50E075818B0B71E2]-worker) [ ] o.a.s.s.OpenExchangeRatesOrgProvider Initialized with rates=open-exchange-rates.json, refreshInterval=1440.
[junit4] 2> 630357 INFO (SUITE-PingRequestHandlerTest-seed#[50E075818B0B71E2]-worker) [ ] o.a.s.s.IndexSchema default search field in schema is text
[junit4] 2> 630364 INFO (SUITE-PingRequestHandlerTest-seed#[50E075818B0B71E2]-worker) [ ] o.a.s.s.IndexSchema unique key field: id
[junit4] 2> 630374 INFO (SUITE-PingRequestHandlerTest-seed#[50E075818B0B71E2]-worker) [ ] o.a.s.s.FileExchangeRateProvider Reloading exchange rates from file currency.xml
[junit4] 2> 630376 INFO (SUITE-PingRequestHandlerTest-seed#[50E075818B0B71E2]-worker) [ ] o.a.s.s.FileExchangeRateProvider Reloading exchange rates from file currency.xml
[junit4] 2> 630378 INFO (SUITE-PingRequestHandlerTest-seed#[50E075818B0B71E2]-worker) [ ] o.a.s.s.OpenExchangeRatesOrgProvider Reloading exchange rates from open-exchange-rates.json
[junit4] 2> 630378 WARN (SUITE-PingRequestHandlerTest-seed#[50E075818B0B71E2]-worker) [ ] o.a.s.s.OpenExchangeRatesOrgProvider Unknown key IMPORTANT NOTE
[junit4] 2> 630378 WARN (SUITE-PingRequestHandlerTest-seed#[50E075818B0B71E2]-worker) [ ] o.a.s.s.OpenExchangeRatesOrgProvider Expected key, got STRING
[junit4] 2> 630379 INFO (SUITE-PingRequestHandlerTest-seed#[50E075818B0B71E2]-worker) [ ] o.a.s.s.OpenExchangeRatesOrgProvider Reloading exchange rates from open-exchange-rates.json
[junit4] 2> 630379 WARN (SUITE-PingRequestHandlerTest-seed#[50E075818B0B71E2]-worker) [ ] o.a.s.s.OpenExchangeRatesOrgProvider Unknown key IMPORTANT NOTE
[junit4] 2> 630379 WARN (SUITE-PingRequestHandlerTest-seed#[50E075818B0B71E2]-worker) [ ] o.a.s.s.OpenExchangeRatesOrgProvider Expected key, got STRING
[junit4] 2> 630380 INFO (SUITE-PingRequestHandlerTest-seed#[50E075818B0B71E2]-worker) [ ] o.a.s.c.SolrResourceLoader JNDI not configured for solr (NoInitialContextEx)
[junit4] 2> 630380 INFO (SUITE-PingRequestHandlerTest-seed#[50E075818B0B71E2]-worker) [ ] o.a.s.c.SolrResourceLoader using system property solr.solr.home: C:\Users\JenkinsSlave\workspace\Lucene-Solr-5.x-Windows\solr\core\src\test-files\solr
[junit4] 2> 630380 INFO (SUITE-PingRequestHandlerTest-seed#[50E075818B0B71E2]-worker) [ ] o.a.s.c.SolrResourceLoader new SolrResourceLoader for directory: 'C:\Users\JenkinsSlave\workspace\Lucene-Solr-5.x-Windows\solr\core\src\test-files\solr\'
[junit4] 2> 630380 INFO (SUITE-PingRequestHandlerTest-seed#[50E075818B0B71E2]-worker) [ ] o.a.s.c.SolrResourceLoader JNDI not configured for solr (NoInitialContextEx)
[junit4] 2> 630380 INFO (SUITE-PingRequestHandlerTest-seed#[50E075818B0B71E2]-worker) [ ] o.a.s.c.SolrResourceLoader using system property solr.solr.home: C:\Users\JenkinsSlave\workspace\Lucene-Solr-5.x-Windows\solr\core\src\test-files\solr
[junit4] 2> 630380 INFO (SUITE-PingRequestHandlerTest-seed#[50E075818B0B71E2]-worker) [ ] o.a.s.c.CoreContainer New CoreContainer 117411
[junit4] 2> 630380 INFO (SUITE-PingRequestHandlerTest-seed#[50E075818B0B71E2]-worker) [ ] o.a.s.c.CoreContainer Loading cores into CoreContainer [instanceDir=C:\Users\JenkinsSlave\workspace\Lucene-Solr-5.x-Windows\solr\core\src\test-files\solr\]
[junit4] 2> 630380 INFO (SUITE-PingRequestHandlerTest-seed#[50E075818B0B71E2]-worker) [ ] o.a.s.c.CoreContainer loading shared library: C:\Users\JenkinsSlave\workspace\Lucene-Solr-5.x-Windows\solr\core\src\test-files\solr\lib
[junit4] 2> 630380 WARN (SUITE-PingRequestHandlerTest-seed#[50E075818B0B71E2]-worker) [ ] o.a.s.c.SolrResourceLoader Can't find (or read) directory to add to classloader: lib (resolved as: C:\Users\JenkinsSlave\workspace\Lucene-Solr-5.x-Windows\solr\core\src\test-files\solr\lib).
[junit4] 2> 630394 INFO (SUITE-PingRequestHandlerTest-seed#[50E075818B0B71E2]-worker) [ ] o.a.s.h.c.HttpShardHandlerFactory created with socketTimeout : 600000,connTimeout : 60000,maxConnectionsPerHost : 20,maxConnections : 10000,corePoolSize : 0,maximumPoolSize : 2147483647,maxThreadIdleTime : 5,sizeOfQueue : -1,fairnessPolicy : false,useRetries : false,
[junit4] 2> 630404 INFO (SUITE-PingRequestHandlerTest-seed#[50E075818B0B71E2]-worker) [ ] o.a.s.u.UpdateShardHandler Creating UpdateShardHandler HTTP client with params: socketTimeout=30000&connTimeout=30000&retry=true
[junit4] 2> 630408 INFO (SUITE-PingRequestHandlerTest-seed#[50E075818B0B71E2]-worker) [ ] o.a.s.l.LogWatcher SLF4J impl is org.slf4j.impl.Log4jLoggerFactory
[junit4] 2> 630408 INFO (SUITE-PingRequestHandlerTest-seed#[50E075818B0B71E2]-worker) [ ] o.a.s.l.LogWatcher Registering Log Listener [Log4j (org.slf4j.impl.Log4jLoggerFactory)]
[junit4] 2> 630408 INFO (SUITE-PingRequestHandlerTest-seed#[50E075818B0B71E2]-worker) [ ] o.a.s.c.CoreContainer Security conf doesn't exist. Skipping setup for authorization module.
[junit4] 2> 630408 INFO (SUITE-PingRequestHandlerTest-seed#[50E075818B0B71E2]-worker) [ ] o.a.s.c.CoreContainer No authentication plugin used.
[junit4] 2> 630412 INFO (SUITE-PingRequestHandlerTest-seed#[50E075818B0B71E2]-worker) [ ] o.a.s.c.SolrCore Created CoreDescriptor: {name=collection1, config=solrconfig.xml, transient=false, schema=schema.xml, loadOnStartup=true, configSetProperties=configsetprops.json, instanceDir=collection1, collection=collection1, absoluteInstDir=C:\Users\JenkinsSlave\workspace\Lucene-Solr-5.x-Windows\solr\core\src\test-files\solr\collection1\, dataDir=C:\Users\JenkinsSlave\workspace\Lucene-Solr-5.x-Windows\solr\build\solr-core\test\J0\temp\solr.handler.PingRequestHandlerTest_50E075818B0B71E2-001\init-core-data-001, shard=shard1}
[junit4] 2> 630412 INFO (coreLoadExecutor-1436-thread-1) [ ] o.a.s.c.SolrResourceLoader new SolrResourceLoader for directory: 'C:\Users\JenkinsSlave\workspace\Lucene-Solr-5.x-Windows\solr\core\src\test-files\solr\collection1\'
[junit4] 2> 630413 INFO (coreLoadExecutor-1436-thread-1) [ ] o.a.s.c.SolrResourceLoader JNDI not configured for solr (NoInitialContextEx)
[junit4] 2> 630413 INFO (coreLoadExecutor-1436-thread-1) [ ] o.a.s.c.SolrResourceLoader using system property solr.solr.home: C:\Users\JenkinsSlave\workspace\Lucene-Solr-5.x-Windows\solr\core\src\test-files\solr
[junit4] 2> 630413 INFO (coreLoadExecutor-1436-thread-1) [ ] o.a.s.c.SolrResourceLoader Adding 'file:/C:/Users/JenkinsSlave/workspace/Lucene-Solr-5.x-Windows/solr/core/src/test-files/solr/collection1/lib/classes/' to classloader
[junit4] 2> 630413 INFO (coreLoadExecutor-1436-thread-1) [ ] o.a.s.c.SolrResourceLoader Adding 'file:/C:/Users/JenkinsSlave/workspace/Lucene-Solr-5.x-Windows/solr/core/src/test-files/solr/collection1/lib/README' to classloader
[junit4] 2> 630436 INFO (coreLoadExecutor-1436-thread-1) [ ] o.a.s.c.SolrConfig current version of requestparams : -1
[junit4] 2> 630444 INFO (coreLoadExecutor-1436-thread-1) [ ] o.a.s.c.SolrConfig Using Lucene MatchVersion: 5.4.0
[junit4] 2> 630467 INFO (coreLoadExecutor-1436-thread-1) [ ] o.a.s.c.Config Loaded SolrConfig: solrconfig.xml
[junit4] 2> 630468 INFO (coreLoadExecutor-1436-thread-1) [ ] o.a.s.s.IndexSchema Reading Solr Schema from C:\Users\JenkinsSlave\workspace\Lucene-Solr-5.x-Windows\solr\core\src\test-files\solr\collection1\conf\schema.xml
[junit4] 2> 630473 INFO (coreLoadExecutor-1436-thread-1) [ ] o.a.s.s.IndexSchema [collection1] Schema name=test
[junit4] 2> 630562 INFO (coreLoadExecutor-1436-thread-1) [ ] o.a.s.s.OpenExchangeRatesOrgProvider Initialized with rates=open-exchange-rates.json, refreshInterval=1440.
[junit4] 2> 630567 INFO (coreLoadExecutor-1436-thread-1) [ ] o.a.s.s.IndexSchema default search field in schema is text
[junit4] 2> 630568 INFO (coreLoadExecutor-1436-thread-1) [ ] o.a.s.s.IndexSchema unique key field: id
[junit4] 2> 630575 INFO (coreLoadExecutor-1436-thread-1) [ ] o.a.s.s.FileExchangeRateProvider Reloading exchange rates from file currency.xml
[junit4] 2> 630577 INFO (coreLoadExecutor-1436-thread-1) [ ] o.a.s.s.FileExchangeRateProvider Reloading exchange rates from file currency.xml
[junit4] 2> 630579 INFO (coreLoadExecutor-1436-thread-1) [ ] o.a.s.s.OpenExchangeRatesOrgProvider Reloading exchange rates from open-exchange-rates.json
[junit4] 2> 630579 WARN (coreLoadExecutor-1436-thread-1) [ ] o.a.s.s.OpenExchangeRatesOrgProvider Unknown key IMPORTANT NOTE
[junit4] 2> 630579 WARN (coreLoadExecutor-1436-thread-1) [ ] o.a.s.s.OpenExchangeRatesOrgProvider Expected key, got STRING
[junit4] 2> 630579 INFO (coreLoadExecutor-1436-thread-1) [ ] o.a.s.s.OpenExchangeRatesOrgProvider Reloading exchange rates from open-exchange-rates.json
[junit4] 2> 630580 WARN (coreLoadExecutor-1436-thread-1) [ ] o.a.s.s.OpenExchangeRatesOrgProvider Unknown key IMPORTANT NOTE
[junit4] 2> 630580 WARN (coreLoadExecutor-1436-thread-1) [ ] o.a.s.s.OpenExchangeRatesOrgProvider Expected key, got STRING
[junit4] 2> 630583 INFO (coreLoadExecutor-1436-thread-1) [ ] o.a.s.c.ConfigSetProperties Did not find ConfigSet properties, assuming default properties: Can't find resource 'configsetprops.json' in classpath or 'C:\Users\JenkinsSlave\workspace\Lucene-Solr-5.x-Windows\solr\core\src\test-files\solr\collection1\conf'
[junit4] 2> 630583 INFO (coreLoadExecutor-1436-thread-1) [ ] o.a.s.c.CoreContainer Creating SolrCore 'collection1' using configuration from instancedir C:\Users\JenkinsSlave\workspace\Lucene-Solr-5.x-Windows\solr\core\src\test-files\solr\collection1\
[junit4] 2> 630583 INFO (coreLoadExecutor-1436-thread-1) [ x:collection1] o.a.s.c.SolrCore org.apache.solr.core.MockDirectoryFactory
[junit4] 2> 630583 INFO (coreLoadExecutor-1436-thread-1) [ x:collection1] o.a.s.c.SolrCore [[collection1] ] Opening new SolrCore at [C:\Users\JenkinsSlave\workspace\Lucene-Solr-5.x-Windows\solr\core\src\test-files\solr\collection1\], dataDir=[null]
[junit4] 2> 630583 INFO (coreLoadExecutor-1436-thread-1) [ x:collection1] o.a.s.c.JmxMonitoredMap JMX monitoring is enabled. Adding Solr mbeans to JMX Server: com.sun.jmx.mbeanserver.JmxMBeanServer@1604e75
[junit4] 2> 630584 INFO (coreLoadExecutor-1436-thread-1) [ x:collection1] o.a.s.c.CachingDirectoryFactory return new directory for C:\Users\JenkinsSlave\workspace\Lucene-Solr-5.x-Windows\solr\build\solr-core\test\J0\temp\solr.handler.PingRequestHandlerTest_50E075818B0B71E2-001\init-core-data-001\
[junit4] 2> 630584 INFO (coreLoadExecutor-1436-thread-1) [ x:collection1] o.a.s.c.SolrCore New index directory detected: old=null new=C:\Users\JenkinsSlave\workspace\Lucene-Solr-5.x-Windows\solr\build\solr-core\test\J0\temp\solr.handler.PingRequestHandlerTest_50E075818B0B71E2-001\init-core-data-001\index/
[junit4] 2> 630584 WARN (coreLoadExecutor-1436-thread-1) [ x:collection1] o.a.s.c.SolrCore [collection1] Solr index directory 'C:\Users\JenkinsSlave\workspace\Lucene-Solr-5.x-Windows\solr\build\solr-core\test\J0\temp\solr.handler.PingRequestHandlerTest_50E075818B0B71E2-001\init-core-data-001\index' doesn't exist. Creating new index...
[junit4] 2> 630584 INFO (coreLoadExecutor-1436-thread-1) [ x:collection1] o.a.s.c.CachingDirectoryFactory return new directory for C:\Users\JenkinsSlave\workspace\Lucene-Solr-5.x-Windows\solr\build\solr-core\test\J0\temp\solr.handler.PingRequestHandlerTest_50E075818B0B71E2-001\init-core-data-001\index
[junit4] 2> 630584 INFO (coreLoadExecutor-1436-thread-1) [ x:collection1] o.a.s.u.RandomMergePolicy RandomMergePolicy wrapping class org.apache.lucene.index.TieredMergePolicy: [TieredMergePolicy: maxMergeAtOnce=49, maxMergeAtOnceExplicit=10, maxMergedSegmentMB=27.1396484375, floorSegmentMB=0.6728515625, forceMergeDeletesPctAllowed=18.110209104688018, segmentsPerTier=12.0, maxCFSSegmentSizeMB=8.796093022207999E12, noCFSRatio=0.4892371150863899
[junit4] 2> 630586 INFO (coreLoadExecutor-1436-thread-1) [ x:collection1] o.a.s.c.SolrCore SolrDeletionPolicy.onCommit: commits: num=1
[junit4] 2> commit{dir=MockDirectoryWrapper(RAMDirectory@f4fe57 lockFactory=org.apache.lucene.store.SingleInstanceLockFactory@16e4a1),segFN=segments_1,generation=1}
[junit4] 2> 630586 INFO (coreLoadExecutor-1436-thread-1) [ x:collection1] o.a.s.c.SolrCore newest commit generation = 1
[junit4] 2> 630586 INFO (OldIndexDirectoryCleanupThreadForCore-collection1) [ x:collection1] o.a.s.c.SolrCore Looking for old index directories to cleanup for core collection1 in C:\Users\JenkinsSlave\workspace\Lucene-Solr-5.x-Windows\solr\build\solr-core\test\J0\temp\solr.handler.PingRequestHandlerTest_50E075818B0B71E2-001\init-core-data-001\
[junit4] 2> 630589 INFO (coreLoadExecutor-1436-thread-1) [ x:collection1] o.a.s.u.p.UpdateRequestProcessorChain creating updateRequestProcessorChain "dedupe"
[junit4] 2> 630590 INFO (coreLoadExecutor-1436-thread-1) [ x:collection1] o.a.s.u.p.UpdateRequestProcessorChain inserting DistributedUpdateProcessorFactory into updateRequestProcessorChain "dedupe"
[junit4] 2> 630590 INFO (coreLoadExecutor-1436-thread-1) [ x:collection1] o.a.s.u.p.UpdateRequestProcessorChain creating updateRequestProcessorChain "dedupe-allfields"
[junit4] 2> 630590 INFO (coreLoadExecutor-1436-thread-1) [ x:collection1] o.a.s.u.p.UpdateRequestProcessorChain inserting DistributedUpdateProcessorFactory into updateRequestProcessorChain "dedupe-allfields"
[junit4] 2> 630590 INFO (coreLoadExecutor-1436-thread-1) [ x:collection1] o.a.s.u.p.UpdateRequestProcessorChain creating updateRequestProcessorChain "stored_sig"
[junit4] 2> 630590 INFO (coreLoadExecutor-1436-thread-1) [ x:collection1] o.a.s.u.p.UpdateRequestProcessorChain inserting DistributedUpdateProcessorFactory into updateRequestProcessorChain "stored_sig"
[junit4] 2> 630590 INFO (coreLoadExecutor-1436-thread-1) [ x:collection1] o.a.s.u.p.UpdateRequestProcessorChain creating updateRequestProcessorChain "uniq-fields"
[junit4] 2> 630591 INFO (coreLoadExecutor-1436-thread-1) [ x:collection1] o.a.s.u.p.UpdateRequestProcessorChain inserting DistributedUpdateProcessorFactory into updateRequestProcessorChain "uniq-fields"
[junit4] 2> 630591 INFO (coreLoadExecutor-1436-thread-1) [ x:collection1] o.a.s.u.p.UpdateRequestProcessorChain creating updateRequestProcessorChain "distrib-dup-test-chain-explicit"
[junit4] 2> 630591 INFO (coreLoadExecutor-1436-thread-1) [ x:collection1] o.a.s.u.p.UpdateRequestProcessorChain creating updateRequestProcessorChain "distrib-dup-test-chain-implicit"
[junit4] 2> 630591 INFO (coreLoadExecutor-1436-thread-1) [ x:collection1] o.a.s.u.p.UpdateRequestProcessorChain inserting DistributedUpdateProcessorFactory into updateRequestProcessorChain "distrib-dup-test-chain-implicit"
[junit4] 2> 630591 INFO (coreLoadExecutor-1436-thread-1) [ x:collection1] o.a.s.c.SolrCore no updateRequestProcessorChain defined as default, creating implicit default
[junit4] 2> 630595 INFO (coreLoadExecutor-1436-thread-1) [ x:collection1] o.a.s.h.l.XMLLoader xsltCacheLifetimeSeconds=60
[junit4] 2> 630596 INFO (coreLoadExecutor-1436-thread-1) [ x:collection1] o.a.s.h.l.XMLLoader xsltCacheLifetimeSeconds=60
[junit4] 2> 630597 INFO (coreLoadExecutor-1436-thread-1) [ x:collection1] o.a.s.h.l.XMLLoader xsltCacheLifetimeSeconds=60
[junit4] 2> 630598 INFO (coreLoadExecutor-1436-thread-1) [ x:collection1] o.a.s.h.l.XMLLoader xsltCacheLifetimeSeconds=60
[junit4] 2> 630605 INFO (coreLoadExecutor-1436-thread-1) [ x:collection1] o.a.s.c.PluginBag requestHandler : 'lazy' created with startup=lazy
[junit4] 2> 630614 INFO (coreLoadExecutor-1436-thread-1) [ x:collection1] o.a.s.c.RequestHandlers Registered paths: /admin/mbeans,standard,spellCheckCompRH,lazy,/update/json/docs,/admin/luke,spellCheckWithWordbreak_Direct,tvrh,/get,/admin/properties,/update/json,mltrh,/admin/threads,/search-facet-def,/update/csv,/search-facet-invariants,/admin/segments,spellCheckCompRH1,/mlt,/admin/system,/replication,dismax,defaults,/config,/schema,/admin/plugins,/admin/logging,spellCheckWithWordbreak,mock,/admin/ping,/update,/admin/file,/terms,spellCheckCompRH_Direct,/debug/dump
[junit4] 2> 630615 WARN (coreLoadExecutor-1436-thread-1) [ x:collection1] o.a.s.c.SolrCore solrconfig.xml uses deprecated <admin/gettableFiles>, Please update your config to use the ShowFileRequestHandler.
[junit4] 2> 630615 INFO (coreLoadExecutor-1436-thread-1) [ x:collection1] o.a.s.c.SolrCore Using default statsCache cache: org.apache.solr.search.stats.LocalStatsCache
[junit4] 2> 630616 INFO (coreLoadExecutor-1436-thread-1) [ x:collection1] o.a.s.u.UpdateHandler Using UpdateLog implementation: org.apache.solr.update.UpdateLog
[junit4] 2> 630616 INFO (coreLoadExecutor-1436-thread-1) [ x:collection1] o.a.s.u.UpdateLog Initializing UpdateLog: dataDir= defaultSyncLevel=FLUSH numRecordsToKeep=100 maxNumLogsToKeep=10 numVersionBuckets=65536
[junit4] 2> 630617 INFO (coreLoadExecutor-1436-thread-1) [ x:collection1] o.a.s.c.SolrCore Hard AutoCommit: disabled
[junit4] 2> 630617 INFO (coreLoadExecutor-1436-thread-1) [ x:collection1] o.a.s.c.SolrCore Soft AutoCommit: disabled
[junit4] 2> 630617 INFO (coreLoadExecutor-1436-thread-1) [ x:collection1] o.a.s.u.RandomMergePolicy RandomMergePolicy wrapping class org.apache.lucene.index.LogDocMergePolicy: [LogDocMergePolicy: minMergeSize=1000, mergeFactor=5, maxMergeSize=9223372036854775807, maxMergeSizeForForcedMerge=9223372036854775807, calibrateSizeByDeletes=true, maxMergeDocs=2147483647, maxCFSSegmentSizeMB=8.796093022207999E12, noCFSRatio=0.1385206570614]
[junit4] 2> 630618 INFO (coreLoadExecutor-1436-thread-1) [ x:collection1] o.a.s.c.SolrCore SolrDeletionPolicy.onInit: commits: num=1
[junit4] 2> commit{dir=MockDirectoryWrapper(RAMDirectory@f4fe57 lockFactory=org.apache.lucene.store.SingleInstanceLockFactory@16e4a1),segFN=segments_1,generation=1}
[junit4] 2> 630618 INFO (coreLoadExecutor-1436-thread-1) [ x:collection1] o.a.s.c.SolrCore newest commit generation = 1
[junit4] 2> 630618 INFO (coreLoadExecutor-1436-thread-1) [ x:collection1] o.a.s.s.SolrIndexSearcher Opening Searcher@1b543cf[collection1] main
[junit4] 2> 630618 INFO (coreLoadExecutor-1436-thread-1) [ x:collection1] o.a.s.r.RestManager Initializing RestManager with initArgs: {storageIO=org.apache.solr.rest.ManagedResourceStorage$InMemoryStorageIO}
[junit4] 2> 630618 INFO (coreLoadExecutor-1436-thread-1) [ x:collection1] o.a.s.r.ManagedResourceStorage Reading _rest_managed.json using InMemoryStorage
[junit4] 2> 630619 INFO (coreLoadExecutor-1436-thread-1) [ x:collection1] o.a.s.r.RestManager Initializing 0 registered ManagedResources
[junit4] 2> 630619 INFO (coreLoadExecutor-1436-thread-1) [ x:collection1] o.a.s.h.c.SpellCheckComponent Initializing spell checkers
[junit4] 2> 630637 INFO (coreLoadExecutor-1436-thread-1) [ x:collection1] o.a.s.s.DirectSolrSpellChecker init: {name=direct,classname=DirectSolrSpellChecker,field=lowerfilt,minQueryLength=3}
[junit4] 2> 630735 INFO (coreLoadExecutor-1436-thread-1) [ x:collection1] o.a.s.h.ReplicationHandler Commits will be reserved for 10000
[junit4] 2> 630735 INFO (searcherExecutor-1437-thread-1-processing-x:collection1) [ x:collection1] o.a.s.h.c.SpellCheckComponent Loading spell index for spellchecker: default
[junit4] 2> 630735 INFO (searcherExecutor-1437-thread-1-processing-x:collection1) [ x:collection1] o.a.s.h.c.SpellCheckComponent Loading spell index for spellchecker: direct
[junit4] 2> 630736 INFO (searcherExecutor-1437-thread-1-processing-x:collection1) [ x:collection1] o.a.s.h.c.SpellCheckComponent Loading spell index for spellchecker: wordbreak
[junit4] 2> 630736 INFO (searcherExecutor-1437-thread-1-processing-x:collection1) [ x:collection1] o.a.s.h.c.SpellCheckComponent Loading spell index for spellchecker: multipleFields
[junit4] 2> 630736 INFO (searcherExecutor-1437-thread-1-processing-x:collection1) [ x:collection1] o.a.s.h.c.SpellCheckComponent Loading spell index for spellchecker: jarowinkler
[junit4] 2> 630737 INFO (coreLoadExecutor-1436-thread-1) [ x:collection1] o.a.s.u.UpdateLog Looking up max value of version field to seed version buckets
[junit4] 2> 630737 INFO (coreLoadExecutor-1436-thread-1) [ x:collection1] o.a.s.u.VersionInfo Refreshing highest value of _version_ for 65536 version buckets from index
[junit4] 2> 630737 INFO (searcherExecutor-1437-thread-1-processing-x:collection1) [ x:collection1] o.a.s.h.c.SpellCheckComponent Loading spell index for spellchecker: external
[junit4] 2> 630737 INFO (coreLoadExecutor-1436-thread-1) [ x:collection1] o.a.s.u.VersionInfo No terms found for _version_, cannot seed version bucket highest value from index
[junit4] 2> 630737 INFO (coreLoadExecutor-1436-thread-1) [ x:collection1] o.a.s.u.UpdateLog Could not find max version in index or recent updates, using new clock 1515364595123879936
[junit4] 2> 630737 INFO (searcherExecutor-1437-thread-1-processing-x:collection1) [ x:collection1] o.a.s.h.c.SpellCheckComponent Loading spell index for spellchecker: freq
[junit4] 2> 630738 INFO (searcherExecutor-1437-thread-1-processing-x:collection1) [ x:collection1] o.a.s.h.c.SpellCheckComponent Loading spell index for spellchecker: fqcn
[junit4] 2> 630738 INFO (searcherExecutor-1437-thread-1-processing-x:collection1) [ x:collection1] o.a.s.h.c.SpellCheckComponent Loading spell index for spellchecker: perDict
[junit4] 2> 630738 INFO (coreLoadExecutor-1436-thread-1) [ x:collection1] o.a.s.u.UpdateLog Took 1.0ms to seed version buckets with highest version 1515364595123879936
[junit4] 2> 630738 INFO (coreLoadExecutor-1436-thread-1) [ x:collection1] o.a.s.c.CoreContainer registering core: collection1
[junit4] 2> 630739 INFO (searcherExecutor-1437-thread-1-processing-x:collection1) [ x:collection1] o.a.s.c.SolrCore [collection1] Registered new searcher Searcher@1b543cf[collection1] main{ExitableDirectoryReader(UninvertingDirectoryReader())}
[junit4] 2> 630740 INFO (SUITE-PingRequestHandlerTest-seed#[50E075818B0B71E2]-worker) [ ] o.a.s.SolrTestCaseJ4 ####initCore end
[junit4] 2> 630743 INFO (TEST-PingRequestHandlerTest.testGettingStatus-seed#[50E075818B0B71E2]) [ ] o.a.s.SolrTestCaseJ4 ###Starting testGettingStatus
[junit4] 2> 630749 INFO (TEST-PingRequestHandlerTest.testGettingStatus-seed#[50E075818B0B71E2]) [ ] o.a.s.SolrTestCaseJ4 ###Ending testGettingStatus
[junit4] 2> 630752 INFO (TEST-PingRequestHandlerTest.testEnablingServer-seed#[50E075818B0B71E2]) [ ] o.a.s.SolrTestCaseJ4 ###Starting testEnablingServer
[junit4] 2> 630753 INFO (TEST-PingRequestHandlerTest.testEnablingServer-seed#[50E075818B0B71E2]) [ ] o.a.s.c.S.Request [collection1] webapp=null path=null params={wt=xml} hits=0 status=0 QTime=0
[junit4] 2> 630754 INFO (TEST-PingRequestHandlerTest.testEnablingServer-seed#[50E075818B0B71E2]) [ ] o.a.s.SolrTestCaseJ4 ###Ending testEnablingServer
[junit4] 2> 630755 INFO (TEST-PingRequestHandlerTest.testDisablingServer-seed#[50E075818B0B71E2]) [ ] o.a.s.SolrTestCaseJ4 ###Starting testDisablingServer
[junit4] 2> 630756 INFO (TEST-PingRequestHandlerTest.testDisablingServer-seed#[50E075818B0B71E2]) [ ] o.a.s.c.S.Request [collection1] webapp=null path=null params={wt=xml} hits=0 status=0 QTime=0
[junit4] 2> 630757 INFO (TEST-PingRequestHandlerTest.testDisablingServer-seed#[50E075818B0B71E2]) [ ] o.a.s.SolrTestCaseJ4 ###Ending testDisablingServer
[junit4] 2> 630759 INFO (TEST-PingRequestHandlerTest.testBadActionRaisesException-seed#[50E075818B0B71E2]) [ ] o.a.s.SolrTestCaseJ4 ###Starting testBadActionRaisesException
[junit4] 2> 630760 INFO (TEST-PingRequestHandlerTest.testBadActionRaisesException-seed#[50E075818B0B71E2]) [ ] o.a.s.SolrTestCaseJ4 ###Ending testBadActionRaisesException
[junit4] 2> 630761 INFO (TEST-PingRequestHandlerTest.testPingInClusterWithNoHealthCheck-seed#[50E075818B0B71E2]) [ ] o.a.s.SolrTestCaseJ4 ###Starting testPingInClusterWithNoHealthCheck
[junit4] 2> 630762 INFO (TEST-PingRequestHandlerTest.testPingInClusterWithNoHealthCheck-seed#[50E075818B0B71E2]) [ ] o.a.s.c.ZkTestServer STARTING ZK TEST SERVER
[junit4] 2> 630763 INFO (Thread-1581) [ ] o.a.s.c.ZkTestServer client port:0.0.0.0/0.0.0.0:0
[junit4] 2> 630763 INFO (Thread-1581) [ ] o.a.s.c.ZkTestServer Starting server
[junit4] 2> 630864 INFO (TEST-PingRequestHandlerTest.testPingInClusterWithNoHealthCheck-seed#[50E075818B0B71E2]) [ ] o.a.s.c.ZkTestServer start zk server on port:57401
[junit4] 2> 630864 INFO (TEST-PingRequestHandlerTest.testPingInClusterWithNoHealthCheck-seed#[50E075818B0B71E2]) [ ] o.a.s.c.c.SolrZkClient Using default ZkCredentialsProvider
[junit4] 2> 630865 INFO (TEST-PingRequestHandlerTest.testPingInClusterWithNoHealthCheck-seed#[50E075818B0B71E2]) [ ] o.a.s.c.c.ConnectionManager Waiting for client to connect to ZooKeeper
[junit4] 2> 630868 INFO (zkCallback-322-thread-1) [ ] o.a.s.c.c.ConnectionManager Watcher org.apache.solr.common.cloud.ConnectionManager@127e843 name:ZooKeeperConnection Watcher:127.0.0.1:57401 got event WatchedEvent state:SyncConnected type:None path:null path:null type:None
[junit4] 2> 630868 INFO (TEST-PingRequestHandlerTest.testPingInClusterWithNoHealthCheck-seed#[50E075818B0B71E2]) [ ] o.a.s.c.c.ConnectionManager Client is connected to ZooKeeper
[junit4] 2> 630868 INFO (TEST-PingRequestHandlerTest.testPingInClusterWithNoHealthCheck-seed#[50E075818B0B71E2]) [ ] o.a.s.c.c.SolrZkClient Using default ZkACLProvider
[junit4] 2> 630869 INFO (TEST-PingRequestHandlerTest.testPingInClusterWithNoHealthCheck-seed#[50E075818B0B71E2]) [ ] o.a.s.c.c.SolrZkClient makePath: /solr/solr.xml
[junit4] 2> 630874 INFO (TEST-PingRequestHandlerTest.testPingInClusterWithNoHealthCheck-seed#[50E075818B0B71E2]) [ ] o.a.s.c.c.SolrZkClient makePath: /solr/clusterprops.json
[junit4] 2> 630909 INFO (jetty-launcher-321-thread-1) [ ] o.e.j.s.Server jetty-9.2.13.v20150730
[junit4] 2> 630910 INFO (jetty-launcher-321-thread-4) [ ] o.e.j.s.Server jetty-9.2.13.v20150730
[junit4] 2> 630910 INFO (jetty-launcher-321-thread-5) [ ] o.e.j.s.Server jetty-9.2.13.v20150730
[junit4] 2> 630912 INFO (jetty-launcher-321-thread-2) [ ] o.e.j.s.Server jetty-9.2.13.v20150730
[junit4] 2> 630912 INFO (jetty-launcher-321-thread-3) [ ] o.e.j.s.Server jetty-9.2.13.v20150730
[junit4] 2> 630919 INFO (jetty-launcher-321-thread-5) [ ] o.e.j.s.h.ContextHandler Started o.e.j.s.ServletContextHandler@ac4f67{/solr,null,AVAILABLE}
[junit4] 2> 630920 INFO (jetty-launcher-321-thread-3) [ ] o.e.j.s.h.ContextHandler Started o.e.j.s.ServletContextHandler@1f29256{/solr,null,AVAILABLE}
[junit4] 2> 630920 INFO (jetty-launcher-321-thread-1) [ ] o.e.j.s.h.ContextHandler Started o.e.j.s.ServletContextHandler@15e9127{/solr,null,AVAILABLE}
[junit4] 2> 630920 INFO (jetty-launcher-321-thread-4) [ ] o.e.j.s.h.ContextHandler Started o.e.j.s.ServletContextHandler@aae5b2{/solr,null,AVAILABLE}
[junit4] 2> 630921 INFO (jetty-launcher-321-thread-2) [ ] o.e.j.s.h.ContextHandler Started o.e.j.s.ServletContextHandler@10c510e{/solr,null,AVAILABLE}
[junit4] 2> 630959 INFO (jetty-launcher-321-thread-5) [ ] o.e.j.s.ServerConnector Started ServerConnector@17b6158{SSL-http/1.1}{127.0.0.1:57405}
[junit4] 2> 630959 INFO (jetty-launcher-321-thread-5) [ ] o.e.j.s.Server Started @630230ms
[junit4] 2> 630959 INFO (jetty-launcher-321-thread-5) [ ] o.a.s.c.s.e.JettySolrRunner Jetty properties: {hostContext=/solr, hostPort=57405}
[junit4] 2> 630959 INFO (jetty-launcher-321-thread-5) [ ] o.a.s.s.SolrDispatchFilter SolrDispatchFilter.init(): sun.misc.Launcher$AppClassLoader@e2f2a
[junit4] 2> 630959 INFO (jetty-launcher-321-thread-5) [ ] o.a.s.c.SolrResourceLoader new SolrResourceLoader for directory: 'C:\Users\JenkinsSlave\workspace\Lucene-Solr-5.x-Windows\solr\build\solr-core\test\J0\temp\solr.handler.PingRequestHandlerTest_50E075818B0B71E2-001\tempDir-001\'
[junit4] 2> 630959 INFO (jetty-launcher-321-thread-5) [ ] o.a.s.c.SolrResourceLoader JNDI not configured for solr (NoInitialContextEx)
[junit4] 2> 630959 INFO (jetty-launcher-321-thread-5) [ ] o.a.s.c.SolrResourceLoader using system property solr.solr.home: C:\Users\JenkinsSlave\workspace\Lucene-Solr-5.x-Windows\solr\core\src\test-files\solr
[junit4] 2> 630963 INFO (jetty-launcher-321-thread-3) [ ] o.e.j.s.ServerConnector Started ServerConnector@12dc1dc{SSL-http/1.1}{127.0.0.1:57406}
[junit4] 2> 630963 INFO (jetty-launcher-321-thread-3) [ ] o.e.j.s.Server Started @630234ms
[junit4] 2> 630963 INFO (jetty-launcher-321-thread-3) [ ] o.a.s.c.s.e.JettySolrRunner Jetty properties: {hostContext=/solr, hostPort=57406}
[junit4] 2> 630963 INFO (jetty-launcher-321-thread-3) [ ] o.a.s.s.SolrDispatchFilter SolrDispatchFilter.init(): sun.misc.Launcher$AppClassLoader@e2f2a
[junit4] 2> 630963 INFO (jetty-launcher-321-thread-3) [ ] o.a.s.c.SolrResourceLoader new SolrResourceLoader for directory: 'C:\Users\JenkinsSlave\workspace\Lucene-Solr-5.x-Windows\solr\build\solr-core\test\J0\temp\solr.handler.PingRequestHandlerTest_50E075818B0B71E2-001\tempDir-001\'
[junit4] 2> 630963 INFO (jetty-launcher-321-thread-3) [ ] o.a.s.c.SolrResourceLoader JNDI not configured for solr (NoInitialContextEx)
[junit4] 2> 630963 INFO (jetty-launcher-321-thread-3) [ ] o.a.s.c.SolrResourceLoader using system property solr.solr.home: C:\Users\JenkinsSlave\workspace\Lucene-Solr-5.x-Windows\solr\core\src\test-files\solr
[junit4] 2> 630964 INFO (jetty-launcher-321-thread-2) [ ] o.e.j.s.ServerConnector Started ServerConnector@89c317{SSL-http/1.1}{127.0.0.1:57409}
[junit4] 2> 630964 INFO (jetty-launcher-321-thread-2) [ ] o.e.j.s.Server Started @630236ms
[junit4] 2> 630964 INFO (jetty-launcher-321-thread-2) [ ] o.a.s.c.s.e.JettySolrRunner Jetty properties: {hostContext=/solr, hostPort=57409}
[junit4] 2> 630964 INFO (jetty-launcher-321-thread-2) [ ] o.a.s.s.SolrDispatchFilter SolrDispatchFilter.init(): sun.misc.Launcher$AppClassLoader@e2f2a
[junit4] 2> 630964 INFO (jetty-launcher-321-thread-2) [ ] o.a.s.c.SolrResourceLoader new SolrResourceLoader for directory: 'C:\Users\JenkinsSlave\workspace\Lucene-Solr-5.x-Windows\solr\build\solr-core\test\J0\temp\solr.handler.PingRequestHandlerTest_50E075818B0B71E2-001\tempDir-001\'
[junit4] 2> 630965 INFO (jetty-launcher-321-thread-2) [ ] o.a.s.c.SolrResourceLoader JNDI not configured for solr (NoInitialContextEx)
[junit4] 2> 630965 INFO (jetty-launcher-321-thread-2) [ ] o.a.s.c.SolrResourceLoader using system property solr.solr.home: C:\Users\JenkinsSlave\workspace\Lucene-Solr-5.x-Windows\solr\core\src\test-files\solr
[junit4] 2> 630970 INFO (jetty-launcher-321-thread-4) [ ] o.e.j.s.ServerConnector Started ServerConnector@b256ca{SSL-http/1.1}{127.0.0.1:57408}
[junit4] 2> 630970 INFO (jetty-launcher-321-thread-4) [ ] o.e.j.s.Server Started @630242ms
[junit4] 2> 630970 INFO (jetty-launcher-321-thread-4) [ ] o.a.s.c.s.e.JettySolrRunner Jetty properties: {hostContext=/solr, hostPort=57408}
[junit4] 2> 630970 INFO (jetty-launcher-321-thread-4) [ ] o.a.s.s.SolrDispatchFilter SolrDispatchFilter.init(): sun.misc.Launcher$AppClassLoader@e2f2a
[junit4] 2> 630970 INFO (jetty-launcher-321-thread-4) [ ] o.a.s.c.SolrResourceLoader new SolrResourceLoader for directory: 'C:\Users\JenkinsSlave\workspace\Lucene-Solr-5.x-Windows\solr\build\solr-core\test\J0\temp\solr.handler.PingRequestHandlerTest_50E075818B0B71E2-001\tempDir-001\'
[junit4] 2> 630970 INFO (jetty-launcher-321-thread-4) [ ] o.a.s.c.SolrResourceLoader JNDI not configured for solr (NoInitialContextEx)
[junit4] 2> 630970 INFO (jetty-launcher-321-thread-4) [ ] o.a.s.c.SolrResourceLoader using system property solr.solr.home: C:\Users\JenkinsSlave\workspace\Lucene-Solr-5.x-Windows\solr\core\src\test-files\solr
[junit4] 2> 630996 INFO (jetty-launcher-321-thread-1) [ ] o.e.j.s.ServerConnector Started ServerConnector@f5f44{SSL-http/1.1}{127.0.0.1:57407}
[junit4] 2> 630996 INFO (jetty-launcher-321-thread-1) [ ] o.e.j.s.Server Started @630268ms
[junit4] 2> 630996 INFO (jetty-launcher-321-thread-1) [ ] o.a.s.c.s.e.JettySolrRunner Jetty properties: {hostContext=/solr, hostPort=57407}
[junit4] 2> 630996 INFO (jetty-launcher-321-thread-1) [ ] o.a.s.s.SolrDispatchFilter SolrDispatchFilter.init(): sun.misc.Launcher$AppClassLoader@e2f2a
[junit4] 2> 630997 INFO (jetty-launcher-321-thread-1) [ ] o.a.s.c.SolrResourceLoader new SolrResourceLoader for directory: 'C:\Users\JenkinsSlave\workspace\Lucene-Solr-5.x-Windows\solr\build\solr-core\test\J0\temp\solr.handler.PingRequestHandlerTest_50E075818B0B71E2-001\tempDir-001\'
[junit4] 2> 630997 INFO (jetty-launcher-321-thread-1) [ ] o.a.s.c.SolrResourceLoader JNDI not configured for solr (NoInitialContextEx)
[junit4] 2> 630997 INFO (jetty-launcher-321-thread-1) [ ] o.a.s.c.SolrResourceLoader using system property solr.solr.home: C:\Users\JenkinsSlave\workspace\Lucene-Solr-5.x-Windows\solr\core\src\test-files\solr
[junit4] 2> 631014 INFO (jetty-launcher-321-thread-2) [ ] o.a.s.c.c.SolrZkClient Using default ZkCredentialsProvider
[junit4] 2> 631017 INFO (jetty-launcher-321-thread-2) [ ] o.a.s.c.c.ConnectionManager Waiting for client to connect to ZooKeeper
[junit4] 2> 631020 INFO (zkCallback-323-thread-1) [ ] o.a.s.c.c.ConnectionManager Watcher org.apache.solr.common.cloud.ConnectionManager@11e5e46 name:ZooKeeperConnection Watcher:127.0.0.1:57401/solr got event WatchedEvent state:SyncConnected type:None path:null path:null type:None
[junit4] 2> 631020 INFO (jetty-launcher-321-thread-2) [ ] o.a.s.c.c.ConnectionManager Client is connected to ZooKeeper
[junit4] 2> 631021 INFO (jetty-launcher-321-thread-2) [ ] o.a.s.c.c.SolrZkClient Using default ZkACLProvider
[junit4] 2> 631023 INFO (jetty-launcher-321-thread-2) [ ] o.a.s.s.SolrDispatchFilter solr.xml found in ZooKeeper. Loading...
[junit4] 2> 631024 INFO (jetty-launcher-321-thread-5) [ ] o.a.s.c.c.SolrZkClient Using default ZkCredentialsProvider
[junit4] 2> 631025 INFO (jetty-launcher-321-thread-5) [ ] o.a.s.c.c.ConnectionManager Waiting for client to connect to ZooKeeper
[junit4] 2> 631030 INFO (zkCallback-324-thread-1) [ ] o.a.s.c.c.ConnectionManager Watcher org.apache.solr.common.cloud.ConnectionManager@91a08 name:ZooKeeperConnection Watcher:127.0.0.1:57401/solr got event WatchedEvent state:SyncConnected type:None path:null path:null type:None
[junit4] 2> 631031 INFO (jetty-launcher-321-thread-5) [ ] o.a.s.c.c.ConnectionManager Client is connected to ZooKeeper
[junit4] 2> 631031 INFO (jetty-launcher-321-thread-5) [ ] o.a.s.c.c.SolrZkClient Using default ZkACLProvider
[junit4] 2> 631032 INFO (jetty-launcher-321-thread-5) [ ] o.a.s.s.SolrDispatchFilter solr.xml found in ZooKeeper. Loading...
[junit4] 2> 631033 INFO (jetty-launcher-321-thread-1) [ ] o.a.s.c.c.SolrZkClient Using default ZkCredentialsProvider
[junit4] 2> 631033 INFO (jetty-launcher-321-thread-1) [ ] o.a.s.c.c.ConnectionManager Waiting for client to connect to ZooKeeper
[junit4] 2> 631034 INFO (jetty-launcher-321-thread-2) [ ] o.a.s.c.CoresLocator Config-defined core root directory: C:\Users\JenkinsSlave\workspace\Lucene-Solr-5.x-Windows\solr\build\solr-core\test\J0\temp\solr.handler.PingRequestHandlerTest_50E075818B0B71E2-001\tempDir-001\.
[junit4] 2> 631034 INFO (jetty-launcher-321-thread-2) [ ] o.a.s.c.CoreContainer New CoreContainer 13991594
[junit4] 2> 631034 INFO (jetty-launcher-321-thread-2) [ ] o.a.s.c.CoreContainer Loading cores into CoreContainer [instanceDir=C:\Users\JenkinsSlave\workspace\Lucene-Solr-5.x-Windows\solr\build\solr-core\test\J0\temp\solr.handler.PingRequestHandlerTest_50E075818B0B71E2-001\tempDir-001\]
[junit4] 2> 631034 INFO (jetty-launcher-321-thread-2) [ ] o.a.s.c.CoreContainer loading shared library: C:\Users\JenkinsSlave\workspace\Lucene-Solr-5.x-Windows\solr\build\solr-core\test\J0\temp\solr.handler.PingRequestHandlerTest_50E075818B0B71E2-001\tempDir-001\lib
[junit4] 2> 631034 WARN (jetty-launcher-321-thread-2) [ ] o.a.s.c.SolrResourceLoader Can't find (or read) directory to add to classloader: lib (resolved as: C:\Users\JenkinsSlave\workspace\Lucene-Solr-5.x-Windows\solr\build\solr-core\test\J0\temp\solr.handler.PingRequestHandlerTest_50E075818B0B71E2-001\tempDir-001\lib).
[junit4] 2> 631042 INFO (jetty-launcher-321-thread-4) [ ] o.a.s.c.c.SolrZkClient Using default ZkCredentialsProvider
[junit4] 2> 631054 INFO (zkCallback-325-thread-1) [ ] o.a.s.c.c.ConnectionManager Watcher org.apache.solr.common.cloud.ConnectionManager@18e7055 name:ZooKeeperConnection Watcher:127.0.0.1:57401/solr got event WatchedEvent state:SyncConnected type:None path:null path:null type:None
[junit4] 2> 631054 INFO (jetty-launcher-321-thread-1) [ ] o.a.s.c.c.ConnectionManager Client is connected to ZooKeeper
[junit4] 2> 631055 INFO (jetty-launcher-321-thread-1) [ ] o.a.s.c.c.SolrZkClient Using default ZkACLProvider
[junit4] 2> 631056 INFO (jetty-launcher-321-thread-4) [ ] o.a.s.c.c.ConnectionManager Waiting for client to connect to ZooKeeper
[junit4] 2> 631057 INFO (jetty-launcher-321-thread-1) [ ] o.a.s.s.SolrDispatchFilter solr.xml found in ZooKeeper. Loading...
[junit4] 2> 631060 INFO (jetty-launcher-321-thread-5) [ ] o.a.s.c.CoresLocator Config-defined core root directory: C:\Users\JenkinsSlave\workspace\Lucene-Solr-5.x-Windows\solr\build\solr-core\test\J0\temp\solr.handler.PingRequestHandlerTest_50E075818B0B71E2-001\tempDir-001\.
[junit4] 2> 631060 INFO (jetty-launcher-321-thread-5) [ ] o.a.s.c.CoreContainer New CoreContainer 14113309
[junit4] 2> 631060 INFO (jetty-launcher-321-thread-5) [ ] o.a.s.c.CoreContainer Loading cores into CoreContainer [instanceDir=C:\Users\JenkinsSlave\workspace\Lucene-Solr-5.x-Windows\solr\build\solr-core\test\J0\temp\solr.handler.PingRequestHandlerTest_50E075818B0B71E2-001\tempDir-001\]
[junit4] 2> 631061 INFO (jetty-launcher-321-thread-5) [ ] o.a.s.c.CoreContainer loading shared library: C:\Users\JenkinsSlave\workspace\Lucene-Solr-5.x-Windows\solr\build\solr-core\test\J0\temp\solr.handler.PingRequestHandlerTest_50E075818B0B71E2-001\tempDir-001\lib
[junit4] 2> 631061 WARN (jetty-launcher-321-thread-5) [ ] o.a.s.c.SolrResourceLoader Can't find (or read) directory to add to classloader: lib (resolved as: C:\Users\JenkinsSlave\workspace\Lucene-Solr-5.x-Windows\solr\build\solr-core\test\J0\temp\solr.handler.PingRequestHandlerTest_50E075818B0B71E2-001\tempDir-001\lib).
[junit4] 2> 631062 INFO (jetty-launcher-321-thread-3) [ ] o.a.s.c.c.SolrZkClient Using default ZkCredentialsProvider
[junit4] 2> 631062 INFO (zkCallback-326-thread-1) [ ] o.a.s.c.c.ConnectionManager Watcher org.apache.solr.common.cloud.ConnectionManager@1b624fa name:ZooKeeperConnection Watcher:127.0.0.1:57401/solr got event WatchedEvent state:SyncConnected type:None path:null path:null type:None
[junit4] 2> 631064 INFO (jetty-launcher-321-thread-2) [ ] o.a.s.h.c.HttpShardHandlerFactory created with socketTimeout : 90000,urlScheme : https,connTimeout : 15000,maxConnectionsPerHost : 20,maxConnections : 10000,corePoolSize : 0,maximumPoolSize : 2147483647,maxThreadIdleTime : 5,sizeOfQueue : -1,fairnessPolicy : false,useRetries : false,
[junit4] 2> 631065 INFO (jetty-launcher-321-thread-3) [ ] o.a.s.c.c.ConnectionManager Waiting for client to connect to ZooKeeper
[junit4] 2> 631065 INFO (jetty-launcher-321-thread-4) [ ] o.a.s.c.c.ConnectionManager Client is connected to ZooKeeper
[junit4] 2> 631065 INFO (jetty-launcher-321-thread-4) [ ] o.a.s.c.c.SolrZkClient Using default ZkACLProvider
[junit4] 2> 631065 INFO (jetty-launcher-321-thread-4) [ ] o.a.s.s.SolrDispatchFilter solr.xml found in ZooKeeper. Loading...
[junit4] 2> 631070 INFO (jetty-launcher-321-thread-2) [ ] o.a.s.u.UpdateShardHandler Creating UpdateShardHandler HTTP client with params: socketTimeout=340000&connTimeout=45000&retry=true
[junit4] 2> 631073 INFO (jetty-launcher-321-thread-2) [ ] o.a.s.l.LogWatcher SLF4J impl is org.slf4j.impl.Log4jLoggerFactory
[junit4] 2> 631073 INFO (jetty-launcher-321-thread-2) [ ] o.a.s.l.LogWatcher Registering Log Listener [Log4j (org.slf4j.impl.Log4jLoggerFactory)]
[junit4] 2> 631074 INFO (jetty-launcher-321-thread-2) [ ] o.a.s.c.ZkContainer Zookeeper client=127.0.0.1:57401/solr
[junit4] 2> 631074 INFO (jetty-launcher-321-thread-2) [ ] o.a.s.c.ZkController zkHost includes chroot
[junit4] 2> 631074 INFO (jetty-launcher-321-thread-2) [ ] o.a.s.c.c.SolrZkClient Using default ZkCredentialsProvider
[junit4] 2> 631074 INFO (jetty-launcher-321-thread-5) [ ] o.a.s.h.c.HttpShardHandlerFactory created with socketTimeout : 90000,urlScheme : https,connTimeout : 15000,maxConnectionsPerHost : 20,maxConnections : 10000,corePoolSize : 0,maximumPoolSize : 2147483647,maxThreadIdleTime : 5,sizeOfQueue : -1,fairnessPolicy : false,useRetries : false,
[junit4] 2> 631078 WARN (NIOServerCxn.Factory:0.0.0.0/0.0.0.0:0) [ ] o.a.z.s.NIOServerCnxn caught end of stream exception
[junit4] 2> EndOfStreamException: Unable to read additional data from client sessionid 0x1507a8120f60004, likely client has closed socket
[junit4] 2> at org.apache.zookeeper.server.NIOServerCnxn.doIO(NIOServerCnxn.java:228)
[junit4] 2> at org.apache.zookeeper.server.NIOServerCnxnFactory.run(NIOServerCnxnFactory.java:208)
[junit4] 2> at java.lang.Thread.run(Thread.java:745)
[junit4] 2> 631079 INFO (jetty-launcher-321-thread-2) [ ] o.a.s.c.c.ConnectionManager Waiting for client to connect to ZooKeeper
[junit4] 2> 631079 INFO (jetty-launcher-321-thread-4) [ ] o.a.s.c.CoresLocator Config-defined core root directory: C:\Users\JenkinsSlave\workspace\Lucene-Solr-5.x-Windows\solr\build\solr-core\test\J0\temp\solr.handler.PingRequestHandlerTest_50E075818B0B71E2-001\tempDir-001\.
[junit4] 2> 631079 INFO (jetty-launcher-321-thread-4) [ ] o.a.s.c.CoreContainer New CoreContainer 15688913
[junit4] 2> 631079 INFO (jetty-launcher-321-thread-4) [ ] o.a.s.c.CoreContainer Loading cores into CoreContainer [instanceDir=C:\Users\JenkinsSlave\workspace\Lucene-Solr-5.x-Windows\solr\build\solr-core\test\J0\temp\solr.handler.PingRequestHandlerTest_50E075818B0B71E2-001\tempDir-001\]
[junit4] 2> 631079 INFO (jetty-launcher-321-thread-4) [ ] o.a.s.c.CoreContainer loading shared library: C:\Users\JenkinsSlave\workspace\Lucene-Solr-5.x-Windows\solr\build\solr-core\test\J0\temp\solr.handler.PingRequestHandlerTest_50E075818B0B71E2-001\tempDir-001\lib
[junit4] 2> 631079 WARN (jetty-launcher-321-thread-4) [ ] o.a.s.c.SolrResourceLoader Can't find (or read) directory to add to classloader: lib (resolved as: C:\Users\JenkinsSlave\workspace\Lucene-Solr-5.x-Windows\solr\build\solr-core\test\J0\temp\solr.handler.PingRequestHandlerTest_50E075818B0B71E2-001\tempDir-001\lib).
[junit4] 2> 631084 INFO (jetty-launcher-321-thread-1) [ ] o.a.s.c.CoresLocator Config-defined core root directory: C:\Users\JenkinsSlave\workspace\Lucene-Solr-5.x-Windows\solr\build\solr-core\test\J0\temp\solr.handler.PingRequestHandlerTest_50E075818B0B71E2-001\tempDir-001\.
[junit4] 2> 631084 INFO (jetty-launcher-321-thread-1) [ ] o.a.s.c.CoreContainer New CoreContainer 17199428
[junit4] 2> 631084 INFO (jetty-launcher-321-thread-1) [ ] o.a.s.c.CoreContainer Loading cores into CoreContainer [instanceDir=C:\Users\JenkinsSlave\workspace\Lucene-Solr-5.x-Windows\solr\build\solr-core\test\J0\temp\solr.handler.PingRequestHandlerTest_50E075818B0B71E2-001\tempDir-001\]
[junit4] 2> 631084 INFO (jetty-launcher-321-thread-1) [ ] o.a.s.c.CoreContainer loading shared library: C:\Users\JenkinsSlave\workspace\Lucene-Solr-5.x-Windows\solr\build\solr-core\test\J0\temp\solr.handler.PingRequestHandlerTest_50E075818B0B71E2-001\tempDir-001\lib
[junit4] 2> 631084 WARN (jetty-launcher-321-thread-1) [ ] o.a.s.c.SolrResourceLoader Can't find (or read) directory to add to classloader: lib (resolved as: C:\Users\JenkinsSlave\workspace\Lucene-Solr-5.x-Windows\solr\build\solr-core\test\J0\temp\solr.handler.PingRequestHandlerTest_50E075818B0B71E2-001\tempDir-001\lib).
[junit4] 2> 631087 INFO (jetty-launcher-321-thread-5) [ ] o.a.s.u.UpdateShardHandler Creating UpdateShardHandler HTTP client with params: socketTimeout=340000&connTimeout=45000&retry=true
[junit4] 2> 631089 INFO (jetty-launcher-321-thread-5) [ ] o.a.s.l.LogWatcher SLF4J impl is org.slf4j.impl.Log4jLoggerFactory
[junit4] 2> 631089 INFO (jetty-launcher-321-thread-5) [ ] o.a.s.l.LogWatcher Registering Log Listener [Log4j (org.slf4j.impl.Log4jLoggerFactory)]
[junit4] 2> 631089 INFO (jetty-launcher-321-thread-5) [ ] o.a.s.c.ZkContainer Zookeeper client=127.0.0.1:57401/solr
[junit4] 2> 631090 INFO (jetty-launcher-321-thread-5) [ ] o.a.s.c.ZkController zkHost includes chroot
[junit4] 2> 631090 INFO (jetty-launcher-321-thread-5) [ ] o.a.s.c.c.SolrZkClient Using default ZkCredentialsProvider
[junit4] 2> 631090 INFO (zkCallback-327-thread-1) [ ] o.a.s.c.c.ConnectionManager Watcher org.apache.solr.common.cloud.ConnectionManager@20458e name:ZooKeeperConnection Watcher:127.0.0.1:57401/solr got event WatchedEvent state:SyncConnected type:None path:null path:null type:None
[junit4] 2> 631091 INFO (zkCallback-329-thread-1) [ ] o.a.s.c.c.ConnectionManager Watcher org.apache.solr.common.cloud.ConnectionManager@259a90 name:ZooKeeperConnection Watcher:127.0.0.1:57401 got event WatchedEvent state:SyncConnected type:None path:null path:null type:None
[junit4] 2> 631091 INFO (jetty-launcher-321-thread-3) [ ] o.a.s.c.c.ConnectionManager Client is connected to ZooKeeper
[junit4] 2> 631091 INFO (jetty-launcher-321-thread-2) [ ] o.a.s.c.c.ConnectionManager Client is connected to ZooKeeper
[junit4] 2> 631091 INFO (jetty-launcher-321-thread-3) [ ] o.a.s.c.c.SolrZkClient Using default ZkACLProvider
[junit4] 2> 631091 INFO (jetty-launcher-321-thread-2) [ ] o.a.s.c.c.SolrZkClient Using default ZkACLProvider
[junit4] 2> 631091 INFO (jetty-launcher-321-thread-5) [ ] o.a.s.c.c.ConnectionManager Waiting for client to connect to ZooKeeper
[junit4] 2> 631092 INFO (jetty-launcher-321-thread-4) [ ] o.a.s.h.c.HttpShardHandlerFactory created with socketTimeout : 90000,urlScheme : https,connTimeout : 15000,maxConnectionsPerHost : 20,maxConnections : 10000,corePoolSize : 0,maximumPoolSize : 2147483647,maxThreadIdleTime : 5,sizeOfQueue : -1,fairnessPolicy : false,useRetries : false,
[junit4] 2> 631094 INFO (jetty-launcher-321-thread-3) [ ] o.a.s.s.SolrDispatchFilter solr.xml found in ZooKeeper. Loading...
[junit4] 2> 631095 INFO (jetty-launcher-321-thread-2) [n:127.0.0.1:57409_solr ] o.a.s.c.c.ConnectionManager Waiting for client to connect to ZooKeeper
[junit4] 2> 631096 INFO (jetty-launcher-321-thread-4) [ ] o.a.s.u.UpdateShardHandler Creating UpdateShardHandler HTTP client with params: socketTimeout=340000&connTimeout=45000&retry=true
[junit4] 2> 631098 INFO (jetty-launcher-321-thread-1) [ ] o.a.s.h.c.HttpShardHandlerFactory created with socketTimeout : 90000,urlScheme : https,connTimeout : 15000,maxConnectionsPerHost : 20,maxConnections : 10000,corePoolSize : 0,maximumPoolSize : 2147483647,maxThreadIdleTime : 5,sizeOfQueue : -1,fairnessPolicy : false,useRetries : false,
[junit4] 2> 631098 INFO (jetty-launcher-321-thread-4) [ ] o.a.s.l.LogWatcher SLF4J impl is org.slf4j.impl.Log4jLoggerFactory
[junit4] 2> 631098 INFO (jetty-launcher-321-thread-4) [ ] o.a.s.l.LogWatcher Registering Log Listener [Log4j (org.slf4j.impl.Log4jLoggerFactory)]
[junit4] 2> 631099 INFO (jetty-launcher-321-thread-4) [ ] o.a.s.c.ZkContainer Zookeeper client=127.0.0.1:57401/solr
[junit4] 2> 631099 INFO (jetty-launcher-321-thread-4) [ ] o.a.s.c.ZkController zkHost includes chroot
[junit4] 2> 631099 INFO (jetty-launcher-321-thread-4) [ ] o.a.s.c.c.SolrZkClient Using default ZkCredentialsProvider
[junit4] 2> 631100 INFO (jetty-launcher-321-thread-4) [ ] o.a.s.c.c.ConnectionManager Waiting for client to connect to ZooKeeper
[junit4] 2> 631101 INFO (jetty-launcher-321-thread-1) [ ] o.a.s.u.UpdateShardHandler Creating UpdateShardHandler HTTP client with params: socketTimeout=340000&connTimeout=45000&retry=true
[junit4] 2> 631106 INFO (jetty-launcher-321-thread-1) [ ] o.a.s.l.LogWatcher SLF4J impl is org.slf4j.impl.Log4jLoggerFactory
[junit4] 2> 631106 INFO (jetty-launcher-321-thread-1) [ ] o.a.s.l.LogWatcher Registering Log Listener [Log4j (org.slf4j.impl.Log4jLoggerFactory)]
[junit4] 2> 631107 INFO (jetty-launcher-321-thread-1) [ ] o.a.s.c.ZkContainer Zookeeper client=127.0.0.1:57401/solr
[junit4] 2> 631107 INFO (jetty-launcher-321-thread-1) [ ] o.a.s.c.ZkController zkHost includes chroot
[junit4] 2> 631107 INFO (jetty-launcher-321-thread-1) [ ] o.a.s.c.c.SolrZkClient Using default ZkCredentialsProvider
[junit4] 2> 631106 INFO (zkCallback-332-thread-1-processing-n:127.0.0.1:57409_solr) [n:127.0.0.1:57409_solr ] o.a.s.c.c.ConnectionManager Watcher org.apache.solr.common.cloud.ConnectionManager@d6c416 name:ZooKeeperConnection Watcher:127.0.0.1:57401/solr got event WatchedEvent state:SyncConnected type:None path:null path:null type:None
[junit4] 2> 631109 INFO (jetty-launcher-321-thread-2) [n:127.0.0.1:57409_solr ] o.a.s.c.c.ConnectionManager Client is connected to ZooKeeper
[junit4] 2> 631109 INFO (jetty-launcher-321-thread-1) [ ] o.a.s.c.c.ConnectionManager Waiting for client to connect to ZooKeeper
[junit4] 2> 631107 INFO (zkCallback-331-thread-1) [ ] o.a.s.c.c.ConnectionManager Watcher org.apache.solr.common.cloud.ConnectionManager@1d9c7bc name:ZooKeeperConnection Watcher:127.0.0.1:57401 got event WatchedEvent state:SyncConnected type:None path:null path:null type:None
[junit4] 2> 631110 INFO (jetty-launcher-321-thread-5) [ ] o.a.s.c.c.ConnectionManager Client is connected to ZooKeeper
[junit4] 2> 631110 INFO (zkCallback-334-thread-1) [ ] o.a.s.c.c.ConnectionManager Watcher org.apache.solr.common.cloud.ConnectionManager@1043e0 name:ZooKeeperConnection Watcher:127.0.0.1:57401 got event WatchedEvent state:SyncConnected type:None path:null path:null type:None
[junit4] 2> 631110 INFO (jetty-launcher-321-thread-5) [ ] o.a.s.c.c.SolrZkClient Using default ZkACLProvider
[junit4] 2> 631110 INFO (jetty-launcher-321-thread-4) [ ] o.a.s.c.c.ConnectionManager Client is connected to ZooKeeper
[junit4] 2> 631110 INFO (jetty-launcher-321-thread-4) [ ] o.a.s.c.c.SolrZkClient Using default ZkACLProvider
[junit4] 2> 631111 INFO (zkCallback-336-thread-1) [ ] o.a.s.c.c.ConnectionManager Watcher org.apache.solr.common.cloud.ConnectionManager@1dbfe60 name:ZooKeeperConnection Watcher:127.0.0.1:57401 got event WatchedEvent state:SyncConnected type:None path:null path:null type:None
[junit4] 2> 631111 INFO (jetty-launcher-321-thread-1) [ ] o.a.s.c.c.ConnectionManager Client is connected to ZooKeeper
[junit4] 2> 631111 INFO (jetty-launcher-321-thread-1) [ ] o.a.s.c.c.SolrZkClient Using default ZkACLProvider
[junit4] 2> 631111 INFO (jetty-launcher-321-thread-3) [ ] o.a.s.c.CoresLocator Config-defined core root directory: C:\Users\JenkinsSlave\workspace\Lucene-Solr-5.x-Windows\solr\build\solr-core\test\J0\temp\solr.handler.PingRequestHandlerTest_50E075818B0B71E2-001\tempDir-001\.
[junit4] 2> 631111 INFO (jetty-launcher-321-thread-3) [ ] o.a.s.c.CoreContainer New CoreContainer 28487827
[junit4] 2> 631111 INFO (jetty-launcher-321-thread-3) [ ] o.a.s.c.CoreContainer Loading cores into CoreContainer [instanceDir=C:\Users\JenkinsSlave\workspace\Lucene-Solr-5.x-Windows\solr\build\solr-core\test\J0\temp\solr.handler.PingRequestHandlerTest_50E075818B0B71E2-001\tempDir-001\]
[junit4] 2> 631112 INFO (jetty-launcher-321-thread-3) [ ] o.a.s.c.CoreContainer loading shared library: C:\Users\JenkinsSlave\workspace\Lucene-Solr-5.x-Windows\solr\build\solr-core\test\J0\temp\solr.handler.PingRequestHandlerTest_50E075818B0B71E2-001\tempDir-001\lib
[junit4] 2> 631112 WARN (jetty-launcher-321-thread-3) [ ] o.a.s.c.SolrResourceLoader Can't find (or read) directory to add to classloader: lib (resolved as: C:\Users\JenkinsSlave\workspace\Lucene-Solr-5.x-Windows\solr\build\solr-core\test\J0\temp\solr.handler.PingRequestHandlerTest_50E075818B0B71E2-001\tempDir-001\lib).
[junit4] 2> 631113 INFO (jetty-launcher-321-thread-2) [n:127.0.0.1:57409_solr ] o.a.s.c.c.SolrZkClient makePath: /overseer/queue
[junit4] 2> 631115 INFO (jetty-launcher-321-thread-5) [n:127.0.0.1:57405_solr ] o.a.s.c.c.ConnectionManager Waiting for client to connect to ZooKeeper
[junit4] 2> 631116 INFO (jetty-launcher-321-thread-4) [n:127.0.0.1:57408_solr ] o.a.s.c.c.ConnectionManager Waiting for client to connect to ZooKeeper
[junit4] 2> 631117 INFO (jetty-launcher-321-thread-2) [n:127.0.0.1:57409_solr ] o.a.s.c.c.SolrZkClient makePath: /overseer/collection-queue-work
[junit4] 2> 631120 INFO (jetty-launcher-321-thread-1) [n:127.0.0.1:57407_solr ] o.a.s.c.c.ConnectionManager Waiting for client to connect to ZooKeeper
[junit4] 2> 631120 INFO (zkCallback-338-thread-1-processing-n:127.0.0.1:57408_solr) [n:127.0.0.1:57408_solr ] o.a.s.c.c.ConnectionManager Watcher org.apache.solr.common.cloud.ConnectionManager@2e1cc3 name:ZooKeeperConnection Watcher:127.0.0.1:57401/solr got event WatchedEvent state:SyncConnected type:None path:null path:null type:None
[junit4] 2> 631120 INFO (jetty-launcher-321-thread-4) [n:127.0.0.1:57408_solr ] o.a.s.c.c.ConnectionManager Client is connected to ZooKeeper
[junit4] 2> 631123 INFO (zkCallback-337-thread-1-processing-n:127.0.0.1:57405_solr) [n:127.0.0.1:57405_solr ] o.a.s.c.c.ConnectionManager Watcher org.apache.solr.common.cloud.ConnectionManager@3e2b2 name:ZooKeeperConnection Watcher:127.0.0.1:57401/solr got event WatchedEvent state:SyncConnected type:None path:null path:null type:None
[junit4] 2> 631123 INFO (jetty-launcher-321-thread-5) [n:127.0.0.1:57405_solr ] o.a.s.c.c.ConnectionManager Client is connected to ZooKeeper
[junit4] 2> 631123 INFO (zkCallback-339-thread-1-processing-n:127.0.0.1:57407_solr) [n:127.0.0.1:57407_solr ] o.a.s.c.c.ConnectionManager Watcher org.apache.solr.common.cloud.ConnectionManager@13769d8 name:ZooKeeperConnection Watcher:127.0.0.1:57401/solr got event WatchedEvent state:SyncConnected type:None path:null path:null type:None
[junit4] 2> 631123 INFO (jetty-launcher-321-thread-1) [n:127.0.0.1:57407_solr ] o.a.s.c.c.ConnectionManager Client is connected to ZooKeeper
[junit4] 2> 631124 INFO (jetty-launcher-321-thread-2) [n:127.0.0.1:57409_solr ] o.a.s.c.c.SolrZkClient makePath: /overseer/collection-map-running
[junit4] 2> 631124 INFO (jetty-launcher-321-thread-3) [ ] o.a.s.h.c.HttpShardHandlerFactory created with socketTimeout : 90000,urlScheme : https,connTimeout : 15000,maxConnectionsPerHost : 20,maxConnections : 10000,corePoolSize : 0,maximumPoolSize : 2147483647,maxThreadIdleTime : 5,sizeOfQueue : -1,fairnessPolicy : false,useRetries : false,
[junit4] 2> 631127 INFO (jetty-launcher-321-thread-4) [n:127.0.0.1:57408_solr ] o.a.s.c.c.SolrZkClient makePath: /overseer/collection-map-completed
[junit4] 2> 631127 INFO (jetty-launcher-321-thread-2) [n:127.0.0.1:57409_solr ] o.a.s.c.c.SolrZkClient makePath: /overseer/collection-map-completed
[junit4] 2> 631129 INFO (jetty-launcher-321-thread-3) [ ] o.a.s.u.UpdateShardHandler Creating UpdateShardHandler HTTP client with params: socketTimeout=340000&connTimeout=45000&retry=true
[junit4] 2> 631130 INFO (jetty-launcher-321-thread-2) [n:127.0.0.1:57409_solr ] o.a.s.c.c.SolrZkClient makePath: /overseer/collection-map-failure
[junit4] 2> 631130 INFO (jetty-launcher-321-thread-4) [n:127.0.0.1:57408_solr ] o.a.s.c.c.SolrZkClient makePath: /overseer/collection-map-failure
[junit4] 2> 631131 INFO (jetty-launcher-321-thread-5) [n:127.0.0.1:57405_solr ] o.a.s.c.c.SolrZkClient makePath: /overseer/collection-map-failure
[junit4] 2> 631132 INFO (jetty-launcher-321-thread-3) [ ] o.a.s.l.LogWatcher SLF4J impl is org.slf4j.impl.Log4jLoggerFactory
[junit4] 2> 631132 INFO (jetty-launcher-321-thread-3) [ ] o.a.s.l.LogWatcher Registering Log Listener [Log4j (org.slf4j.impl.Log4jLoggerFactory)]
[junit4] 2> 631132 INFO (jetty-launcher-321-thread-3) [ ] o.a.s.c.ZkContainer Zookeeper client=127.0.0.1:57401/solr
[junit4] 2> 631132 INFO (jetty-launcher-321-thread-3) [ ] o.a.s.c.ZkController zkHost includes chroot
[junit4] 2> 631132 INFO (jetty-launcher-321-thread-3) [ ] o.a.s.c.c.SolrZkClient Using default ZkCredentialsProvider
[junit4] 2> 631133 INFO (jetty-launcher-321-thread-3) [ ] o.a.s.c.c.ConnectionManager Waiting for client to connect to ZooKeeper
[junit4] 2> 631135 INFO (jetty-launcher-321-thread-2) [n:127.0.0.1:57409_solr ] o.a.s.c.c.SolrZkClient makePath: /live_nodes
[junit4] 2> 631136 INFO (zkCallback-341-thread-1) [ ] o.a.s.c.c.ConnectionManager Watcher org.apache.solr.common.cloud.ConnectionManager@10be648 name:ZooKeeperConnection Watcher:127.0.0.1:57401 got event WatchedEvent state:SyncConnected type:None path:null path:null type:None
[junit4] 2> 631136 INFO (jetty-launcher-321-thread-4) [n:127.0.0.1:57408_solr ] o.a.s.c.c.SolrZkClient makePath: /live_nodes
[junit4] 2> 631137 INFO (jetty-launcher-321-thread-3) [ ] o.a.s.c.c.ConnectionManager Client is connected to ZooKeeper
[junit4] 2> 631137 INFO (jetty-launcher-321-thread-3) [ ] o.a.s.c.c.SolrZkClient Using default ZkACLProvider
[junit4] 2> 631139 INFO (jetty-launcher-321-thread-2) [n:127.0.0.1:57409_solr ] o.a.s.c.c.SolrZkClient makePath: /collections
[junit4] 2> 631139 INFO (jetty-launcher-321-thread-4) [n:127.0.0.1:57408_solr ] o.a.s.c.c.SolrZkClient makePath: /collections
[junit4] 2> 631139 INFO (jetty-launcher-321-thread-5) [n:127.0.0.1:57405_solr ] o.a.s.c.c.SolrZkClient makePath: /collections
[junit4] 2> 631140 INFO (jetty-launcher-321-thread-3) [n:127.0.0.1:57406_solr ] o.a.s.c.c.ConnectionManager Waiting for client to connect to ZooKeeper
[junit4] 2> 631141 INFO (jetty-launcher-321-thread-4) [n:127.0.0.1:57408_solr ] o.a.s.c.c.SolrZkClient makePath: /aliases.json
[junit4] 2> 631141 INFO (jetty-launcher-321-thread-5) [n:127.0.0.1:57405_solr ] o.a.s.c.c.SolrZkClient makePath: /aliases.json
[junit4] 2> 631142 INFO (jetty-launcher-321-thread-2) [n:127.0.0.1:57409_solr ] o.a.s.c.c.SolrZkClient makePath: /aliases.json
[junit4] 2> 631142 INFO (zkCallback-342-thread-1-processing-n:127.0.0.1:57406_solr) [n:127.0.0.1:57406_solr ] o.a.s.c.c.ConnectionManager Watcher org.apache.solr.common.cloud.ConnectionManager@17c1b4d name:ZooKeeperConnection Watcher:127.0.0.1:57401/solr got event WatchedEvent state:SyncConnected type:None path:null path:null type:None
[junit4] 2> 631142 INFO (jetty-launcher-321-thread-3) [n:127.0.0.1:57406_solr ] o.a.s.c.c.ConnectionManager Client is connected to ZooKeeper
[junit4] 2> 631143 INFO (jetty-launcher-321-thread-4) [n:127.0.0.1:57408_solr ] o.a.s.c.c.SolrZkClient makePath: /clusterstate.json
[junit4] 2> 631143 INFO (jetty-launcher-321-thread-5) [n:127.0.0.1:57405_solr ] o.a.s.c.c.SolrZkClient makePath: /clusterstate.json
[junit4] 2> 631144 INFO (jetty-launcher-321-thread-2) [n:127.0.0.1:57409_solr ] o.a.s.c.c.SolrZkClient makePath: /clusterstate.json
[junit4] 2> 631144 INFO (jetty-launcher-321-thread-1) [n:127.0.0.1:57407_solr ] o.a.s.c.c.SolrZkClient makePath: /clusterstate.json
[junit4] 2> 631145 INFO (jetty-launcher-321-thread-5) [n:127.0.0.1:57405_solr ] o.a.s.c.c.SolrZkClient makePath: /security.json
[junit4] 2> 631145 INFO (jetty-launcher-321-thread-2) [n:127.0.0.1:57409_solr ] o.a.s.c.c.SolrZkClient makePath: /security.json
[junit4] 2> 631145 INFO (jetty-launcher-321-thread-4) [n:127.0.0.1:57408_solr ] o.a.s.c.c.SolrZkClient makePath: /security.json
[junit4] 2> 631146 INFO (jetty-launcher-321-thread-1) [n:127.0.0.1:57407_solr ] o.a.s.c.c.SolrZkClient makePath: /security.json
[junit4] 2> 631146 INFO (jetty-launcher-321-thread-2) [n:127.0.0.1:57409_solr ] o.a.s.c.ZkController Register node as live in ZooKeeper:/live_nodes/127.0.0.1:57409_solr
[junit4] 2> 631146 INFO (jetty-launcher-321-thread-4) [n:127.0.0.1:57408_solr ] o.a.s.c.ZkController Register node as live in ZooKeeper:/live_nodes/127.0.0.1:57408_solr
[junit4] 2> 631147 INFO (jetty-launcher-321-thread-5) [n:127.0.0.1:57405_solr ] o.a.s.c.ZkController Register node as live in ZooKeeper:/live_nodes/127.0.0.1:57405_solr
[junit4] 2> 631147 INFO (jetty-launcher-321-thread-1) [n:127.0.0.1:57407_solr ] o.a.s.c.ZkController Register node as live in ZooKeeper:/live_nodes/127.0.0.1:57407_solr
[junit4] 2> 631147 INFO (jetty-launcher-321-thread-2) [n:127.0.0.1:57409_solr ] o.a.s.c.c.SolrZkClient makePath: /live_nodes/127.0.0.1:57409_solr
[junit4] 2> 631147 INFO (jetty-launcher-321-thread-4) [n:127.0.0.1:57408_solr ] o.a.s.c.c.SolrZkClient makePath: /live_nodes/127.0.0.1:57408_solr
[junit4] 2> 631147 INFO (jetty-launcher-321-thread-5) [n:127.0.0.1:57405_solr ] o.a.s.c.c.SolrZkClient makePath: /live_nodes/127.0.0.1:57405_solr
[junit4] 2> 631148 INFO (jetty-launcher-321-thread-1) [n:127.0.0.1:57407_solr ] o.a.s.c.c.SolrZkClient makePath: /live_nodes/127.0.0.1:57407_solr
[junit4] 2> 631149 INFO (jetty-launcher-321-thread-2) [n:127.0.0.1:57409_solr ] o.a.s.c.c.SolrZkClient makePath: /overseer_elect
[junit4] 2> 631150 INFO (jetty-launcher-321-thread-4) [n:127.0.0.1:57408_solr ] o.a.s.c.c.SolrZkClient makePath: /overseer_elect
[junit4] 2> 631150 INFO (jetty-launcher-321-thread-5) [n:127.0.0.1:57405_solr ] o.a.s.c.c.SolrZkClient makePath: /overseer_elect
[junit4] 2> 631151 INFO (jetty-launcher-321-thread-4) [n:127.0.0.1:57408_solr ] o.a.s.c.c.SolrZkClient makePath: /overseer_elect/election
[junit4] 2> 631151 INFO (jetty-launcher-321-thread-2) [n:127.0.0.1:57409_solr ] o.a.s.c.c.SolrZkClient makePath: /overseer_elect/election
[junit4] 2> 631151 INFO (jetty-launcher-321-thread-5) [n:127.0.0.1:57405_solr ] o.a.s.c.c.SolrZkClient makePath: /overseer_elect/election
[junit4] 2> 631151 INFO (jetty-launcher-321-thread-1) [n:127.0.0.1:57407_solr ] o.a.s.c.c.SolrZkClient makePath: /overseer_elect/election
[junit4] 2> 631153 INFO (jetty-launcher-321-thread-2) [n:127.0.0.1:57409_solr ] o.a.s.c.Overseer Overseer (id=null) closing
[junit4] 2> 631153 INFO (jetty-launcher-321-thread-5) [n:127.0.0.1:57405_solr ] o.a.s.c.Overseer Overseer (id=null) closing
[junit4] 2> 631153 INFO (jetty-launcher-321-thread-4) [n:127.0.0.1:57408_solr ] o.a.s.c.Overseer Overseer (id=null) closing
[junit4] 2> 631153 INFO (jetty-launcher-321-thread-1) [n:127.0.0.1:57407_solr ] o.a.s.c.Overseer Overseer (id=null) closing
[junit4] 2> 631153 INFO (jetty-launcher-321-thread-2) [n:127.0.0.1:57409_solr ] o.a.s.c.LeaderElector Joined leadership election with path: /overseer_elect/election/94710287197143047-127.0.0.1:57409_solr-n_0000000000
[junit4] 2> 631154 INFO (jetty-launcher-321-thread-5) [n:127.0.0.1:57405_solr ] o.a.s.c.LeaderElector Joined leadership election with path: /overseer_elect/election/94710287197143052-127.0.0.1:57405_solr-n_0000000001
[junit4] 2> 631154 INFO (jetty-launcher-321-thread-4) [n:127.0.0.1:57408_solr ] o.a.s.c.LeaderElector Joined leadership election with path: /overseer_elect/election/94710287197143051-127.0.0.1:57408_solr-n_0000000002
[junit4] 2> 631154 INFO (jetty-launcher-321-thread-3) [n:127.0.0.1:57406_solr ] o.a.s.c.c.ZkStateReader Updating cluster state from ZooKeeper...
[junit4] 2> 631154 INFO (jetty-launcher-321-thread-2) [n:127.0.0.1:57409_solr ] o.a.s.c.OverseerElectionContext I am going to be the leader 127.0.0.1:57409_solr
[junit4] 2> 631154 INFO (jetty-launcher-321-thread-1) [n:127.0.0.1:57407_solr ] o.a.s.c.LeaderElector Joined leadership election with path: /overseer_elect/election/94710287197143053-127.0.0.1:57407_solr-n_0000000003
[junit4] 2> 631154 INFO (jetty-launcher-321-thread-2) [n:127.0.0.1:57409_solr ] o.a.s.c.c.SolrZkClient makePath: /overseer_elect/leader
[junit4] 2> 631155 INFO (jetty-launcher-321-thread-5) [n:127.0.0.1:57405_solr ] o.a.s.c.LeaderElector Watching path /overseer_elect/election/94710287197143047-127.0.0.1:57409_solr-n_0000000000 to know if I could be the leader
[junit4] 2> 631156 INFO (jetty-launcher-321-thread-5) [n:127.0.0.1:57405_solr ] o.a.s.c.c.ZkStateReader Updating cluster state from ZooKeeper...
[junit4] 2> 631156 INFO (jetty-launcher-321-thread-4) [n:127.0.0.1:57408_solr ] o.a.s.c.LeaderElector Watching path /overseer_elect/election/94710287197143052-127.0.0.1:57405_solr-n_0000000001 to know if I could be the leader
[junit4] 2> 631156 INFO (jetty-launcher-321-thread-4) [n:127.0.0.1:57408_solr ] o.a.s.c.c.ZkStateReader Updating cluster state from ZooKeeper...
[junit4] 2> 631156 INFO (jetty-launcher-321-thread-1) [n:127.0.0.1:57407_solr ] o.a.s.c.LeaderElector Watching path /overseer_elect/election/94710287197143051-127.0.0.1:57408_solr-n_0000000002 to know if I could be the leader
[junit4] 2> 631156 INFO (jetty-launcher-321-thread-1) [n:127.0.0.1:57407_solr ] o.a.s.c.c.ZkStateReader Updating cluster state from ZooKeeper...
[junit4] 2> 631157 INFO (jetty-launcher-321-thread-2) [n:127.0.0.1:57409_solr ] o.a.s.c.Overseer Overseer (id=94710287197143047-127.0.0.1:57409_solr-n_0000000000) starting
[junit4] 2> 631159 INFO (jetty-launcher-321-thread-2) [n:127.0.0.1:57409_solr ] o.a.s.c.c.SolrZkClient makePath: /overseer/queue-work
[junit4] 2> 631167 INFO (jetty-launcher-321-thread-2) [n:127.0.0.1:57409_solr ] o.a.s.c.OverseerAutoReplicaFailoverThread Starting OverseerAutoReplicaFailoverThread autoReplicaFailoverWorkLoopDelay=10000 autoReplicaFailoverWaitAfterExpiration=10000 autoReplicaFailoverBadNodeExpiration=60000
[junit4] 2> 631169 INFO (jetty-launcher-321-thread-2) [n:127.0.0.1:57409_solr ] o.a.s.c.c.ZkStateReader Updating cluster state from ZooKeeper...
[junit4] 2> 631187 INFO (jetty-launcher-321-thread-4) [n:127.0.0.1:57408_solr ] o.a.s.c.CoreContainer Security conf doesn't exist. Skipping setup for authorization module.
[junit4] 2> 631188 INFO (jetty-launcher-321-thread-4) [n:127.0.0.1:57408_solr ] o.a.s.c.CoreContainer No authentication plugin used.
[junit4] 2> 631187 INFO (jetty-launcher-321-thread-5) [n:127.0.0.1:57405_solr ] o.a.s.c.CoreContainer Security conf doesn't exist. Skipping setup for authorization module.
[junit4] 2> 631188 INFO (jetty-launcher-321-thread-5) [n:127.0.0.1:57405_solr ] o.a.s.c.CoreContainer No authentication plugin used.
[junit4] 2> 631189 INFO (jetty-launcher-321-thread-4) [n:127.0.0.1:57408_solr ] o.a.s.c.CoresLocator Looking for core definitions underneath C:\Users\JenkinsSlave\workspace\Lucene-Solr-5.x-Windows\solr\build\solr-core\test\J0\temp\solr.handler.PingRequestHandlerTest_50E075818B0B71E2-001\tempDir-001\.
[junit4] 2> 631189 INFO (OverseerCollectionConfigSetProcessor-94710287197143047-127.0.0.1:57409_solr-n_0000000000) [n:127.0.0.1:57409_solr ] o.a.s.c.OverseerTaskProcessor Process current queue of overseer operations
[junit4] 2> 631190 INFO (jetty-launcher-321-thread-5) [n:127.0.0.1:57405_solr ] o.a.s.c.CoresLocator Looking for core definitions underneath C:\Users\JenkinsSlave\workspace\Lucene-Solr-5.x-Windows\solr\build\solr-core\test\J0\temp\solr.handler.PingRequestHandlerTest_50E075818B0B71E2-001\tempDir-001\.
[junit4] 2> 631197 INFO (jetty-launcher-321-thread-4) [n:127.0.0.1:57408_solr ] o.a.s.c.CoresLocator Found 0 core definitions
[junit4] 2> 631197 INFO (jetty-launcher-321-thread-5) [n:127.0.0.1:57405_solr ] o.a.s.c.CoresLocator Found 0 core definitions
[junit4] 2> 631197 INFO (OverseerStateUpdate-94710287197143047-127.0.0.1:57409_solr-n_0000000000) [n:127.0.0.1:57409_solr ] o.a.s.c.Overseer Starting to work on the main queue
[junit4] 2> 631198 INFO (jetty-launcher-321-thread-4) [n:127.0.0.1:57408_solr ] o.a.s.s.SolrDispatchFilter user.dir=C:\Users\JenkinsSlave\workspace\Lucene-Solr-5.x-Windows\solr\build\solr-core\test\J0
[junit4] 2> 631198 INFO (jetty-launcher-321-thread-4) [n:127.0.0.1:57408_solr ] o.a.s.s.SolrDispatchFilter SolrDispatchFilter.init() done
[junit4] 2> 631199 INFO (jetty-launcher-321-thread-5) [n:127.0.0.1:57405_solr ] o.a.s.s.SolrDispatchFilter user.dir=C:\Users\JenkinsSlave\workspace\Lucene-Solr-5.x-Windows\solr\build\solr-core\test\J0
[junit4] 2> 631199 INFO (jetty-launcher-321-thread-5) [n:127.0.0.1:57405_solr ] o.a.s.s.SolrDispatchFilter SolrDispatchFilter.init() done
[junit4] 2> 631232 INFO (jetty-launcher-321-thread-2) [n:127.0.0.1:57409_solr ] o.a.s.c.CoreContainer Security conf doesn't exist. Skipping setup for authorization module.
[junit4] 2> 631233 INFO (jetty-launcher-321-thread-2) [n:127.0.0.1:57409_solr ] o.a.s.c.CoreContainer No authentication plugin used.
[junit4] 2> 631233 INFO (jetty-launcher-321-thread-2) [n:127.0.0.1:57409_solr ] o.a.s.c.CoresLocator Looking for core definitions underneath C:\Users\JenkinsSlave\workspace\Lucene-Solr-5.x-Windows\solr\build\solr-core\test\J0\temp\solr.handler.PingRequestHandlerTest_50E075818B0B71E2-001\tempDir-001\.
[junit4] 2> 631234 INFO (jetty-launcher-321-thread-2) [n:127.0.0.1:57409_solr ] o.a.s.c.CoresLocator Found 0 core definitions
[junit4] 2> 631237 INFO (jetty-launcher-321-thread-2) [n:127.0.0.1:57409_solr ] o.a.s.s.SolrDispatchFilter user.dir=C:\Users\JenkinsSlave\workspace\Lucene-Solr-5.x-Windows\solr\build\solr-core\test\J0
[junit4] 2> 631237 INFO (jetty-launcher-321-thread-2) [n:127.0.0.1:57409_solr ] o.a.s.s.SolrDispatchFilter SolrDispatchFilter.init() done
[junit4] 2> 631242 INFO (jetty-launcher-321-thread-1) [n:127.0.0.1:57407_solr ] o.a.s.c.CoreContainer Security conf doesn't exist. Skipping setup for authorization module.
[junit4] 2> 631242 INFO (jetty-launcher-321-thread-1) [n:127.0.0.1:57407_solr ] o.a.s.c.CoreContainer No authentication plugin used.
[junit4] 2> 631243 INFO (jetty-launcher-321-thread-1) [n:127.0.0.1:57407_solr ] o.a.s.c.CoresLocator Looking for core definitions underneath C:\Users\JenkinsSlave\workspace\Lucene-Solr-5.x-Windows\solr\build\solr-core\test\J0\temp\solr.handler.PingRequestHandlerTest_50E075818B0B71E2-001\tempDir-001\.
[junit4] 2> 631244 INFO (jetty-launcher-321-thread-1) [n:127.0.0.1:57407_solr ] o.a.s.c.CoresLocator Found 0 core definitions
[junit4] 2> 631245 INFO (jetty-launcher-321-thread-1) [n:127.0.0.1:57407_solr ] o.a.s.s.SolrDispatchFilter user.dir=C:\Users\JenkinsSlave\workspace\Lucene-Solr-5.x-Windows\solr\build\solr-core\test\J0
[junit4] 2> 631245 INFO (jetty-launcher-321-thread-1) [n:127.0.0.1:57407_solr ] o.a.s.s.SolrDispatchFilter SolrDispatchFilter.init() done
[junit4] 2> 632163 INFO (jetty-launcher-321-thread-3) [n:127.0.0.1:57406_solr ] o.a.s.c.ZkController Register node as live in ZooKeeper:/live_nodes/127.0.0.1:57406_solr
[junit4] 2> 632163 INFO (jetty-launcher-321-thread-3) [n:127.0.0.1:57406_solr ] o.a.s.c.c.SolrZkClient makePath: /live_nodes/127.0.0.1:57406_solr
[junit4] 2> 632165 INFO (zkCallback-338-thread-1-processing-n:127.0.0.1:57408_solr) [n:127.0.0.1:57408_solr ] o.a.s.c.c.ZkStateReader A live node change: WatchedEvent state:SyncConnected type:NodeChildrenChanged path:/live_nodes, has occurred - updating... (live nodes size: 4)
[junit4] 2> 632165 INFO (zkCallback-332-thread-1-processing-n:127.0.0.1:57409_solr) [n:127.0.0.1:57409_solr ] o.a.s.c.c.ZkStateReader A live node change: WatchedEvent state:SyncConnected type:NodeChildrenChanged path:/live_nodes, has occurred - updating... (live nodes size: 4)
[junit4] 2> 632166 INFO (zkCallback-339-thread-1-processing-n:127.0.0.1:57407_solr) [n:127.0.0.1:57407_solr ] o.a.s.c.c.ZkStateReader A live node change: WatchedEvent state:SyncConnected type:NodeChildrenChanged path:/live_nodes, has occurred - updating... (live nodes size: 4)
[junit4] 2> 632166 INFO (zkCallback-342-thread-1-processing-n:127.0.0.1:57406_solr) [n:127.0.0.1:57406_solr ] o.a.s.c.c.ZkStateReader A live node change: WatchedEvent state:SyncConnected type:NodeChildrenChanged path:/live_nodes, has occurred - updating... (live nodes size: 4)
[junit4] 2> 632166 INFO (zkCallback-337-thread-1-processing-n:127.0.0.1:57405_solr) [n:127.0.0.1:57405_solr ] o.a.s.c.c.ZkStateReader A live node change: WatchedEvent state:SyncConnected type:NodeChildrenChanged path:/live_nodes, has occurred - updating... (live nodes size: 4)
[junit4] 2> 632167 INFO (jetty-launcher-321-thread-3) [n:127.0.0.1:57406_solr ] o.a.s.c.Overseer Overseer (id=null) closing
[junit4] 2> 632168 INFO (jetty-launcher-321-thread-3) [n:127.0.0.1:57406_solr ] o.a.s.c.LeaderElector Joined leadership election with path: /overseer_elect/election/94710287197143055-127.0.0.1:57406_solr-n_0000000004
[junit4] 2> 632169 INFO (jetty-launcher-321-thread-3) [n:127.0.0.1:57406_solr ] o.a.s.c.LeaderElector Watching path /overseer_elect/election/94710287197143053-127.0.0.1:57407_solr-n_0000000003 to know if I could be the leader
[junit4] 2> 632184 INFO (jetty-launcher-321-thread-3) [n:127.0.0.1:57406_solr ] o.a.s.c.CoreContainer Security conf doesn't exist. Skipping setup for authorization module.
[junit4] 2> 632184 INFO (jetty-launcher-321-thread-3) [n:127.0.0.1:57406_solr ] o.a.s.c.CoreContainer No authentication plugin used.
[junit4] 2> 632185 INFO (jetty-launcher-321-thread-3) [n:127.0.0.1:57406_solr ] o.a.s.c.CoresLocator Looking for core definitions underneath C:\Users\JenkinsSlave\workspace\Lucene-Solr-5.x-Windows\solr\build\solr-core\test\J0\temp\solr.handler.PingRequestHandlerTest_50E075818B0B71E2-001\tempDir-001\.
[junit4] 2> 632187 INFO (jetty-launcher-321-thread-3) [n:127.0.0.1:57406_solr ] o.a.s.c.CoresLocator Found 0 core definitions
[junit4] 2> 632188 INFO (jetty-launcher-321-thread-3) [n:127.0.0.1:57406_solr ] o.a.s.s.SolrDispatchFilter user.dir=C:\Users\JenkinsSlave\workspace\Lucene-Solr-5.x-Windows\solr\build\solr-core\test\J0
[junit4] 2> 632188 INFO (jetty-launcher-321-thread-3) [n:127.0.0.1:57406_solr ] o.a.s.s.SolrDispatchFilter SolrDispatchFilter.init() done
[junit4] 2> 632188 INFO (TEST-PingRequestHandlerTest.testPingInClusterWithNoHealthCheck-seed#[50E075818B0B71E2]) [ ] o.a.s.c.c.SolrZkClient Using default ZkCredentialsProvider
[junit4] 2> 632189 INFO (TEST-PingRequestHandlerTest.testPingInClusterWithNoHealthCheck-seed#[50E075818B0B71E2]) [ ] o.a.s.c.c.ConnectionManager Waiting for client to connect to ZooKeeper
[junit4] 2> 632191 INFO (zkCallback-343-thread-1) [ ] o.a.s.c.c.ConnectionManager Watcher org.apache.solr.common.cloud.ConnectionManager@5e6989 name:ZooKeeperConnection Watcher:127.0.0.1:57401 got event WatchedEvent state:SyncConnected type:None path:null path:null type:None
[junit4] 2> 632191 INFO (TEST-PingRequestHandlerTest.testPingInClusterWithNoHealthCheck-seed#[50E075818B0B71E2]) [ ] o.a.s.c.c.ConnectionManager Client is connected to ZooKeeper
[junit4] 2> 632191 INFO (TEST-PingRequestHandlerTest.testPingInClusterWithNoHealthCheck-seed#[50E075818B0B71E2]) [ ] o.a.s.c.c.SolrZkClient Using default ZkACLProvider
[junit4] 2> 632194 WARN (NIOServerCxn.Factory:0.0.0.0/0.0.0.0:0) [ ] o.a.z.s.NIOServerCnxn caught end of stream exception
[junit4] 2> EndOfStreamException: Unable to read additional data from client sessionid 0x1507a8120f60010, likely client has closed socket
[junit4] 2> at org.apache.zookeeper.server.NIOServerCnxn.doIO(NIOServerCnxn.java:228)
[junit4] 2> at org.apache.zookeeper.server.NIOServerCnxnFactory.run(NIOServerCnxnFactory.java:208)
[junit4] 2> at java.lang.Thread.run(Thread.java:745)
[junit4] 2> 632198 INFO (TEST-PingRequestHandlerTest.testPingInClusterWithNoHealthCheck-seed#[50E075818B0B71E2]) [ ] o.a.s.c.c.SolrZkClient Using default ZkCredentialsProvider
[junit4] 2> 632198 INFO (TEST-PingRequestHandlerTest.testPingInClusterWithNoHealthCheck-seed#[50E075818B0B71E2]) [ ] o.a.s.c.c.ConnectionManager Waiting for client to connect to ZooKeeper
[junit4] 2> 632200 INFO (zkCallback-345-thread-1) [ ] o.a.s.c.c.ConnectionManager Watcher org.apache.solr.common.cloud.ConnectionManager@dfead6 name:ZooKeeperConnection Watcher:127.0.0.1:57401/solr got event WatchedEvent state:SyncConnected type:None path:null path:null type:None
[junit4] 2> 632201 INFO (TEST-PingRequestHandlerTest.testPingInClusterWithNoHealthCheck-seed#[50E075818B0B71E2]) [ ] o.a.s.c.c.ConnectionManager Client is connected to ZooKeeper
[junit4] 2> 632201 INFO (TEST-PingRequestHandlerTest.testPingInClusterWithNoHealthCheck-seed#[50E075818B0B71E2]) [ ] o.a.s.c.c.SolrZkClient Using default ZkACLProvider
[junit4] 2> 632202 INFO (TEST-PingRequestHandlerTest.testPingInClusterWithNoHealthCheck-seed#[50E075818B0B71E2]) [ ] o.a.s.c.c.SolrZkClient makePath: /configs/solrCloudCollectionConfig/addfields.updateprocessor.js
[junit4] 2> 632205 INFO (TEST-PingRequestHandlerTest.testPingInClusterWithNoHealthCheck-seed#[50E075818B0B71E2]) [ ] o.a.s.c.c.SolrZkClient makePath: /configs/solrCloudCollectionConfig/analyzingInfixSuggest.txt
[junit4] 2> 632208 INFO (TEST-PingRequestHandlerTest.testPingInClusterWithNoHealthCheck-seed#[50E075818B0B71E2]) [ ] o.a.s.c.c.SolrZkClient makePath: /configs/solrCloudCollectionConfig/bad-currency.xml
[junit4] 2> 632211 INFO (TEST-PingRequestHandlerTest.testPingInClusterWithNoHealthCheck-seed#[50E075818B0B71E2]) [ ] o.a.s.c.c.SolrZkClient makePath: /configs/solrCloudCollectionConfig/bad-error-solrconfig.xml
[junit4] 2> 632213 INFO (TEST-PingRequestHandlerTest.testPingInClusterWithNoHealthCheck-seed#[50E075818B0B71E2]) [ ] o.a.s.c.c.SolrZkClient makePath: /configs/solrCloudCollectionConfig/bad-mp-solrconfig.xml
[junit4] 2> 632216 INFO (TEST-PingRequestHandlerTest.testPingInClusterWithNoHealthCheck-seed#[50E075818B0B71E2]) [ ] o.a.s.c.c.SolrZkClient makePath: /configs/solrCloudCollectionConfig/bad-schema-analyzer-class-and-nested.xml
[junit4] 2> 632219 INFO (TEST-PingRequestHandlerTest.testPingInClusterWithNoHealthCheck-seed#[50E075818B0B71E2]) [ ] o.a.s.c.c.SolrZkClient makePath: /configs/solrCloudCollectionConfig/bad-schema-bogus-analysis-parameters.xml
[junit4] 2> 632222 INFO (TEST-PingRequestHandlerTest.testPingInClusterWithNoHealthCheck-seed#[50E075818B0B71E2]) [ ] o.a.s.c.c.SolrZkClient makePath: /configs/solrCloudCollectionConfig/bad-schema-bogus-field-parameters.xml
[junit4] 2> 632225 INFO (TEST-PingRequestHandlerTest.testPingInClusterWithNoHealthCheck-seed#[50E075818B0B71E2]) [ ] o.a.s.c.c.SolrZkClient makePath: /configs/solrCloudCollectionConfig/bad-schema-codec-global-vs-ft-mismatch.xml
[junit4] 2> 632228 INFO (TEST-PingRequestHandlerTest.testPingInClusterWithNoHealthCheck-seed#[50E075818B0B71E2]) [ ] o.a.s.c.c.SolrZkClient makePath: /configs/solrCloudCollectionConfig/bad-schema-currency-dynamic-multivalued.xml
[junit4] 2> 632230 INFO (TEST-PingRequestHandlerTest.testPingInClusterWithNoHealthCheck-seed#[50E075818B0B71E2]) [ ] o.a.s.c.c.SolrZkClient makePath: /configs/solrCloudCollectionConfig/bad-schema-currency-ft-bogus-code-in-xml.xml
[junit4] 2> 632232 INFO (TEST-PingRequestHandlerTest.testPingInClusterWithNoHealthCheck-seed#[50E075818B0B71E2]) [ ] o.a.s.
[...truncated too long message...]
/configs/solrCloudCollectionConfig
[junit4] 2>
[junit4] 2> Maximum concurrent data watches above limit:
[junit4] 2>
[junit4] 2> 6 /solr/clusterstate.json
[junit4] 2> 4 /solr/collections/testSolrCloudCollection/state.json
[junit4] 2> 2 /solr/overseer_elect/election/94710287197143052-127.0.0.1:57405_solr-n_0000000001
[junit4] 2> 2 /solr/overseer_elect/election/94710287197143051-127.0.0.1:57408_solr-n_0000000002
[junit4] 2>
[junit4] 2> Maximum concurrent children watches above limit:
[junit4] 2>
[junit4] 2> 6 /solr/live_nodes
[junit4] 2> 6 /solr/collections
[junit4] 2>
[junit4] 2> 640318 INFO (TEST-PingRequestHandlerTest.testPingInClusterWithNoHealthCheck-seed#[50E075818B0B71E2]) [ ] o.a.s.SolrTestCaseJ4 ###Ending testPingInClusterWithNoHealthCheck
[junit4] 2> NOTE: reproduce with: ant test -Dtestcase=PingRequestHandlerTest -Dtests.method=testPingInClusterWithNoHealthCheck -Dtests.seed=50E075818B0B71E2 -Dtests.slow=true -Dtests.locale=ca_ES -Dtests.timezone=America/Boa_Vista -Dtests.asserts=true -Dtests.file.encoding=Cp1252
[junit4] ERROR 9.56s J0 | PingRequestHandlerTest.testPingInClusterWithNoHealthCheck <<<
[junit4] > Throwable #1: org.apache.solr.common.SolrException: Could not find a healthy node to handle the request.
[junit4] > at __randomizedtesting.SeedInfo.seed([50E075818B0B71E2:BE33CB510EE74B06]:0)
[junit4] > at org.apache.solr.client.solrj.impl.CloudSolrClient.sendRequest(CloudSolrClient.java:1084)
[junit4] > at org.apache.solr.client.solrj.impl.CloudSolrClient.requestWithRetryOnStaleState(CloudSolrClient.java:870)
[junit4] > at org.apache.solr.client.solrj.impl.CloudSolrClient.requestWithRetryOnStaleState(CloudSolrClient.java:953)
[junit4] > at org.apache.solr.client.solrj.impl.CloudSolrClient.requestWithRetryOnStaleState(CloudSolrClient.java:953)
[junit4] > at org.apache.solr.client.solrj.impl.CloudSolrClient.requestWithRetryOnStaleState(CloudSolrClient.java:953)
[junit4] > at org.apache.solr.client.solrj.impl.CloudSolrClient.requestWithRetryOnStaleState(CloudSolrClient.java:953)
[junit4] > at org.apache.solr.client.solrj.impl.CloudSolrClient.requestWithRetryOnStaleState(CloudSolrClient.java:953)
[junit4] > at org.apache.solr.client.solrj.impl.CloudSolrClient.request(CloudSolrClient.java:806)
[junit4] > at org.apache.solr.client.solrj.SolrRequest.process(SolrRequest.java:150)
[junit4] > at org.apache.solr.handler.PingRequestHandlerTest.testPingInClusterWithNoHealthCheck(PingRequestHandlerTest.java:201)
[junit4] > at java.lang.Thread.run(Thread.java:745)
[junit4] 2> 640327 INFO (TEST-PingRequestHandlerTest.testPingWithNoHealthCheck-seed#[50E075818B0B71E2]) [ ] o.a.s.SolrTestCaseJ4 ###Starting testPingWithNoHealthCheck
[junit4] 2> 640328 INFO (TEST-PingRequestHandlerTest.testPingWithNoHealthCheck-seed#[50E075818B0B71E2]) [ ] o.a.s.c.S.Request [collection1] webapp=null path=null params={wt=xml} hits=0 status=0 QTime=0
[junit4] 2> 640328 INFO (TEST-PingRequestHandlerTest.testPingWithNoHealthCheck-seed#[50E075818B0B71E2]) [ ] o.a.s.c.S.Request [collection1] webapp=null path=null params={action=ping&wt=xml} hits=0 status=0 QTime=0
[junit4] 2> 640328 INFO (TEST-PingRequestHandlerTest.testPingWithNoHealthCheck-seed#[50E075818B0B71E2]) [ ] o.a.s.SolrTestCaseJ4 ###Ending testPingWithNoHealthCheck
[junit4] 2> 640329 INFO (SUITE-PingRequestHandlerTest-seed#[50E075818B0B71E2]-worker) [ ] o.a.s.SolrTestCaseJ4 ###deleteCore
[junit4] 2> 640329 INFO (SUITE-PingRequestHandlerTest-seed#[50E075818B0B71E2]-worker) [ ] o.a.s.c.CoreContainer Shutting down CoreContainer instance=117411
[junit4] 2> 640330 INFO (SUITE-PingRequestHandlerTest-seed#[50E075818B0B71E2]-worker) [ x:collection1] o.a.s.c.SolrCore [collection1] CLOSING SolrCore org.apache.solr.core.SolrCore@16a03c0
[junit4] 2> 640330 INFO (SUITE-PingRequestHandlerTest-seed#[50E075818B0B71E2]-worker) [ x:collection1] o.a.s.u.UpdateHandler closing DirectUpdateHandler2{commits=0,autocommits=0,soft autocommits=0,optimizes=0,rollbacks=0,expungeDeletes=0,docsPending=0,adds=0,deletesById=0,deletesByQuery=0,errors=0,cumulative_adds=0,cumulative_deletesById=0,cumulative_deletesByQuery=0,cumulative_errors=0,transaction_logs_total_size=0,transaction_logs_total_number=0}
[junit4] 2> 640330 INFO (SUITE-PingRequestHandlerTest-seed#[50E075818B0B71E2]-worker) [ x:collection1] o.a.s.u.SolrCoreState Closing SolrCoreState
[junit4] 2> 640330 INFO (SUITE-PingRequestHandlerTest-seed#[50E075818B0B71E2]-worker) [ x:collection1] o.a.s.u.DefaultSolrCoreState SolrCoreState ref count has reached 0 - closing IndexWriter
[junit4] 2> 640330 INFO (SUITE-PingRequestHandlerTest-seed#[50E075818B0B71E2]-worker) [ x:collection1] o.a.s.u.DefaultSolrCoreState closing IndexWriter with IndexWriterCloser
[junit4] 2> 640330 INFO (SUITE-PingRequestHandlerTest-seed#[50E075818B0B71E2]-worker) [ x:collection1] o.a.s.c.SolrCore [collection1] Closing main searcher on request.
[junit4] 2> 640356 INFO (SUITE-PingRequestHandlerTest-seed#[50E075818B0B71E2]-worker) [ x:collection1] o.a.s.c.CachingDirectoryFactory Closing MockDirectoryFactory - 2 directories currently being tracked
[junit4] 2> 640357 INFO (SUITE-PingRequestHandlerTest-seed#[50E075818B0B71E2]-worker) [ x:collection1] o.a.s.c.CachingDirectoryFactory looking to close C:\Users\JenkinsSlave\workspace\Lucene-Solr-5.x-Windows\solr\build\solr-core\test\J0\temp\solr.handler.PingRequestHandlerTest_50E075818B0B71E2-001\init-core-data-001\index [CachedDir<<refCount=0;path=C:\Users\JenkinsSlave\workspace\Lucene-Solr-5.x-Windows\solr\build\solr-core\test\J0\temp\solr.handler.PingRequestHandlerTest_50E075818B0B71E2-001\init-core-data-001\index;done=false>>]
[junit4] 2> 640357 INFO (SUITE-PingRequestHandlerTest-seed#[50E075818B0B71E2]-worker) [ x:collection1] o.a.s.c.CachingDirectoryFactory Closing directory: C:\Users\JenkinsSlave\workspace\Lucene-Solr-5.x-Windows\solr\build\solr-core\test\J0\temp\solr.handler.PingRequestHandlerTest_50E075818B0B71E2-001\init-core-data-001\index
[junit4] 2> 640357 INFO (SUITE-PingRequestHandlerTest-seed#[50E075818B0B71E2]-worker) [ x:collection1] o.a.s.c.CachingDirectoryFactory looking to close C:\Users\JenkinsSlave\workspace\Lucene-Solr-5.x-Windows\solr\build\solr-core\test\J0\temp\solr.handler.PingRequestHandlerTest_50E075818B0B71E2-001\init-core-data-001\ [CachedDir<<refCount=0;path=C:\Users\JenkinsSlave\workspace\Lucene-Solr-5.x-Windows\solr\build\solr-core\test\J0\temp\solr.handler.PingRequestHandlerTest_50E075818B0B71E2-001\init-core-data-001\;done=false>>]
[junit4] 2> 640357 INFO (SUITE-PingRequestHandlerTest-seed#[50E075818B0B71E2]-worker) [ x:collection1] o.a.s.c.CachingDirectoryFactory Closing directory: C:\Users\JenkinsSlave\workspace\Lucene-Solr-5.x-Windows\solr\build\solr-core\test\J0\temp\solr.handler.PingRequestHandlerTest_50E075818B0B71E2-001\init-core-data-001\
[junit4] 2> NOTE: leaving temporary files on disk at: C:\Users\JenkinsSlave\workspace\Lucene-Solr-5.x-Windows\solr\build\solr-core\test\J0\temp\solr.handler.PingRequestHandlerTest_50E075818B0B71E2-001
[junit4] 2> NOTE: test params are: codec=Lucene53, sim=DefaultSimilarity, locale=ca_ES, timezone=America/Boa_Vista
[junit4] 2> NOTE: Windows 7 6.1 x86/Oracle Corporation 1.8.0_60 (32-bit)/cpus=3,threads=1,free=105141568,total=214626304
[junit4] 2> NOTE: All tests run in this JVM: [TestWordDelimiterFilterFactory, CollectionReloadTest, DocValuesMissingTest, TestCloudManagedSchema, TestReplicationHandler, DistributedMLTComponentTest, TestSearcherReuse, OverseerCollectionConfigSetProcessorTest, TestLeaderInitiatedRecoveryThread, MoreLikeThisHandlerTest, TestSchemaVersionResource, TestSolrCloudWithKerberosAlt, DistributedSpellCheckComponentTest, TestBulkSchemaAPI, TestCloudSchemaless, DistributedDebugComponentTest, HttpPartitionTest, ReturnFieldsTest, DirectSolrSpellCheckerTest, TestNoOpRegenerator, TestFileDictionaryLookup, TestRemoveLastDynamicCopyField, TestOrdValues, RuleEngineTest, HLLSerializationTest, TestConfig, ExplicitHLLTest, TestComponentsName, TestHdfsUpdateLog, PreAnalyzedUpdateProcessorTest, TestXIncludeConfig, TestDocumentBuilder, PeerSyncTest, AnalysisAfterCoreReloadTest, OverriddenZkACLAndCredentialsProvidersTest, SimpleCollectionCreateDeleteTest, PingRequestHandlerTest]
[junit4] Completed [100/542] on J0 in 10.22s, 6 tests, 1 error <<< FAILURES!
[...truncated 1413 lines...]
BUILD FAILED
C:\Users\JenkinsSlave\workspace\Lucene-Solr-5.x-Windows\build.xml:785: The following error occurred while executing this line:
C:\Users\JenkinsSlave\workspace\Lucene-Solr-5.x-Windows\build.xml:729: The following error occurred while executing this line:
C:\Users\JenkinsSlave\workspace\Lucene-Solr-5.x-Windows\build.xml:59: The following error occurred while executing this line:
C:\Users\JenkinsSlave\workspace\Lucene-Solr-5.x-Windows\solr\build.xml:233: The following error occurred while executing this line:
C:\Users\JenkinsSlave\workspace\Lucene-Solr-5.x-Windows\solr\common-build.xml:526: The following error occurred while executing this line:
C:\Users\JenkinsSlave\workspace\Lucene-Solr-5.x-Windows\lucene\common-build.xml:1452: The following error occurred while executing this line:
C:\Users\JenkinsSlave\workspace\Lucene-Solr-5.x-Windows\lucene\common-build.xml:1006: There were test failures: 542 suites (7 ignored), 2143 tests, 1 error, 84 ignored (47 assumptions) [seed: 50E075818B0B71E2]
Total time: 70 minutes 45 seconds
Build step 'Invoke Ant' marked build as failure
Archiving artifacts
[WARNINGS] Skipping publisher since build result is FAILURE
Recording test results
Email was triggered for: Failure - Any
Sending email for trigger: Failure - Any
[JENKINS] Lucene-Solr-5.x-Windows (32bit/jdk1.7.0_80) - Build #
5214 - Still Failing!
Posted by Policeman Jenkins Server <je...@thetaphi.de>.
Build: http://jenkins.thetaphi.de/job/Lucene-Solr-5.x-Windows/5214/
Java: 32bit/jdk1.7.0_80 -client -XX:+UseParallelGC
1 tests failed.
FAILED: org.apache.solr.cloud.CollectionsAPIDistributedZkTest.test
Error Message:
Stack Trace:
java.lang.AssertionError
at __randomizedtesting.SeedInfo.seed([EA6D67E07F66B2B:86F2E9A4A90A06D3]:0)
at org.junit.Assert.fail(Assert.java:92)
at org.junit.Assert.assertTrue(Assert.java:43)
at org.junit.Assert.assertNull(Assert.java:551)
at org.junit.Assert.assertNull(Assert.java:562)
at org.apache.solr.cloud.CollectionsAPIDistributedZkTest.testNoConfigSetExist(CollectionsAPIDistributedZkTest.java:519)
at org.apache.solr.cloud.CollectionsAPIDistributedZkTest.test(CollectionsAPIDistributedZkTest.java:166)
at sun.reflect.NativeMethodAccessorImpl.invoke0(Native Method)
at sun.reflect.NativeMethodAccessorImpl.invoke(NativeMethodAccessorImpl.java:57)
at sun.reflect.DelegatingMethodAccessorImpl.invoke(DelegatingMethodAccessorImpl.java:43)
at java.lang.reflect.Method.invoke(Method.java:606)
at com.carrotsearch.randomizedtesting.RandomizedRunner.invoke(RandomizedRunner.java:1665)
at com.carrotsearch.randomizedtesting.RandomizedRunner$8.evaluate(RandomizedRunner.java:864)
at com.carrotsearch.randomizedtesting.RandomizedRunner$9.evaluate(RandomizedRunner.java:900)
at com.carrotsearch.randomizedtesting.RandomizedRunner$10.evaluate(RandomizedRunner.java:914)
at org.apache.solr.BaseDistributedSearchTestCase$ShardsRepeatRule$ShardsFixedStatement.callStatement(BaseDistributedSearchTestCase.java:963)
at org.apache.solr.BaseDistributedSearchTestCase$ShardsRepeatRule$ShardsStatement.evaluate(BaseDistributedSearchTestCase.java:938)
at com.carrotsearch.randomizedtesting.rules.SystemPropertiesRestoreRule$1.evaluate(SystemPropertiesRestoreRule.java:57)
at org.apache.lucene.util.TestRuleSetupTeardownChained$1.evaluate(TestRuleSetupTeardownChained.java:50)
at org.apache.lucene.util.AbstractBeforeAfterRule$1.evaluate(AbstractBeforeAfterRule.java:46)
at org.apache.lucene.util.TestRuleThreadAndTestName$1.evaluate(TestRuleThreadAndTestName.java:49)
at org.apache.lucene.util.TestRuleIgnoreAfterMaxFailures$1.evaluate(TestRuleIgnoreAfterMaxFailures.java:65)
at org.apache.lucene.util.TestRuleMarkFailure$1.evaluate(TestRuleMarkFailure.java:48)
at com.carrotsearch.randomizedtesting.rules.StatementAdapter.evaluate(StatementAdapter.java:36)
at com.carrotsearch.randomizedtesting.ThreadLeakControl$StatementRunner.run(ThreadLeakControl.java:367)
at com.carrotsearch.randomizedtesting.ThreadLeakControl.forkTimeoutingTask(ThreadLeakControl.java:809)
at com.carrotsearch.randomizedtesting.ThreadLeakControl$3.evaluate(ThreadLeakControl.java:460)
at com.carrotsearch.randomizedtesting.RandomizedRunner.runSingleTest(RandomizedRunner.java:873)
at com.carrotsearch.randomizedtesting.RandomizedRunner$5.evaluate(RandomizedRunner.java:775)
at com.carrotsearch.randomizedtesting.RandomizedRunner$6.evaluate(RandomizedRunner.java:809)
at com.carrotsearch.randomizedtesting.RandomizedRunner$7.evaluate(RandomizedRunner.java:820)
at com.carrotsearch.randomizedtesting.rules.StatementAdapter.evaluate(StatementAdapter.java:36)
at com.carrotsearch.randomizedtesting.rules.SystemPropertiesRestoreRule$1.evaluate(SystemPropertiesRestoreRule.java:57)
at org.apache.lucene.util.AbstractBeforeAfterRule$1.evaluate(AbstractBeforeAfterRule.java:46)
at com.carrotsearch.randomizedtesting.rules.StatementAdapter.evaluate(StatementAdapter.java:36)
at org.apache.lucene.util.TestRuleStoreClassName$1.evaluate(TestRuleStoreClassName.java:42)
at com.carrotsearch.randomizedtesting.rules.NoShadowingOrOverridesOnMethodsRule$1.evaluate(NoShadowingOrOverridesOnMethodsRule.java:39)
at com.carrotsearch.randomizedtesting.rules.NoShadowingOrOverridesOnMethodsRule$1.evaluate(NoShadowingOrOverridesOnMethodsRule.java:39)
at com.carrotsearch.randomizedtesting.rules.StatementAdapter.evaluate(StatementAdapter.java:36)
at com.carrotsearch.randomizedtesting.rules.StatementAdapter.evaluate(StatementAdapter.java:36)
at com.carrotsearch.randomizedtesting.rules.StatementAdapter.evaluate(StatementAdapter.java:36)
at org.apache.lucene.util.TestRuleAssertionsRequired$1.evaluate(TestRuleAssertionsRequired.java:54)
at org.apache.lucene.util.TestRuleMarkFailure$1.evaluate(TestRuleMarkFailure.java:48)
at org.apache.lucene.util.TestRuleIgnoreAfterMaxFailures$1.evaluate(TestRuleIgnoreAfterMaxFailures.java:65)
at org.apache.lucene.util.TestRuleIgnoreTestSuites$1.evaluate(TestRuleIgnoreTestSuites.java:55)
at com.carrotsearch.randomizedtesting.rules.StatementAdapter.evaluate(StatementAdapter.java:36)
at com.carrotsearch.randomizedtesting.ThreadLeakControl$StatementRunner.run(ThreadLeakControl.java:367)
at java.lang.Thread.run(Thread.java:745)
Build Log:
[...truncated 10328 lines...]
[junit4] Suite: org.apache.solr.cloud.CollectionsAPIDistributedZkTest
[junit4] 2> Creating dataDir: C:\Users\JenkinsSlave\workspace\Lucene-Solr-5.x-Windows\solr\build\solr-core\test\J1\temp\solr.cloud.CollectionsAPIDistributedZkTest_EA6D67E07F66B2B-001\init-core-data-001
[junit4] 2> 1300037 INFO (SUITE-CollectionsAPIDistributedZkTest-seed#[EA6D67E07F66B2B]-worker) [ ] o.a.s.SolrTestCaseJ4 Randomized ssl (false) and clientAuth (false)
[junit4] 2> 1300037 INFO (SUITE-CollectionsAPIDistributedZkTest-seed#[EA6D67E07F66B2B]-worker) [ ] o.a.s.BaseDistributedSearchTestCase Setting hostContext system property: /
[junit4] 2> 1300039 INFO (TEST-CollectionsAPIDistributedZkTest.test-seed#[EA6D67E07F66B2B]) [ ] o.a.s.c.ZkTestServer STARTING ZK TEST SERVER
[junit4] 2> 1300040 INFO (Thread-3371) [ ] o.a.s.c.ZkTestServer client port:0.0.0.0/0.0.0.0:0
[junit4] 2> 1300040 INFO (Thread-3371) [ ] o.a.s.c.ZkTestServer Starting server
[junit4] 2> 1300148 INFO (TEST-CollectionsAPIDistributedZkTest.test-seed#[EA6D67E07F66B2B]) [ ] o.a.s.c.ZkTestServer start zk server on port:61208
[junit4] 2> 1300183 INFO (TEST-CollectionsAPIDistributedZkTest.test-seed#[EA6D67E07F66B2B]) [ ] o.a.s.c.c.SolrZkClient Using default ZkCredentialsProvider
[junit4] 2> 1300184 INFO (TEST-CollectionsAPIDistributedZkTest.test-seed#[EA6D67E07F66B2B]) [ ] o.a.s.c.c.ConnectionManager Waiting for client to connect to ZooKeeper
[junit4] 2> 1300236 INFO (zkCallback-1072-thread-1) [ ] o.a.s.c.c.ConnectionManager Watcher org.apache.solr.common.cloud.ConnectionManager@e5a09b name:ZooKeeperConnection Watcher:127.0.0.1:61208 got event WatchedEvent state:SyncConnected type:None path:null path:null type:None
[junit4] 2> 1300236 INFO (TEST-CollectionsAPIDistributedZkTest.test-seed#[EA6D67E07F66B2B]) [ ] o.a.s.c.c.ConnectionManager Client is connected to ZooKeeper
[junit4] 2> 1300236 INFO (TEST-CollectionsAPIDistributedZkTest.test-seed#[EA6D67E07F66B2B]) [ ] o.a.s.c.c.SolrZkClient Using default ZkACLProvider
[junit4] 2> 1300236 INFO (TEST-CollectionsAPIDistributedZkTest.test-seed#[EA6D67E07F66B2B]) [ ] o.a.s.c.c.SolrZkClient makePath: /solr
[junit4] 2> 1300268 INFO (TEST-CollectionsAPIDistributedZkTest.test-seed#[EA6D67E07F66B2B]) [ ] o.a.s.c.c.SolrZkClient Using default ZkCredentialsProvider
[junit4] 2> 1300270 INFO (TEST-CollectionsAPIDistributedZkTest.test-seed#[EA6D67E07F66B2B]) [ ] o.a.s.c.c.ConnectionManager Waiting for client to connect to ZooKeeper
[junit4] 2> 1300285 INFO (zkCallback-1073-thread-1) [ ] o.a.s.c.c.ConnectionManager Watcher org.apache.solr.common.cloud.ConnectionManager@180535 name:ZooKeeperConnection Watcher:127.0.0.1:61208/solr got event WatchedEvent state:SyncConnected type:None path:null path:null type:None
[junit4] 2> 1300285 INFO (TEST-CollectionsAPIDistributedZkTest.test-seed#[EA6D67E07F66B2B]) [ ] o.a.s.c.c.ConnectionManager Client is connected to ZooKeeper
[junit4] 2> 1300285 INFO (TEST-CollectionsAPIDistributedZkTest.test-seed#[EA6D67E07F66B2B]) [ ] o.a.s.c.c.SolrZkClient Using default ZkACLProvider
[junit4] 2> 1300285 INFO (TEST-CollectionsAPIDistributedZkTest.test-seed#[EA6D67E07F66B2B]) [ ] o.a.s.c.c.SolrZkClient makePath: /collections/collection1
[junit4] 2> 1300342 INFO (TEST-CollectionsAPIDistributedZkTest.test-seed#[EA6D67E07F66B2B]) [ ] o.a.s.c.c.SolrZkClient makePath: /collections/collection1/shards
[junit4] 2> 1300444 INFO (TEST-CollectionsAPIDistributedZkTest.test-seed#[EA6D67E07F66B2B]) [ ] o.a.s.c.c.SolrZkClient makePath: /collections/control_collection
[junit4] 2> 1300446 INFO (TEST-CollectionsAPIDistributedZkTest.test-seed#[EA6D67E07F66B2B]) [ ] o.a.s.c.c.SolrZkClient makePath: /collections/control_collection/shards
[junit4] 2> 1300564 INFO (TEST-CollectionsAPIDistributedZkTest.test-seed#[EA6D67E07F66B2B]) [ ] o.a.s.c.AbstractZkTestCase put C:\Users\JenkinsSlave\workspace\Lucene-Solr-5.x-Windows\solr\core\src\test-files\solr\collection1\conf\solrconfig-tlog.xml to /configs/conf1/solrconfig.xml
[junit4] 2> 1300565 INFO (TEST-CollectionsAPIDistributedZkTest.test-seed#[EA6D67E07F66B2B]) [ ] o.a.s.c.c.SolrZkClient makePath: /configs/conf1/solrconfig.xml
[junit4] 2> 1300653 INFO (TEST-CollectionsAPIDistributedZkTest.test-seed#[EA6D67E07F66B2B]) [ ] o.a.s.c.AbstractZkTestCase put C:\Users\JenkinsSlave\workspace\Lucene-Solr-5.x-Windows\solr\core\src\test-files\solr\collection1\conf\schema.xml to /configs/conf1/schema.xml
[junit4] 2> 1300653 INFO (TEST-CollectionsAPIDistributedZkTest.test-seed#[EA6D67E07F66B2B]) [ ] o.a.s.c.c.SolrZkClient makePath: /configs/conf1/schema.xml
[junit4] 2> 1300688 INFO (TEST-CollectionsAPIDistributedZkTest.test-seed#[EA6D67E07F66B2B]) [ ] o.a.s.c.AbstractZkTestCase put C:\Users\JenkinsSlave\workspace\Lucene-Solr-5.x-Windows\solr\core\src\test-files\solr\collection1\conf\solrconfig.snippet.randomindexconfig.xml to /configs/conf1/solrconfig.snippet.randomindexconfig.xml
[junit4] 2> 1300689 INFO (TEST-CollectionsAPIDistributedZkTest.test-seed#[EA6D67E07F66B2B]) [ ] o.a.s.c.c.SolrZkClient makePath: /configs/conf1/solrconfig.snippet.randomindexconfig.xml
[junit4] 2> 1300709 INFO (TEST-CollectionsAPIDistributedZkTest.test-seed#[EA6D67E07F66B2B]) [ ] o.a.s.c.AbstractZkTestCase put C:\Users\JenkinsSlave\workspace\Lucene-Solr-5.x-Windows\solr\core\src\test-files\solr\collection1\conf\stopwords.txt to /configs/conf1/stopwords.txt
[junit4] 2> 1300709 INFO (TEST-CollectionsAPIDistributedZkTest.test-seed#[EA6D67E07F66B2B]) [ ] o.a.s.c.c.SolrZkClient makePath: /configs/conf1/stopwords.txt
[junit4] 2> 1300713 INFO (TEST-CollectionsAPIDistributedZkTest.test-seed#[EA6D67E07F66B2B]) [ ] o.a.s.c.AbstractZkTestCase put C:\Users\JenkinsSlave\workspace\Lucene-Solr-5.x-Windows\solr\core\src\test-files\solr\collection1\conf\protwords.txt to /configs/conf1/protwords.txt
[junit4] 2> 1300713 INFO (TEST-CollectionsAPIDistributedZkTest.test-seed#[EA6D67E07F66B2B]) [ ] o.a.s.c.c.SolrZkClient makePath: /configs/conf1/protwords.txt
[junit4] 2> 1300717 INFO (TEST-CollectionsAPIDistributedZkTest.test-seed#[EA6D67E07F66B2B]) [ ] o.a.s.c.AbstractZkTestCase put C:\Users\JenkinsSlave\workspace\Lucene-Solr-5.x-Windows\solr\core\src\test-files\solr\collection1\conf\currency.xml to /configs/conf1/currency.xml
[junit4] 2> 1300718 INFO (TEST-CollectionsAPIDistributedZkTest.test-seed#[EA6D67E07F66B2B]) [ ] o.a.s.c.c.SolrZkClient makePath: /configs/conf1/currency.xml
[junit4] 2> 1300723 INFO (TEST-CollectionsAPIDistributedZkTest.test-seed#[EA6D67E07F66B2B]) [ ] o.a.s.c.AbstractZkTestCase put C:\Users\JenkinsSlave\workspace\Lucene-Solr-5.x-Windows\solr\core\src\test-files\solr\collection1\conf\enumsConfig.xml to /configs/conf1/enumsConfig.xml
[junit4] 2> 1300723 INFO (TEST-CollectionsAPIDistributedZkTest.test-seed#[EA6D67E07F66B2B]) [ ] o.a.s.c.c.SolrZkClient makePath: /configs/conf1/enumsConfig.xml
[junit4] 2> 1300728 INFO (TEST-CollectionsAPIDistributedZkTest.test-seed#[EA6D67E07F66B2B]) [ ] o.a.s.c.AbstractZkTestCase put C:\Users\JenkinsSlave\workspace\Lucene-Solr-5.x-Windows\solr\core\src\test-files\solr\collection1\conf\open-exchange-rates.json to /configs/conf1/open-exchange-rates.json
[junit4] 2> 1300728 INFO (TEST-CollectionsAPIDistributedZkTest.test-seed#[EA6D67E07F66B2B]) [ ] o.a.s.c.c.SolrZkClient makePath: /configs/conf1/open-exchange-rates.json
[junit4] 2> 1300729 INFO (TEST-CollectionsAPIDistributedZkTest.test-seed#[EA6D67E07F66B2B]) [ ] o.a.s.c.AbstractZkTestCase put C:\Users\JenkinsSlave\workspace\Lucene-Solr-5.x-Windows\solr\core\src\test-files\solr\collection1\conf\mapping-ISOLatin1Accent.txt to /configs/conf1/mapping-ISOLatin1Accent.txt
[junit4] 2> 1300730 INFO (TEST-CollectionsAPIDistributedZkTest.test-seed#[EA6D67E07F66B2B]) [ ] o.a.s.c.c.SolrZkClient makePath: /configs/conf1/mapping-ISOLatin1Accent.txt
[junit4] 2> 1300731 INFO (TEST-CollectionsAPIDistributedZkTest.test-seed#[EA6D67E07F66B2B]) [ ] o.a.s.c.AbstractZkTestCase put C:\Users\JenkinsSlave\workspace\Lucene-Solr-5.x-Windows\solr\core\src\test-files\solr\collection1\conf\old_synonyms.txt to /configs/conf1/old_synonyms.txt
[junit4] 2> 1300732 INFO (TEST-CollectionsAPIDistributedZkTest.test-seed#[EA6D67E07F66B2B]) [ ] o.a.s.c.c.SolrZkClient makePath: /configs/conf1/old_synonyms.txt
[junit4] 2> 1300733 INFO (TEST-CollectionsAPIDistributedZkTest.test-seed#[EA6D67E07F66B2B]) [ ] o.a.s.c.AbstractZkTestCase put C:\Users\JenkinsSlave\workspace\Lucene-Solr-5.x-Windows\solr\core\src\test-files\solr\collection1\conf\synonyms.txt to /configs/conf1/synonyms.txt
[junit4] 2> 1300733 INFO (TEST-CollectionsAPIDistributedZkTest.test-seed#[EA6D67E07F66B2B]) [ ] o.a.s.c.c.SolrZkClient makePath: /configs/conf1/synonyms.txt
[junit4] 2> 1300735 WARN (NIOServerCxn.Factory:0.0.0.0/0.0.0.0:0) [ ] o.a.z.s.NIOServerCnxn caught end of stream exception
[junit4] 2> EndOfStreamException: Unable to read additional data from client sessionid 0x1507c6e3f070001, likely client has closed socket
[junit4] 2> at org.apache.zookeeper.server.NIOServerCnxn.doIO(NIOServerCnxn.java:228)
[junit4] 2> at org.apache.zookeeper.server.NIOServerCnxnFactory.run(NIOServerCnxnFactory.java:208)
[junit4] 2> at java.lang.Thread.run(Thread.java:745)
[junit4] 2> 1300735 INFO (TEST-CollectionsAPIDistributedZkTest.test-seed#[EA6D67E07F66B2B]) [ ] o.a.s.c.c.SolrZkClient Using default ZkCredentialsProvider
[junit4] 2> 1300736 INFO (TEST-CollectionsAPIDistributedZkTest.test-seed#[EA6D67E07F66B2B]) [ ] o.a.s.c.c.ConnectionManager Waiting for client to connect to ZooKeeper
[junit4] 2> 1300740 INFO (zkCallback-1074-thread-1) [ ] o.a.s.c.c.ConnectionManager Watcher org.apache.solr.common.cloud.ConnectionManager@15f6c11 name:ZooKeeperConnection Watcher:127.0.0.1:61208 got event WatchedEvent state:SyncConnected type:None path:null path:null type:None
[junit4] 2> 1300740 INFO (TEST-CollectionsAPIDistributedZkTest.test-seed#[EA6D67E07F66B2B]) [ ] o.a.s.c.c.ConnectionManager Client is connected to ZooKeeper
[junit4] 2> 1300740 INFO (TEST-CollectionsAPIDistributedZkTest.test-seed#[EA6D67E07F66B2B]) [ ] o.a.s.c.c.SolrZkClient Using default ZkACLProvider
[junit4] 2> 1300741 INFO (TEST-CollectionsAPIDistributedZkTest.test-seed#[EA6D67E07F66B2B]) [ ] o.a.s.c.c.SolrZkClient makePath: /solr
[junit4] 2> 1300746 WARN (NIOServerCxn.Factory:0.0.0.0/0.0.0.0:0) [ ] o.a.z.s.NIOServerCnxn caught end of stream exception
[junit4] 2> EndOfStreamException: Unable to read additional data from client sessionid 0x1507c6e3f070002, likely client has closed socket
[junit4] 2> at org.apache.zookeeper.server.NIOServerCnxn.doIO(NIOServerCnxn.java:228)
[junit4] 2> at org.apache.zookeeper.server.NIOServerCnxnFactory.run(NIOServerCnxnFactory.java:208)
[junit4] 2> at java.lang.Thread.run(Thread.java:745)
[junit4] 2> 1300746 INFO (TEST-CollectionsAPIDistributedZkTest.test-seed#[EA6D67E07F66B2B]) [ ] o.a.s.c.c.SolrZkClient Using default ZkCredentialsProvider
[junit4] 2> 1300748 INFO (TEST-CollectionsAPIDistributedZkTest.test-seed#[EA6D67E07F66B2B]) [ ] o.a.s.c.c.ConnectionManager Waiting for client to connect to ZooKeeper
[junit4] 2> 1300749 INFO (zkCallback-1075-thread-1) [ ] o.a.s.c.c.ConnectionManager Watcher org.apache.solr.common.cloud.ConnectionManager@16564b name:ZooKeeperConnection Watcher:127.0.0.1:61208/solr got event WatchedEvent state:SyncConnected type:None path:null path:null type:None
[junit4] 2> 1300749 INFO (TEST-CollectionsAPIDistributedZkTest.test-seed#[EA6D67E07F66B2B]) [ ] o.a.s.c.c.ConnectionManager Client is connected to ZooKeeper
[junit4] 2> 1300749 INFO (TEST-CollectionsAPIDistributedZkTest.test-seed#[EA6D67E07F66B2B]) [ ] o.a.s.c.c.SolrZkClient Using default ZkACLProvider
[junit4] 2> 1300750 INFO (TEST-CollectionsAPIDistributedZkTest.test-seed#[EA6D67E07F66B2B]) [ ] o.a.s.c.AbstractZkTestCase put C:\Users\JenkinsSlave\workspace\Lucene-Solr-5.x-Windows\solr\core\src\test-files\solr\collection1\conf\solrconfig-tlog.xml to /configs/conf2/solrconfig.xml
[junit4] 2> 1300750 INFO (TEST-CollectionsAPIDistributedZkTest.test-seed#[EA6D67E07F66B2B]) [ ] o.a.s.c.c.SolrZkClient makePath: /configs/conf2/solrconfig.xml
[junit4] 2> 1300753 INFO (TEST-CollectionsAPIDistributedZkTest.test-seed#[EA6D67E07F66B2B]) [ ] o.a.s.c.AbstractZkTestCase put C:\Users\JenkinsSlave\workspace\Lucene-Solr-5.x-Windows\solr\core\src\test-files\solr\collection1\conf\schema.xml to /configs/conf2/schema.xml
[junit4] 2> 1300753 INFO (TEST-CollectionsAPIDistributedZkTest.test-seed#[EA6D67E07F66B2B]) [ ] o.a.s.c.c.SolrZkClient makePath: /configs/conf2/schema.xml
[junit4] 2> 1300792 INFO (TEST-CollectionsAPIDistributedZkTest.test-seed#[EA6D67E07F66B2B]) [ ] o.a.s.c.AbstractZkTestCase put C:\Users\JenkinsSlave\workspace\Lucene-Solr-5.x-Windows\solr\core\src\test-files\solr\collection1\conf\enumsConfig.xml to /configs/conf2/enumsConfig.xml
[junit4] 2> 1300793 INFO (TEST-CollectionsAPIDistributedZkTest.test-seed#[EA6D67E07F66B2B]) [ ] o.a.s.c.c.SolrZkClient makePath: /configs/conf2/enumsConfig.xml
[junit4] 2> 1300799 INFO (TEST-CollectionsAPIDistributedZkTest.test-seed#[EA6D67E07F66B2B]) [ ] o.a.s.c.AbstractZkTestCase put C:\Users\JenkinsSlave\workspace\Lucene-Solr-5.x-Windows\solr\core\src\test-files\solr\collection1\conf\solrconfig.snippet.randomindexconfig.xml to /configs/conf2/solrconfig.snippet.randomindexconfig.xml
[junit4] 2> 1300799 INFO (TEST-CollectionsAPIDistributedZkTest.test-seed#[EA6D67E07F66B2B]) [ ] o.a.s.c.c.SolrZkClient makePath: /configs/conf2/solrconfig.snippet.randomindexconfig.xml
[junit4] 2> 1300900 INFO (TEST-CollectionsAPIDistributedZkTest.test-seed#[EA6D67E07F66B2B]) [ ] o.a.s.c.AbstractZkTestCase put C:\Users\JenkinsSlave\workspace\Lucene-Solr-5.x-Windows\solr\core\src\test-files\solr\collection1\conf\stopwords.txt to /configs/conf2/stopwords.txt
[junit4] 2> 1300900 INFO (TEST-CollectionsAPIDistributedZkTest.test-seed#[EA6D67E07F66B2B]) [ ] o.a.s.c.c.SolrZkClient makePath: /configs/conf2/stopwords.txt
[junit4] 2> 1300987 INFO (TEST-CollectionsAPIDistributedZkTest.test-seed#[EA6D67E07F66B2B]) [ ] o.a.s.c.AbstractZkTestCase put C:\Users\JenkinsSlave\workspace\Lucene-Solr-5.x-Windows\solr\core\src\test-files\solr\collection1\conf\protwords.txt to /configs/conf2/protwords.txt
[junit4] 2> 1300987 INFO (TEST-CollectionsAPIDistributedZkTest.test-seed#[EA6D67E07F66B2B]) [ ] o.a.s.c.c.SolrZkClient makePath: /configs/conf2/protwords.txt
[junit4] 2> 1301029 INFO (TEST-CollectionsAPIDistributedZkTest.test-seed#[EA6D67E07F66B2B]) [ ] o.a.s.c.AbstractZkTestCase put C:\Users\JenkinsSlave\workspace\Lucene-Solr-5.x-Windows\solr\core\src\test-files\solr\collection1\conf\currency.xml to /configs/conf2/currency.xml
[junit4] 2> 1301030 INFO (TEST-CollectionsAPIDistributedZkTest.test-seed#[EA6D67E07F66B2B]) [ ] o.a.s.c.c.SolrZkClient makePath: /configs/conf2/currency.xml
[junit4] 2> 1301083 INFO (TEST-CollectionsAPIDistributedZkTest.test-seed#[EA6D67E07F66B2B]) [ ] o.a.s.c.AbstractZkTestCase put C:\Users\JenkinsSlave\workspace\Lucene-Solr-5.x-Windows\solr\core\src\test-files\solr\collection1\conf\open-exchange-rates.json to /configs/conf2/open-exchange-rates.json
[junit4] 2> 1301084 INFO (TEST-CollectionsAPIDistributedZkTest.test-seed#[EA6D67E07F66B2B]) [ ] o.a.s.c.c.SolrZkClient makePath: /configs/conf2/open-exchange-rates.json
[junit4] 2> 1301107 INFO (TEST-CollectionsAPIDistributedZkTest.test-seed#[EA6D67E07F66B2B]) [ ] o.a.s.c.AbstractZkTestCase put C:\Users\JenkinsSlave\workspace\Lucene-Solr-5.x-Windows\solr\core\src\test-files\solr\collection1\conf\mapping-ISOLatin1Accent.txt to /configs/conf2/mapping-ISOLatin1Accent.txt
[junit4] 2> 1301107 INFO (TEST-CollectionsAPIDistributedZkTest.test-seed#[EA6D67E07F66B2B]) [ ] o.a.s.c.c.SolrZkClient makePath: /configs/conf2/mapping-ISOLatin1Accent.txt
[junit4] 2> 1301178 INFO (TEST-CollectionsAPIDistributedZkTest.test-seed#[EA6D67E07F66B2B]) [ ] o.a.s.c.AbstractZkTestCase put C:\Users\JenkinsSlave\workspace\Lucene-Solr-5.x-Windows\solr\core\src\test-files\solr\collection1\conf\old_synonyms.txt to /configs/conf2/old_synonyms.txt
[junit4] 2> 1301178 INFO (TEST-CollectionsAPIDistributedZkTest.test-seed#[EA6D67E07F66B2B]) [ ] o.a.s.c.c.SolrZkClient makePath: /configs/conf2/old_synonyms.txt
[junit4] 2> 1301211 INFO (TEST-CollectionsAPIDistributedZkTest.test-seed#[EA6D67E07F66B2B]) [ ] o.a.s.c.AbstractZkTestCase put C:\Users\JenkinsSlave\workspace\Lucene-Solr-5.x-Windows\solr\core\src\test-files\solr\collection1\conf\synonyms.txt to /configs/conf2/synonyms.txt
[junit4] 2> 1301211 INFO (TEST-CollectionsAPIDistributedZkTest.test-seed#[EA6D67E07F66B2B]) [ ] o.a.s.c.c.SolrZkClient makePath: /configs/conf2/synonyms.txt
[junit4] 2> 1301273 INFO (TEST-CollectionsAPIDistributedZkTest.test-seed#[EA6D67E07F66B2B]) [ ] o.a.s.c.AbstractZkTestCase put C:\Users\JenkinsSlave\workspace\Lucene-Solr-5.x-Windows\solr\core\src\test-files\solr\collection1\conf\elevate.xml to /configs/conf2/elevate.xml
[junit4] 2> 1301273 INFO (TEST-CollectionsAPIDistributedZkTest.test-seed#[EA6D67E07F66B2B]) [ ] o.a.s.c.c.SolrZkClient makePath: /configs/conf2/elevate.xml
[junit4] 2> 1302745 INFO (TEST-CollectionsAPIDistributedZkTest.test-seed#[EA6D67E07F66B2B]) [ ] o.a.s.SolrTestCaseJ4 Writing core.properties file to C:\Users\JenkinsSlave\workspace\Lucene-Solr-5.x-Windows\solr\build\solr-core\test\J1\temp\solr.cloud.CollectionsAPIDistributedZkTest_EA6D67E07F66B2B-001\control-001\cores\collection1
[junit4] 2> 1302747 INFO (TEST-CollectionsAPIDistributedZkTest.test-seed#[EA6D67E07F66B2B]) [ ] o.e.j.s.Server jetty-9.2.13.v20150730
[junit4] 2> 1302825 INFO (TEST-CollectionsAPIDistributedZkTest.test-seed#[EA6D67E07F66B2B]) [ ] o.e.j.s.h.ContextHandler Started o.e.j.s.ServletContextHandler@2a8d64{/,null,AVAILABLE}
[junit4] 2> 1302826 INFO (TEST-CollectionsAPIDistributedZkTest.test-seed#[EA6D67E07F66B2B]) [ ] o.e.j.s.ServerConnector Started ServerConnector@1a8a572{HTTP/1.1}{127.0.0.1:61235}
[junit4] 2> 1302826 INFO (TEST-CollectionsAPIDistributedZkTest.test-seed#[EA6D67E07F66B2B]) [ ] o.e.j.s.Server Started @1305828ms
[junit4] 2> 1302826 INFO (TEST-CollectionsAPIDistributedZkTest.test-seed#[EA6D67E07F66B2B]) [ ] o.a.s.c.s.e.JettySolrRunner Jetty properties: {coreRootDirectory=C:\Users\JenkinsSlave\workspace\Lucene-Solr-5.x-Windows\solr\build\solr-core\test\J1\..\..\..\..\..\..\..\..\..\Users\JenkinsSlave\workspace\Lucene-Solr-5.x-Windows\solr\build\solr-core\test\J1\temp\solr.cloud.CollectionsAPIDistributedZkTest_EA6D67E07F66B2B-001\control-001\cores, hostPort=61235, solr.data.dir=C:\Users\JenkinsSlave\workspace\Lucene-Solr-5.x-Windows\solr\build\solr-core\test\J1\temp\solr.cloud.CollectionsAPIDistributedZkTest_EA6D67E07F66B2B-001\tempDir-001/control/data, hostContext=/}
[junit4] 2> 1302827 INFO (TEST-CollectionsAPIDistributedZkTest.test-seed#[EA6D67E07F66B2B]) [ ] o.a.s.s.SolrDispatchFilter SolrDispatchFilter.init(): sun.misc.Launcher$AppClassLoader@5f387c
[junit4] 2> 1302827 INFO (TEST-CollectionsAPIDistributedZkTest.test-seed#[EA6D67E07F66B2B]) [ ] o.a.s.c.SolrResourceLoader new SolrResourceLoader for directory: 'C:\Users\JenkinsSlave\workspace\Lucene-Solr-5.x-Windows\solr\build\solr-core\test\J1\..\..\..\..\..\..\..\..\..\Users\JenkinsSlave\workspace\Lucene-Solr-5.x-Windows\solr\build\solr-core\test\J1\temp\solr.cloud.CollectionsAPIDistributedZkTest_EA6D67E07F66B2B-001\control-001\'
[junit4] 2> 1302827 INFO (TEST-CollectionsAPIDistributedZkTest.test-seed#[EA6D67E07F66B2B]) [ ] o.a.s.c.SolrResourceLoader JNDI not configured for solr (NoInitialContextEx)
[junit4] 2> 1302827 INFO (TEST-CollectionsAPIDistributedZkTest.test-seed#[EA6D67E07F66B2B]) [ ] o.a.s.c.SolrResourceLoader solr home defaulted to 'solr/' (could not find system property or JNDI)
[junit4] 2> 1302888 INFO (TEST-CollectionsAPIDistributedZkTest.test-seed#[EA6D67E07F66B2B]) [ ] o.a.s.c.c.SolrZkClient Using default ZkCredentialsProvider
[junit4] 2> 1302890 INFO (TEST-CollectionsAPIDistributedZkTest.test-seed#[EA6D67E07F66B2B]) [ ] o.a.s.c.c.ConnectionManager Waiting for client to connect to ZooKeeper
[junit4] 2> 1302971 INFO (zkCallback-1076-thread-1) [ ] o.a.s.c.c.ConnectionManager Watcher org.apache.solr.common.cloud.ConnectionManager@6344cb name:ZooKeeperConnection Watcher:127.0.0.1:61208/solr got event WatchedEvent state:SyncConnected type:None path:null path:null type:None
[junit4] 2> 1302971 INFO (TEST-CollectionsAPIDistributedZkTest.test-seed#[EA6D67E07F66B2B]) [ ] o.a.s.c.c.ConnectionManager Client is connected to ZooKeeper
[junit4] 2> 1302972 INFO (TEST-CollectionsAPIDistributedZkTest.test-seed#[EA6D67E07F66B2B]) [ ] o.a.s.c.c.SolrZkClient Using default ZkACLProvider
[junit4] 2> 1303075 INFO (TEST-CollectionsAPIDistributedZkTest.test-seed#[EA6D67E07F66B2B]) [ ] o.a.s.s.SolrDispatchFilter Loading solr.xml from SolrHome (not found in ZooKeeper)
[junit4] 2> 1303075 INFO (TEST-CollectionsAPIDistributedZkTest.test-seed#[EA6D67E07F66B2B]) [ ] o.a.s.c.SolrXmlConfig Loading container configuration from C:\Users\JenkinsSlave\workspace\Lucene-Solr-5.x-Windows\solr\build\solr-core\test\J1\..\..\..\..\..\..\..\..\..\Users\JenkinsSlave\workspace\Lucene-Solr-5.x-Windows\solr\build\solr-core\test\J1\temp\solr.cloud.CollectionsAPIDistributedZkTest_EA6D67E07F66B2B-001\control-001\solr.xml
[junit4] 2> 1303205 INFO (TEST-CollectionsAPIDistributedZkTest.test-seed#[EA6D67E07F66B2B]) [ ] o.a.s.c.CoresLocator Config-defined core root directory: C:\Users\JenkinsSlave\workspace\Lucene-Solr-5.x-Windows\solr\build\solr-core\test\J1\..\..\..\..\..\..\..\..\..\Users\JenkinsSlave\workspace\Lucene-Solr-5.x-Windows\solr\build\solr-core\test\J1\temp\solr.cloud.CollectionsAPIDistributedZkTest_EA6D67E07F66B2B-001\control-001\cores
[junit4] 2> 1303205 INFO (TEST-CollectionsAPIDistributedZkTest.test-seed#[EA6D67E07F66B2B]) [ ] o.a.s.c.CoreContainer New CoreContainer 16151477
[junit4] 2> 1303205 INFO (TEST-CollectionsAPIDistributedZkTest.test-seed#[EA6D67E07F66B2B]) [ ] o.a.s.c.CoreContainer Loading cores into CoreContainer [instanceDir=C:\Users\JenkinsSlave\workspace\Lucene-Solr-5.x-Windows\solr\build\solr-core\test\J1\..\..\..\..\..\..\..\..\..\Users\JenkinsSlave\workspace\Lucene-Solr-5.x-Windows\solr\build\solr-core\test\J1\temp\solr.cloud.CollectionsAPIDistributedZkTest_EA6D67E07F66B2B-001\control-001\]
[junit4] 2> 1303205 INFO (TEST-CollectionsAPIDistributedZkTest.test-seed#[EA6D67E07F66B2B]) [ ] o.a.s.c.CoreContainer loading shared library: C:\Users\JenkinsSlave\workspace\Lucene-Solr-5.x-Windows\solr\build\solr-core\test\J1\..\..\..\..\..\..\..\..\..\Users\JenkinsSlave\workspace\Lucene-Solr-5.x-Windows\solr\build\solr-core\test\J1\temp\solr.cloud.CollectionsAPIDistributedZkTest_EA6D67E07F66B2B-001\control-001\lib
[junit4] 2> 1303205 WARN (TEST-CollectionsAPIDistributedZkTest.test-seed#[EA6D67E07F66B2B]) [ ] o.a.s.c.SolrResourceLoader Can't find (or read) directory to add to classloader: lib (resolved as: C:\Users\JenkinsSlave\workspace\Lucene-Solr-5.x-Windows\solr\build\solr-core\test\J1\..\..\..\..\..\..\..\..\..\Users\JenkinsSlave\workspace\Lucene-Solr-5.x-Windows\solr\build\solr-core\test\J1\temp\solr.cloud.CollectionsAPIDistributedZkTest_EA6D67E07F66B2B-001\control-001\lib).
[junit4] 2> 1303237 INFO (TEST-CollectionsAPIDistributedZkTest.test-seed#[EA6D67E07F66B2B]) [ ] o.a.s.h.c.HttpShardHandlerFactory created with socketTimeout : 90000,urlScheme : ,connTimeout : 15000,maxConnectionsPerHost : 20,maxConnections : 10000,corePoolSize : 0,maximumPoolSize : 2147483647,maxThreadIdleTime : 5,sizeOfQueue : -1,fairnessPolicy : false,useRetries : false,
[junit4] 2> 1303295 INFO (TEST-CollectionsAPIDistributedZkTest.test-seed#[EA6D67E07F66B2B]) [ ] o.a.s.u.UpdateShardHandler Creating UpdateShardHandler HTTP client with params: socketTimeout=340000&connTimeout=45000&retry=true
[junit4] 2> 1303315 INFO (TEST-CollectionsAPIDistributedZkTest.test-seed#[EA6D67E07F66B2B]) [ ] o.a.s.l.LogWatcher SLF4J impl is org.slf4j.impl.Log4jLoggerFactory
[junit4] 2> 1303315 INFO (TEST-CollectionsAPIDistributedZkTest.test-seed#[EA6D67E07F66B2B]) [ ] o.a.s.l.LogWatcher Registering Log Listener [Log4j (org.slf4j.impl.Log4jLoggerFactory)]
[junit4] 2> 1303315 INFO (TEST-CollectionsAPIDistributedZkTest.test-seed#[EA6D67E07F66B2B]) [ ] o.a.s.c.ZkContainer Zookeeper client=127.0.0.1:61208/solr
[junit4] 2> 1303315 INFO (TEST-CollectionsAPIDistributedZkTest.test-seed#[EA6D67E07F66B2B]) [ ] o.a.s.c.ZkController zkHost includes chroot
[junit4] 2> 1303316 INFO (TEST-CollectionsAPIDistributedZkTest.test-seed#[EA6D67E07F66B2B]) [ ] o.a.s.c.c.SolrZkClient Using default ZkCredentialsProvider
[junit4] 2> 1303317 INFO (TEST-CollectionsAPIDistributedZkTest.test-seed#[EA6D67E07F66B2B]) [ ] o.a.s.c.c.ConnectionManager Waiting for client to connect to ZooKeeper
[junit4] 2> 1303320 INFO (zkCallback-1078-thread-1) [ ] o.a.s.c.c.ConnectionManager Watcher org.apache.solr.common.cloud.ConnectionManager@2b8a6a name:ZooKeeperConnection Watcher:127.0.0.1:61208 got event WatchedEvent state:SyncConnected type:None path:null path:null type:None
[junit4] 2> 1303320 INFO (TEST-CollectionsAPIDistributedZkTest.test-seed#[EA6D67E07F66B2B]) [ ] o.a.s.c.c.ConnectionManager Client is connected to ZooKeeper
[junit4] 2> 1303320 INFO (TEST-CollectionsAPIDistributedZkTest.test-seed#[EA6D67E07F66B2B]) [ ] o.a.s.c.c.SolrZkClient Using default ZkACLProvider
[junit4] 2> 1303344 INFO (TEST-CollectionsAPIDistributedZkTest.test-seed#[EA6D67E07F66B2B]) [n:127.0.0.1:61235_ ] o.a.s.c.c.ConnectionManager Waiting for client to connect to ZooKeeper
[junit4] 2> 1303349 INFO (zkCallback-1079-thread-1-processing-n:127.0.0.1:61235_) [n:127.0.0.1:61235_ ] o.a.s.c.c.ConnectionManager Watcher org.apache.solr.common.cloud.ConnectionManager@1589744 name:ZooKeeperConnection Watcher:127.0.0.1:61208/solr got event WatchedEvent state:SyncConnected type:None path:null path:null type:None
[junit4] 2> 1303349 INFO (TEST-CollectionsAPIDistributedZkTest.test-seed#[EA6D67E07F66B2B]) [n:127.0.0.1:61235_ ] o.a.s.c.c.ConnectionManager Client is connected to ZooKeeper
[junit4] 2> 1303352 INFO (TEST-CollectionsAPIDistributedZkTest.test-seed#[EA6D67E07F66B2B]) [n:127.0.0.1:61235_ ] o.a.s.c.c.SolrZkClient makePath: /overseer/queue
[junit4] 2> 1303362 INFO (TEST-CollectionsAPIDistributedZkTest.test-seed#[EA6D67E07F66B2B]) [n:127.0.0.1:61235_ ] o.a.s.c.c.SolrZkClient makePath: /overseer/collection-queue-work
[junit4] 2> 1303374 INFO (TEST-CollectionsAPIDistributedZkTest.test-seed#[EA6D67E07F66B2B]) [n:127.0.0.1:61235_ ] o.a.s.c.c.SolrZkClient makePath: /overseer/collection-map-running
[junit4] 2> 1303384 INFO (TEST-CollectionsAPIDistributedZkTest.test-seed#[EA6D67E07F66B2B]) [n:127.0.0.1:61235_ ] o.a.s.c.c.SolrZkClient makePath: /overseer/collection-map-completed
[junit4] 2> 1303393 INFO (TEST-CollectionsAPIDistributedZkTest.test-seed#[EA6D67E07F66B2B]) [n:127.0.0.1:61235_ ] o.a.s.c.c.SolrZkClient makePath: /overseer/collection-map-failure
[junit4] 2> 1303404 INFO (TEST-CollectionsAPIDistributedZkTest.test-seed#[EA6D67E07F66B2B]) [n:127.0.0.1:61235_ ] o.a.s.c.c.SolrZkClient makePath: /live_nodes
[junit4] 2> 1303412 INFO (TEST-CollectionsAPIDistributedZkTest.test-seed#[EA6D67E07F66B2B]) [n:127.0.0.1:61235_ ] o.a.s.c.c.SolrZkClient makePath: /aliases.json
[junit4] 2> 1303417 INFO (TEST-CollectionsAPIDistributedZkTest.test-seed#[EA6D67E07F66B2B]) [n:127.0.0.1:61235_ ] o.a.s.c.c.SolrZkClient makePath: /clusterstate.json
[junit4] 2> 1303423 INFO (TEST-CollectionsAPIDistributedZkTest.test-seed#[EA6D67E07F66B2B]) [n:127.0.0.1:61235_ ] o.a.s.c.c.SolrZkClient makePath: /security.json
[junit4] 2> 1303426 INFO (TEST-CollectionsAPIDistributedZkTest.test-seed#[EA6D67E07F66B2B]) [n:127.0.0.1:61235_ ] o.a.s.c.ZkController Register node as live in ZooKeeper:/live_nodes/127.0.0.1:61235_
[junit4] 2> 1303426 INFO (TEST-CollectionsAPIDistributedZkTest.test-seed#[EA6D67E07F66B2B]) [n:127.0.0.1:61235_ ] o.a.s.c.c.SolrZkClient makePath: /live_nodes/127.0.0.1:61235_
[junit4] 2> 1303433 INFO (TEST-CollectionsAPIDistributedZkTest.test-seed#[EA6D67E07F66B2B]) [n:127.0.0.1:61235_ ] o.a.s.c.c.SolrZkClient makePath: /overseer_elect
[junit4] 2> 1303437 INFO (TEST-CollectionsAPIDistributedZkTest.test-seed#[EA6D67E07F66B2B]) [n:127.0.0.1:61235_ ] o.a.s.c.c.SolrZkClient makePath: /overseer_elect/election
[junit4] 2> 1303442 INFO (TEST-CollectionsAPIDistributedZkTest.test-seed#[EA6D67E07F66B2B]) [n:127.0.0.1:61235_ ] o.a.s.c.Overseer Overseer (id=null) closing
[junit4] 2> 1303444 INFO (TEST-CollectionsAPIDistributedZkTest.test-seed#[EA6D67E07F66B2B]) [n:127.0.0.1:61235_ ] o.a.s.c.LeaderElector Joined leadership election with path: /overseer_elect/election/94712405120450566-127.0.0.1:61235_-n_0000000000
[junit4] 2> 1303445 INFO (TEST-CollectionsAPIDistributedZkTest.test-seed#[EA6D67E07F66B2B]) [n:127.0.0.1:61235_ ] o.a.s.c.OverseerElectionContext I am going to be the leader 127.0.0.1:61235_
[junit4] 2> 1303445 INFO (TEST-CollectionsAPIDistributedZkTest.test-seed#[EA6D67E07F66B2B]) [n:127.0.0.1:61235_ ] o.a.s.c.c.SolrZkClient makePath: /overseer_elect/leader
[junit4] 2> 1303448 INFO (TEST-CollectionsAPIDistributedZkTest.test-seed#[EA6D67E07F66B2B]) [n:127.0.0.1:61235_ ] o.a.s.c.Overseer Overseer (id=94712405120450566-127.0.0.1:61235_-n_0000000000) starting
[junit4] 2> 1303455 INFO (TEST-CollectionsAPIDistributedZkTest.test-seed#[EA6D67E07F66B2B]) [n:127.0.0.1:61235_ ] o.a.s.c.c.SolrZkClient makePath: /overseer/queue-work
[junit4] 2> 1303610 INFO (TEST-CollectionsAPIDistributedZkTest.test-seed#[EA6D67E07F66B2B]) [n:127.0.0.1:61235_ ] o.a.s.c.OverseerAutoReplicaFailoverThread Starting OverseerAutoReplicaFailoverThread autoReplicaFailoverWorkLoopDelay=10000 autoReplicaFailoverWaitAfterExpiration=10000 autoReplicaFailoverBadNodeExpiration=60000
[junit4] 2> 1303611 INFO (TEST-CollectionsAPIDistributedZkTest.test-seed#[EA6D67E07F66B2B]) [n:127.0.0.1:61235_ ] o.a.s.c.c.ZkStateReader Updating cluster state from ZooKeeper...
[junit4] 2> 1303612 INFO (OverseerCollectionConfigSetProcessor-94712405120450566-127.0.0.1:61235_-n_0000000000) [n:127.0.0.1:61235_ ] o.a.s.c.OverseerTaskProcessor Process current queue of overseer operations
[junit4] 2> 1303615 INFO (OverseerStateUpdate-94712405120450566-127.0.0.1:61235_-n_0000000000) [n:127.0.0.1:61235_ ] o.a.s.c.Overseer Starting to work on the main queue
[junit4] 2> 1303716 INFO (TEST-CollectionsAPIDistributedZkTest.test-seed#[EA6D67E07F66B2B]) [n:127.0.0.1:61235_ ] o.a.s.c.CoreContainer Security conf doesn't exist. Skipping setup for authorization module.
[junit4] 2> 1303716 INFO (TEST-CollectionsAPIDistributedZkTest.test-seed#[EA6D67E07F66B2B]) [n:127.0.0.1:61235_ ] o.a.s.c.CoreContainer No authentication plugin used.
[junit4] 2> 1303718 INFO (TEST-CollectionsAPIDistributedZkTest.test-seed#[EA6D67E07F66B2B]) [n:127.0.0.1:61235_ ] o.a.s.c.CoresLocator Looking for core definitions underneath C:\Users\JenkinsSlave\workspace\Lucene-Solr-5.x-Windows\solr\build\solr-core\test\J1\..\..\..\..\..\..\..\..\..\Users\JenkinsSlave\workspace\Lucene-Solr-5.x-Windows\solr\build\solr-core\test\J1\temp\solr.cloud.CollectionsAPIDistributedZkTest_EA6D67E07F66B2B-001\control-001\cores
[junit4] 2> 1303721 INFO (TEST-CollectionsAPIDistributedZkTest.test-seed#[EA6D67E07F66B2B]) [n:127.0.0.1:61235_ ] o.a.s.c.SolrCore Created CoreDescriptor: {dataDir=data\, instanceDir=C:\Users\JenkinsSlave\workspace\Lucene-Solr-5.x-Windows\solr\build\solr-core\test\J1\..\..\..\..\..\..\..\..\..\Users\JenkinsSlave\workspace\Lucene-Solr-5.x-Windows\solr\build\solr-core\test\J1\temp\solr.cloud.CollectionsAPIDistributedZkTest_EA6D67E07F66B2B-001\control-001\cores\collection1, coreNodeName=, transient=false, collection=control_collection, config=solrconfig.xml, loadOnStartup=true, configSetProperties=configsetprops.json, name=collection1, absoluteInstDir=C:\Users\JenkinsSlave\workspace\Lucene-Solr-5.x-Windows\solr\build\solr-core\test\J1\..\..\..\..\..\..\..\..\..\Users\JenkinsSlave\workspace\Lucene-Solr-5.x-Windows\solr\build\solr-core\test\J1\temp\solr.cloud.CollectionsAPIDistributedZkTest_EA6D67E07F66B2B-001\control-001\cores\collection1\, schema=schema.xml, shard=}
[junit4] 2> 1303721 INFO (TEST-CollectionsAPIDistributedZkTest.test-seed#[EA6D67E07F66B2B]) [n:127.0.0.1:61235_ ] o.a.s.c.CoresLocator Found core collection1 in C:\Users\JenkinsSlave\workspace\Lucene-Solr-5.x-Windows\solr\build\solr-core\test\J1\..\..\..\..\..\..\..\..\..\Users\JenkinsSlave\workspace\Lucene-Solr-5.x-Windows\solr\build\solr-core\test\J1\temp\solr.cloud.CollectionsAPIDistributedZkTest_EA6D67E07F66B2B-001\control-001\cores\collection1\
[junit4] 2> 1303721 INFO (TEST-CollectionsAPIDistributedZkTest.test-seed#[EA6D67E07F66B2B]) [n:127.0.0.1:61235_ ] o.a.s.c.CoresLocator Found 1 core definitions
[junit4] 2> 1303722 INFO (TEST-CollectionsAPIDistributedZkTest.test-seed#[EA6D67E07F66B2B]) [n:127.0.0.1:61235_ ] o.a.s.s.SolrDispatchFilter user.dir=C:\Users\JenkinsSlave\workspace\Lucene-Solr-5.x-Windows\solr\build\solr-core\test\J1
[junit4] 2> 1303722 INFO (TEST-CollectionsAPIDistributedZkTest.test-seed#[EA6D67E07F66B2B]) [n:127.0.0.1:61235_ ] o.a.s.s.SolrDispatchFilter SolrDispatchFilter.init() done
[junit4] 2> 1303722 INFO (coreLoadExecutor-4018-thread-1-processing-n:127.0.0.1:61235_) [n:127.0.0.1:61235_ c:control_collection x:collection1] o.a.s.c.ZkController publishing state=down
[junit4] 2> 1303722 INFO (coreLoadExecutor-4018-thread-1-processing-n:127.0.0.1:61235_) [n:127.0.0.1:61235_ c:control_collection x:collection1] o.a.s.c.ZkController numShards not found on descriptor - reading it from system property
[junit4] 2> 1303724 INFO (OverseerStateUpdate-94712405120450566-127.0.0.1:61235_-n_0000000000) [n:127.0.0.1:61235_ ] o.a.s.c.Overseer processMessage: queueSize: 1, message = {
[junit4] 2> "collection":"control_collection",
[junit4] 2> "shard":null,
[junit4] 2> "operation":"state",
[junit4] 2> "roles":null,
[junit4] 2> "numShards":"1",
[junit4] 2> "core":"collection1",
[junit4] 2> "base_url":"http://127.0.0.1:61235",
[junit4] 2> "state":"down",
[junit4] 2> "node_name":"127.0.0.1:61235_"} current state version: 0
[junit4] 2> 1303724 INFO (coreLoadExecutor-4018-thread-1-processing-n:127.0.0.1:61235_) [n:127.0.0.1:61235_ c:control_collection x:collection1] o.a.s.c.ZkController look for our core node name
[junit4] 2> 1303725 INFO (OverseerStateUpdate-94712405120450566-127.0.0.1:61235_-n_0000000000) [n:127.0.0.1:61235_ ] o.a.s.c.o.ReplicaMutator Update state numShards=1 message={
[junit4] 2> "collection":"control_collection",
[junit4] 2> "shard":null,
[junit4] 2> "operation":"state",
[junit4] 2> "roles":null,
[junit4] 2> "numShards":"1",
[junit4] 2> "core":"collection1",
[junit4] 2> "base_url":"http://127.0.0.1:61235",
[junit4] 2> "state":"down",
[junit4] 2> "node_name":"127.0.0.1:61235_"}
[junit4] 2> 1303725 INFO (OverseerStateUpdate-94712405120450566-127.0.0.1:61235_-n_0000000000) [n:127.0.0.1:61235_ ] o.a.s.c.o.ClusterStateMutator building a new cName: control_collection
[junit4] 2> 1303726 INFO (OverseerStateUpdate-94712405120450566-127.0.0.1:61235_-n_0000000000) [n:127.0.0.1:61235_ ] o.a.s.c.o.ReplicaMutator Assigning new node to shard shard=shard1
[junit4] 2> 1303727 INFO (zkCallback-1079-thread-1-processing-n:127.0.0.1:61235_) [n:127.0.0.1:61235_ ] o.a.s.c.c.ZkStateReader A cluster state change: WatchedEvent state:SyncConnected type:NodeDataChanged path:/clusterstate.json, has occurred - updating... (live nodes size: 1)
[junit4] 2> 1304892 INFO (coreLoadExecutor-4018-thread-1-processing-n:127.0.0.1:61235_) [n:127.0.0.1:61235_ c:control_collection x:collection1] o.a.s.c.ZkController waiting to find shard id in clusterstate for collection1
[junit4] 2> 1304892 INFO (coreLoadExecutor-4018-thread-1-processing-n:127.0.0.1:61235_) [n:127.0.0.1:61235_ c:control_collection x:collection1] o.a.s.c.ZkController Check for collection zkNode:control_collection
[junit4] 2> 1304899 INFO (coreLoadExecutor-4018-thread-1-processing-n:127.0.0.1:61235_) [n:127.0.0.1:61235_ c:control_collection x:collection1] o.a.s.c.ZkController Collection zkNode exists
[junit4] 2> 1304899 INFO (coreLoadExecutor-4018-thread-1-processing-n:127.0.0.1:61235_) [n:127.0.0.1:61235_ c:control_collection x:collection1] o.a.s.c.c.ZkStateReader Load collection config from:/collections/control_collection
[junit4] 2> 1304904 INFO (coreLoadExecutor-4018-thread-1-processing-n:127.0.0.1:61235_) [n:127.0.0.1:61235_ c:control_collection x:collection1] o.a.s.c.c.ZkStateReader path=/collections/control_collection configName=conf1 specified config exists in ZooKeeper
[junit4] 2> 1304904 INFO (coreLoadExecutor-4018-thread-1-processing-n:127.0.0.1:61235_) [n:127.0.0.1:61235_ c:control_collection x:collection1] o.a.s.c.SolrResourceLoader new SolrResourceLoader for directory: 'C:\Users\JenkinsSlave\workspace\Lucene-Solr-5.x-Windows\solr\build\solr-core\test\J1\..\..\..\..\..\..\..\..\..\Users\JenkinsSlave\workspace\Lucene-Solr-5.x-Windows\solr\build\solr-core\test\J1\temp\solr.cloud.CollectionsAPIDistributedZkTest_EA6D67E07F66B2B-001\control-001\cores\collection1\'
[junit4] 2> 1304904 INFO (coreLoadExecutor-4018-thread-1-processing-n:127.0.0.1:61235_) [n:127.0.0.1:61235_ c:control_collection x:collection1] o.a.s.c.SolrResourceLoader JNDI not configured for solr (NoInitialContextEx)
[junit4] 2> 1304904 INFO (coreLoadExecutor-4018-thread-1-processing-n:127.0.0.1:61235_) [n:127.0.0.1:61235_ c:control_collection x:collection1] o.a.s.c.SolrResourceLoader solr home defaulted to 'solr/' (could not find system property or JNDI)
[junit4] 2> 1304923 INFO (coreLoadExecutor-4018-thread-1-processing-n:127.0.0.1:61235_) [n:127.0.0.1:61235_ c:control_collection x:collection1] o.a.s.c.Config loaded config solrconfig.xml with version 0
[junit4] 2> 1305037 INFO (coreLoadExecutor-4018-thread-1-processing-n:127.0.0.1:61235_) [n:127.0.0.1:61235_ c:control_collection x:collection1] o.a.s.c.SolrConfig current version of requestparams : -1
[junit4] 2> 1305077 INFO (coreLoadExecutor-4018-thread-1-processing-n:127.0.0.1:61235_) [n:127.0.0.1:61235_ c:control_collection x:collection1] o.a.s.c.SolrConfig Using Lucene MatchVersion: 5.4.0
[junit4] 2> 1305114 INFO (coreLoadExecutor-4018-thread-1-processing-n:127.0.0.1:61235_) [n:127.0.0.1:61235_ c:control_collection x:collection1] o.a.s.c.Config Loaded SolrConfig: solrconfig.xml
[junit4] 2> 1305134 INFO (coreLoadExecutor-4018-thread-1-processing-n:127.0.0.1:61235_) [n:127.0.0.1:61235_ c:control_collection x:collection1] o.a.s.s.IndexSchema Reading Solr Schema from /configs/conf1/schema.xml
[junit4] 2> 1305146 INFO (coreLoadExecutor-4018-thread-1-processing-n:127.0.0.1:61235_) [n:127.0.0.1:61235_ c:control_collection x:collection1] o.a.s.s.IndexSchema [collection1] Schema name=test
[junit4] 2> 1306026 INFO (coreLoadExecutor-4018-thread-1-processing-n:127.0.0.1:61235_) [n:127.0.0.1:61235_ c:control_collection x:collection1] o.a.s.s.OpenExchangeRatesOrgProvider Initialized with rates=open-exchange-rates.json, refreshInterval=1440.
[junit4] 2> 1306115 INFO (coreLoadExecutor-4018-thread-1-processing-n:127.0.0.1:61235_) [n:127.0.0.1:61235_ c:control_collection x:collection1] o.a.s.s.IndexSchema default search field in schema is text
[junit4] 2> 1306117 INFO (coreLoadExecutor-4018-thread-1-processing-n:127.0.0.1:61235_) [n:127.0.0.1:61235_ c:control_collection x:collection1] o.a.s.s.IndexSchema unique key field: id
[junit4] 2> 1306408 INFO (coreLoadExecutor-4018-thread-1-processing-n:127.0.0.1:61235_) [n:127.0.0.1:61235_ c:control_collection x:collection1] o.a.s.s.FileExchangeRateProvider Reloading exchange rates from file currency.xml
[junit4] 2> 1306441 INFO (coreLoadExecutor-4018-thread-1-processing-n:127.0.0.1:61235_) [n:127.0.0.1:61235_ c:control_collection x:collection1] o.a.s.s.FileExchangeRateProvider Reloading exchange rates from file currency.xml
[junit4] 2> 1306444 INFO (coreLoadExecutor-4018-thread-1-processing-n:127.0.0.1:61235_) [n:127.0.0.1:61235_ c:control_collection x:collection1] o.a.s.s.OpenExchangeRatesOrgProvider Reloading exchange rates from open-exchange-rates.json
[junit4] 2> 1306551 WARN (coreLoadExecutor-4018-thread-1-processing-n:127.0.0.1:61235_) [n:127.0.0.1:61235_ c:control_collection x:collection1] o.a.s.s.OpenExchangeRatesOrgProvider Unknown key IMPORTANT NOTE
[junit4] 2> 1306551 WARN (coreLoadExecutor-4018-thread-1-processing-n:127.0.0.1:61235_) [n:127.0.0.1:61235_ c:control_collection x:collection1] o.a.s.s.OpenExchangeRatesOrgProvider Expected key, got STRING
[junit4] 2> 1306551 INFO (coreLoadExecutor-4018-thread-1-processing-n:127.0.0.1:61235_) [n:127.0.0.1:61235_ c:control_collection x:collection1] o.a.s.s.OpenExchangeRatesOrgProvider Reloading exchange rates from open-exchange-rates.json
[junit4] 2> 1306552 WARN (coreLoadExecutor-4018-thread-1-processing-n:127.0.0.1:61235_) [n:127.0.0.1:61235_ c:control_collection x:collection1] o.a.s.s.OpenExchangeRatesOrgProvider Unknown key IMPORTANT NOTE
[junit4] 2> 1306552 WARN (coreLoadExecutor-4018-thread-1-processing-n:127.0.0.1:61235_) [n:127.0.0.1:61235_ c:control_collection x:collection1] o.a.s.s.OpenExchangeRatesOrgProvider Expected key, got STRING
[junit4] 2> 1306635 INFO (coreLoadExecutor-4018-thread-1-processing-n:127.0.0.1:61235_) [n:127.0.0.1:61235_ c:control_collection x:collection1] o.a.s.c.ConfigSetProperties Did not find ConfigSet properties, assuming default properties: Can't find resource 'configsetprops.json' in classpath or '/configs/conf1', cwd=C:\Users\JenkinsSlave\workspace\Lucene-Solr-5.x-Windows\solr\build\solr-core\test\J1
[junit4] 2> 1306635 INFO (coreLoadExecutor-4018-thread-1-processing-n:127.0.0.1:61235_) [n:127.0.0.1:61235_ c:control_collection x:collection1] o.a.s.c.CoreContainer Creating SolrCore 'collection1' using configuration from collection control_collection
[junit4] 2> 1306636 INFO (coreLoadExecutor-4018-thread-1-processing-n:127.0.0.1:61235_) [n:127.0.0.1:61235_ c:control_collection s:shard1 r:core_node1 x:collection1] o.a.s.c.SolrCore org.apache.solr.core.MockDirectoryFactory
[junit4] 2> 1306636 INFO (coreLoadExecutor-4018-thread-1-processing-n:127.0.0.1:61235_) [n:127.0.0.1:61235_ c:control_collection s:shard1 r:core_node1 x:collection1] o.a.s.c.SolrCore [[collection1] ] Opening new SolrCore at [C:\Users\JenkinsSlave\workspace\Lucene-Solr-5.x-Windows\solr\build\solr-core\test\J1\..\..\..\..\..\..\..\..\..\Users\JenkinsSlave\workspace\Lucene-Solr-5.x-Windows\solr\build\solr-core\test\J1\temp\solr.cloud.CollectionsAPIDistributedZkTest_EA6D67E07F66B2B-001\control-001\cores\collection1\], dataDir=[null]
[junit4] 2> 1306636 INFO (coreLoadExecutor-4018-thread-1-processing-n:127.0.0.1:61235_) [n:127.0.0.1:61235_ c:control_collection s:shard1 r:core_node1 x:collection1] o.a.s.c.JmxMonitoredMap JMX monitoring is enabled. Adding Solr mbeans to JMX Server: com.sun.jmx.mbeanserver.JmxMBeanServer@1b3815e
[junit4] 2> 1306636 INFO (coreLoadExecutor-4018-thread-1-processing-n:127.0.0.1:61235_) [n:127.0.0.1:61235_ c:control_collection s:shard1 r:core_node1 x:collection1] o.a.s.c.CachingDirectoryFactory return new directory for C:\Users\JenkinsSlave\workspace\Lucene-Solr-5.x-Windows\solr\build\solr-core\test\J1\..\..\..\..\..\..\..\..\..\Users\JenkinsSlave\workspace\Lucene-Solr-5.x-Windows\solr\build\solr-core\test\J1\temp\solr.cloud.CollectionsAPIDistributedZkTest_EA6D67E07F66B2B-001\control-001\cores\collection1\data\
[junit4] 2> 1306665 INFO (coreLoadExecutor-4018-thread-1-processing-n:127.0.0.1:61235_) [n:127.0.0.1:61235_ c:control_collection s:shard1 r:core_node1 x:collection1] o.a.s.c.SolrCore New index directory detected: old=null new=C:\Users\JenkinsSlave\workspace\Lucene-Solr-5.x-Windows\solr\build\solr-core\test\J1\..\..\..\..\..\..\..\..\..\Users\JenkinsSlave\workspace\Lucene-Solr-5.x-Windows\solr\build\solr-core\test\J1\temp\solr.cloud.CollectionsAPIDistributedZkTest_EA6D67E07F66B2B-001\control-001\cores\collection1\data\index/
[junit4] 2> 1306665 WARN (coreLoadExecutor-4018-thread-1-processing-n:127.0.0.1:61235_) [n:127.0.0.1:61235_ c:control_collection s:shard1 r:core_node1 x:collection1] o.a.s.c.SolrCore [collection1] Solr index directory 'C:\Users\JenkinsSlave\workspace\Lucene-Solr-5.x-Windows\solr\build\solr-core\test\J1\..\..\..\..\..\..\..\..\..\Users\JenkinsSlave\workspace\Lucene-Solr-5.x-Windows\solr\build\solr-core\test\J1\temp\solr.cloud.CollectionsAPIDistributedZkTest_EA6D67E07F66B2B-001\control-001\cores\collection1\data\index' doesn't exist. Creating new index...
[junit4] 2> 1306665 INFO (coreLoadExecutor-4018-thread-1-processing-n:127.0.0.1:61235_) [n:127.0.0.1:61235_ c:control_collection s:shard1 r:core_node1 x:collection1] o.a.s.c.CachingDirectoryFactory return new directory for C:\Users\JenkinsSlave\workspace\Lucene-Solr-5.x-Windows\solr\build\solr-core\test\J1\..\..\..\..\..\..\..\..\..\Users\JenkinsSlave\workspace\Lucene-Solr-5.x-Windows\solr\build\solr-core\test\J1\temp\solr.cloud.CollectionsAPIDistributedZkTest_EA6D67E07F66B2B-001\control-001\cores\collection1\data\index
[junit4] 2> 1306665 INFO (coreLoadExecutor-4018-thread-1-processing-n:127.0.0.1:61235_) [n:127.0.0.1:61235_ c:control_collection s:shard1 r:core_node1 x:collection1] o.a.s.u.RandomMergePolicy RandomMergePolicy wrapping class org.apache.lucene.index.TieredMergePolicy: [TieredMergePolicy: maxMergeAtOnce=27, maxMergeAtOnceExplicit=24, maxMergedSegmentMB=89.0146484375, floorSegmentMB=1.77734375, forceMergeDeletesPctAllowed=27.47784564752583, segmentsPerTier=20.0, maxCFSSegmentSizeMB=8.796093022207999E12, noCFSRatio=1.0
[junit4] 2> 1306666 INFO (coreLoadExecutor-4018-thread-1-processing-n:127.0.0.1:61235_) [n:127.0.0.1:61235_ c:control_collection s:shard1 r:core_node1 x:collection1] o.a.s.c.SolrCore SolrDeletionPolicy.onCommit: commits: num=1
[junit4] 2> commit{dir=MockDirectoryWrapper(RAMDirectory@275985 lockFactory=org.apache.lucene.store.SingleInstanceLockFactory@1665e21),segFN=segments_1,generation=1}
[junit4] 2> 1306666 INFO (coreLoadExecutor-4018-thread-1-processing-n:127.0.0.1:61235_) [n:127.0.0.1:61235_ c:control_collection s:shard1 r:core_node1 x:collection1] o.a.s.c.SolrCore newest commit generation = 1
[junit4] 2> 1306668 INFO (OldIndexDirectoryCleanupThreadForCore-collection1) [n:127.0.0.1:61235_ c:control_collection s:shard1 r:core_node1 x:collection1] o.a.s.c.SolrCore Looking for old index directories to cleanup for core collection1 in C:\Users\JenkinsSlave\workspace\Lucene-Solr-5.x-Windows\solr\build\solr-core\test\J1\..\..\..\..\..\..\..\..\..\Users\JenkinsSlave\workspace\Lucene-Solr-5.x-Windows\solr\build\solr-core\test\J1\temp\solr.cloud.CollectionsAPIDistributedZkTest_EA6D67E07F66B2B-001\control-001\cores\collection1\data\
[junit4] 2> 1306668 WARN (OldIndexDirectoryCleanupThreadForCore-collection1) [n:127.0.0.1:61235_ c:control_collection s:shard1 r:core_node1 x:collection1] o.a.s.c.DirectoryFactory C:\Users\JenkinsSlave\workspace\Lucene-Solr-5.x-Windows\solr\build\solr-core\test\J1\..\..\..\..\..\..\..\..\..\Users\JenkinsSlave\workspace\Lucene-Solr-5.x-Windows\solr\build\solr-core\test\J1\temp\solr.cloud.CollectionsAPIDistributedZkTest_EA6D67E07F66B2B-001\control-001\cores\collection1\data\ does not point to a valid data directory; skipping clean-up of old index directories.
[junit4] 2> 1306670 INFO (coreLoadExecutor-4018-thread-1-processing-n:127.0.0.1:61235_) [n:127.0.0.1:61235_ c:control_collection s:shard1 r:core_node1 x:collection1] o.a.s.u.p.UpdateRequestProcessorChain creating updateRequestProcessorChain "nodistrib"
[junit4] 2> 1306670 INFO (coreLoadExecutor-4018-thread-1-processing-n:127.0.0.1:61235_) [n:127.0.0.1:61235_ c:control_collection s:shard1 r:core_node1 x:collection1] o.a.s.u.p.UpdateRequestProcessorChain creating updateRequestProcessorChain "dedupe"
[junit4] 2> 1306670 INFO (coreLoadExecutor-4018-thread-1-processing-n:127.0.0.1:61235_) [n:127.0.0.1:61235_ c:control_collection s:shard1 r:core_node1 x:collection1] o.a.s.u.p.UpdateRequestProcessorChain inserting DistributedUpdateProcessorFactory into updateRequestProcessorChain "dedupe"
[junit4] 2> 1306670 INFO (coreLoadExecutor-4018-thread-1-processing-n:127.0.0.1:61235_) [n:127.0.0.1:61235_ c:control_collection s:shard1 r:core_node1 x:collection1] o.a.s.u.p.UpdateRequestProcessorChain creating updateRequestProcessorChain "stored_sig"
[junit4] 2> 1306670 INFO (coreLoadExecutor-4018-thread-1-processing-n:127.0.0.1:61235_) [n:127.0.0.1:61235_ c:control_collection s:shard1 r:core_node1 x:collection1] o.a.s.u.p.UpdateRequestProcessorChain inserting DistributedUpdateProcessorFactory into updateRequestProcessorChain "stored_sig"
[junit4] 2> 1306670 INFO (coreLoadExecutor-4018-thread-1-processing-n:127.0.0.1:61235_) [n:127.0.0.1:61235_ c:control_collection s:shard1 r:core_node1 x:collection1] o.a.s.u.p.UpdateRequestProcessorChain creating updateRequestProcessorChain "distrib-dup-test-chain-explicit"
[junit4] 2> 1306670 INFO (coreLoadExecutor-4018-thread-1-processing-n:127.0.0.1:61235_) [n:127.0.0.1:61235_ c:control_collection s:shard1 r:core_node1 x:collection1] o.a.s.u.p.UpdateRequestProcessorChain creating updateRequestProcessorChain "distrib-dup-test-chain-implicit"
[junit4] 2> 1306672 INFO (coreLoadExecutor-4018-thread-1-processing-n:127.0.0.1:61235_) [n:127.0.0.1:61235_ c:control_collection s:shard1 r:core_node1 x:collection1] o.a.s.u.p.UpdateRequestProcessorChain inserting DistributedUpdateProcessorFactory into updateRequestProcessorChain "distrib-dup-test-chain-implicit"
[junit4] 2> 1306672 INFO (coreLoadExecutor-4018-thread-1-processing-n:127.0.0.1:61235_) [n:127.0.0.1:61235_ c:control_collection s:shard1 r:core_node1 x:collection1] o.a.s.c.SolrCore no updateRequestProcessorChain defined as default, creating implicit default
[junit4] 2> 1306775 INFO (coreLoadExecutor-4018-thread-1-processing-n:127.0.0.1:61235_) [n:127.0.0.1:61235_ c:control_collection s:shard1 r:core_node1 x:collection1] o.a.s.h.l.XMLLoader xsltCacheLifetimeSeconds=60
[junit4] 2> 1306777 INFO (coreLoadExecutor-4018-thread-1-processing-n:127.0.0.1:61235_) [n:127.0.0.1:61235_ c:control_collection s:shard1 r:core_node1 x:collection1] o.a.s.h.l.XMLLoader xsltCacheLifetimeSeconds=60
[junit4] 2> 1306779 INFO (coreLoadExecutor-4018-thread-1-processing-n:127.0.0.1:61235_) [n:127.0.0.1:61235_ c:control_collection s:shard1 r:core_node1 x:collection1] o.a.s.h.l.XMLLoader xsltCacheLifetimeSeconds=60
[junit4] 2> 1306780 INFO (coreLoadExecutor-4018-thread-1-processing-n:127.0.0.1:61235_) [n:127.0.0.1:61235_ c:control_collection s:shard1 r:core_node1 x:collection1] o.a.s.h.l.XMLLoader xsltCacheLifetimeSeconds=60
[junit4] 2> 1306803 INFO (coreLoadExecutor-4018-thread-1-processing-n:127.0.0.1:61235_) [n:127.0.0.1:61235_ c:control_collection s:shard1 r:core_node1 x:collection1] o.a.s.c.RequestHandlers Registered paths: /admin/file,standard,/admin/segments,/admin/logging,/admin/properties,/update/json/docs,/admin/mbeans,/admin/luke,/get,/schema,/update,/admin/system,/admin/plugins,/replication,/admin/threads,/config,/admin/ping,/update/json,/update/csv
[junit4] 2> 1306806 INFO (coreLoadExecutor-4018-thread-1-processing-n:127.0.0.1:61235_) [n:127.0.0.1:61235_ c:control_collection s:shard1 r:core_node1 x:collection1] o.a.s.c.SolrCore Using default statsCache cache: org.apache.solr.search.stats.LocalStatsCache
[junit4] 2> 1306807 INFO (coreLoadExecutor-4018-thread-1-processing-n:127.0.0.1:61235_) [n:127.0.0.1:61235_ c:control_collection s:shard1 r:core_node1 x:collection1] o.a.s.u.UpdateHandler Using UpdateLog implementation: org.apache.solr.update.UpdateLog
[junit4] 2> 1306807 INFO (coreLoadExecutor-4018-thread-1-processing-n:127.0.0.1:61235_) [n:127.0.0.1:61235_ c:control_collection s:shard1 r:core_node1 x:collection1] o.a.s.u.UpdateLog Initializing UpdateLog: dataDir= defaultSyncLevel=FLUSH numRecordsToKeep=100 maxNumLogsToKeep=10 numVersionBuckets=65536
[junit4] 2> 1306808 INFO (coreLoadExecutor-4018-thread-1-processing-n:127.0.0.1:61235_) [n:127.0.0.1:61235_ c:control_collection s:shard1 r:core_node1 x:collection1] o.a.s.c.SolrCore Hard AutoCommit: disabled
[junit4] 2> 1306808 INFO (coreLoadExecutor-4018-thread-1-processing-n:127.0.0.1:61235_) [n:127.0.0.1:61235_ c:control_collection s:shard1 r:core_node1 x:collection1] o.a.s.c.SolrCore Soft AutoCommit: disabled
[junit4] 2> 1306809 INFO (coreLoadExecutor-4018-thread-1-processing-n:127.0.0.1:61235_) [n:127.0.0.1:61235_ c:control_collection s:shard1 r:core_node1 x:collection1] o.a.s.u.RandomMergePolicy RandomMergePolicy wrapping class org.apache.lucene.index.LogDocMergePolicy: [LogDocMergePolicy: minMergeSize=1000, mergeFactor=40, maxMergeSize=9223372036854775807, maxMergeSizeForForcedMerge=9223372036854775807, calibrateSizeByDeletes=false, maxMergeDocs=2147483647, maxCFSSegmentSizeMB=8.796093022207999E12, noCFSRatio=0.0]
[junit4] 2> 1306809 INFO (coreLoadExecutor-4018-thread-1-processing-n:127.0.0.1:61235_) [n:127.0.0.1:61235_ c:control_collection s:shard1 r:core_node1 x:collection1] o.a.s.c.SolrCore SolrDeletionPolicy.onInit: commits: num=1
[junit4] 2> commit{dir=MockDirectoryWrapper(RAMDirectory@275985 lockFactory=org.apache.lucene.store.SingleInstanceLockFactory@1665e21),segFN=segments_1,generation=1}
[junit4] 2> 1306809 INFO (coreLoadExecutor-4018-thread-1-processing-n:127.0.0.1:61235_) [n:127.0.0.1:61235_ c:control_collection s:shard1 r:core_node1 x:collection1] o.a.s.c.SolrCore newest commit generation = 1
[junit4] 2> 1306809 INFO (coreLoadExecutor-4018-thread-1-processing-n:127.0.0.1:61235_) [n:127.0.0.1:61235_ c:control_collection s:shard1 r:core_node1 x:collection1] o.a.s.s.SolrIndexSearcher Opening Searcher@4f670d[collection1] main
[junit4] 2> 1306809 INFO (coreLoadExecutor-4018-thread-1-processing-n:127.0.0.1:61235_) [n:127.0.0.1:61235_ c:control_collection s:shard1 r:core_node1 x:collection1] o.a.s.c.c.ZkStateReader Load collection config from:/collections/control_collection
[junit4] 2> 1306818 INFO (coreLoadExecutor-4018-thread-1-processing-n:127.0.0.1:61235_) [n:127.0.0.1:61235_ c:control_collection s:shard1 r:core_node1 x:collection1] o.a.s.c.c.ZkStateReader path=/collections/control_collection configName=conf1 specified config exists in ZooKeeper
[junit4] 2> 1306818 INFO (coreLoadExecutor-4018-thread-1-processing-n:127.0.0.1:61235_) [n:127.0.0.1:61235_ c:control_collection s:shard1 r:core_node1 x:collection1] o.a.s.r.ManagedResourceStorage Setting up ZooKeeper-based storage for the RestManager with znodeBase: /configs/conf1
[junit4] 2> 1306823 INFO (coreLoadExecutor-4018-thread-1-processing-n:127.0.0.1:61235_) [n:127.0.0.1:61235_ c:control_collection s:shard1 r:core_node1 x:collection1] o.a.s.r.ManagedResourceStorage Configured ZooKeeperStorageIO with znodeBase: /configs/conf1
[junit4] 2> 1306823 INFO (coreLoadExecutor-4018-thread-1-processing-n:127.0.0.1:61235_) [n:127.0.0.1:61235_ c:control_collection s:shard1 r:core_node1 x:collection1] o.a.s.r.RestManager Initializing RestManager with initArgs: {}
[junit4] 2> 1306823 INFO (coreLoadExecutor-4018-thread-1-processing-n:127.0.0.1:61235_) [n:127.0.0.1:61235_ c:control_collection s:shard1 r:core_node1 x:collection1] o.a.s.r.ManagedResourceStorage Reading _rest_managed.json using ZooKeeperStorageIO:path=/configs/conf1
[junit4] 2> 1306829 INFO (coreLoadExecutor-4018-thread-1-processing-n:127.0.0.1:61235_) [n:127.0.0.1:61235_ c:control_collection s:shard1 r:core_node1 x:collection1] o.a.s.r.ManagedResourceStorage No data found for znode /configs/conf1/_rest_managed.json
[junit4] 2> 1306829 INFO (coreLoadExecutor-4018-thread-1-processing-n:127.0.0.1:61235_) [n:127.0.0.1:61235_ c:control_collection s:shard1 r:core_node1 x:collection1] o.a.s.r.ManagedResourceStorage Loaded null at path _rest_managed.json using ZooKeeperStorageIO:path=/configs/conf1
[junit4] 2> 1306829 INFO (coreLoadExecutor-4018-thread-1-processing-n:127.0.0.1:61235_) [n:127.0.0.1:61235_ c:control_collection s:shard1 r:core_node1 x:collection1] o.a.s.r.RestManager Initializing 0 registered ManagedResources
[junit4] 2> 1306829 INFO (coreLoadExecutor-4018-thread-1-processing-n:127.0.0.1:61235_) [n:127.0.0.1:61235_ c:control_collection s:shard1 r:core_node1 x:collection1] o.a.s.h.ReplicationHandler Commits will be reserved for 10000
[junit4] 2> 1306830 INFO (searcherExecutor-4019-thread-1-processing-c:control_collection s:shard1 x:collection1 r:core_node1 n:127.0.0.1:61235_) [n:127.0.0.1:61235_ c:control_collection s:shard1 r:core_node1 x:collection1] o.a.s.c.SolrCore [collection1] Registered new searcher Searcher@4f670d[collection1] main{ExitableDirectoryReader(UninvertingDirectoryReader())}
[junit4] 2> 1306830 INFO (coreLoadExecutor-4018-thread-1-processing-n:127.0.0.1:61235_) [n:127.0.0.1:61235_ c:control_collection s:shard1 r:core_node1 x:collection1] o.a.s.u.UpdateLog Looking up max value of version field to seed version buckets
[junit4] 2> 1306830 INFO (coreLoadExecutor-4018-thread-1-processing-n:127.0.0.1:61235_) [n:127.0.0.1:61235_ c:control_collection s:shard1 r:core_node1 x:collection1] o.a.s.u.VersionInfo Refreshing highest value of _version_ for 65536 version buckets from index
[junit4] 2> 1306830 INFO (coreLoadExecutor-4018-thread-1-processing-n:127.0.0.1:61235_) [n:127.0.0.1:61235_ c:control_collection s:shard1 r:core_node1 x:collection1] o.a.s.u.VersionInfo No terms found for _version_, cannot seed version bucket highest value from index
[junit4] 2> 1306830 INFO (coreLoadExecutor-4018-thread-1-processing-n:127.0.0.1:61235_) [n:127.0.0.1:61235_ c:control_collection s:shard1 r:core_node1 x:collection1] o.a.s.u.UpdateLog Could not find max version in index or recent updates, using new clock 1515398488978882560
[junit4] 2> 1306832 INFO (coreLoadExecutor-4018-thread-1-processing-n:127.0.0.1:61235_) [n:127.0.0.1:61235_ c:control_collection s:shard1 r:core_node1 x:collection1] o.a.s.u.UpdateLog Took 2.0ms to seed version buckets with highest version 1515398488978882560
[junit4] 2> 1306832 INFO (coreLoadExecutor-4018-thread-1-processing-n:127.0.0.1:61235_) [n:127.0.0.1:61235_ c:control_collection s:shard1 r:core_node1 x:collection1] o.a.s.c.ZkController watch zkdir /configs/conf1
[junit4] 2> 1306838 INFO (coreLoadExecutor-4018-thread-1-processing-n:127.0.0.1:61235_) [n:127.0.0.1:61235_ c:control_collection s:shard1 r:core_node1 x:collection1] o.a.s.c.CoreContainer registering core: collection1
[junit4] 2> 1306840 INFO (coreZkRegister-4012-thread-1-processing-c:control_collection s:shard1 x:collection1 r:core_node1 n:127.0.0.1:61235_) [n:127.0.0.1:61235_ c:control_collection s:shard1 r:core_node1 x:collection1] o.a.s.c.ZkController Register replica - core:collection1 address:http://127.0.0.1:61235 collection:control_collection shard:shard1
[junit4] 2> 1306843 INFO (coreZkRegister-4012-thread-1-processing-c:control_collection s:shard1 x:collection1 r:core_node1 n:127.0.0.1:61235_) [n:127.0.0.1:61235_ c:control_collection s:shard1 r:core_node1 x:collection1] o.a.s.c.c.SolrZkClient makePath: /collections/control_collection/leader_elect/shard1/election
[junit4] 2> 1306846 INFO (coreZkRegister-4012-thread-1-processing-c:control_collection s:shard1 x:collection1 r:core_node1 n:127.0.0.1:61235_) [n:127.0.0.1:61235_ c:control_collection s:shard1 r:core_node1 x:collection1] o.a.s.c.LeaderElector Joined leadership election with path: /collections/control_collection/leader_elect/shard1/election/94712405120450566-core_node1-n_0000000000
[junit4] 2> 1306847 INFO (coreZkRegister-4012-thread-1-processing-c:control_collection s:shard1 x:collection1 r:core_node1 n:127.0.0.1:61235_) [n:127.0.0.1:61235_ c:control_collection s:shard1 r:core_node1 x:collection1] o.a.s.c.ShardLeaderElectionContext Running the leader process for shard shard1
[junit4] 2> 1306850 INFO (coreZkRegister-4012-thread-1-processing-c:control_collection s:shard1 x:collection1 r:core_node1 n:127.0.0.1:61235_) [n:127.0.0.1:61235_ c:control_collection s:shard1 r:core_node1 x:collection1] o.a.s.c.ShardLeaderElectionContext Enough replicas found to continue.
[junit4] 2> 1306850 INFO (coreZkRegister-4012-thread-1-processing-c:control_collection s:shard1 x:collection1 r:core_node1 n:127.0.0.1:61235_) [n:127.0.0.1:61235_ c:control_collection s:shard1 r:core_node1 x:collection1] o.a.s.c.ShardLeaderElectionContext I may be the new leader - try and sync
[junit4] 2> 1306850 INFO (coreZkRegister-4012-thread-1-processing-c:control_collection s:shard1 x:collection1 r:core_node1 n:127.0.0.1:61235_) [n:127.0.0.1:61235_ c:control_collection s:shard1 r:core_node1 x:collection1] o.a.s.c.SyncStrategy Sync replicas to http://127.0.0.1:61235/collection1/
[junit4] 2> 1306850 INFO (coreZkRegister-4012-thread-1-processing-c:control_collection s:shard1 x:collection1 r:core_node1 n:127.0.0.1:61235_) [n:127.0.0.1:61235_ c:control_collection s:shard1 r:core_node1 x:collection1] o.a.s.c.SyncStrategy Sync Success - now sync replicas to me
[junit4] 2> 1306850 INFO (coreZkRegister-4012-thread-1-processing-c:control_collection s:shard1 x:collection1 r:core_node1 n:127.0.0.1:61235_) [n:127.0.0.1:61235_ c:control_collection s:shard1 r:core_node1 x:collection1] o.a.s.c.SyncStrategy http://127.0.0.1:61235/collection1/ has no replicas
[junit4] 2> 1306850 INFO (coreZkRegister-4012-thread-1-processing-c:control_collection s:shard1 x:collection1 r:core_node1 n:127.0.0.1:61235_) [n:127.0.0.1:61235_ c:control_collection s:shard1 r:core_node1 x:collection1] o.a.s.c.ShardLeaderElectionContext I am the new leader: http://127.0.0.1:61235/collection1/ shard1
[junit4] 2> 1306850 INFO (OverseerStateUpdate-94712405120450566-127.0.0.1:61235_-n_0000000000) [n:127.0.0.1:61235_ ] o.a.s.c.Overseer processMessage: queueSize: 1, message = {
[junit4] 2> "operation":"leader",
[junit4] 2> "shard":"shard1",
[junit4] 2> "collection":"control_collection"} current state version: 1
[junit4] 2> 1306850 INFO (coreZkRegister-4012-thread-1-processing-c:control_collection s:shard1 x:collection1 r:core_node1 n:127.0.0.1:61235_) [n:127.0.0.1:61235_ c:control_collection s:shard1 r:core_node1 x:collection1] o.a.s.c.c.SolrZkClient makePath: /collections/control_collection/leaders/shard1
[junit4] 2> 1306852 INFO (zkCallback-1079-thread-1-processing-n:127.0.0.1:61235_) [n:127.0.0.1:61235_ ] o.a.s.c.c.ZkStateReader A cluster state change: WatchedEvent state:SyncConnected type:NodeDataChanged path:/clusterstate.json, has occurred - updating... (live nodes size: 1)
[junit4] 2> 1306855 INFO (coreZkRegister-4012-thread-1-processing-c:control_collection s:shard1 x:collection1 r:core_node1 n:127.0.0.1:61235_) [n:127.0.0.1:61235_ c:control_collection s:shard1 r:core_node1 x:collection1] o.a.s.c.ShardLeaderElectionContextBase Creating leader registration node
[junit4] 2> 1306857 INFO (OverseerStateUpdate-94712405120450566-127.0.0.1:61235_-n_0000000000) [n:127.0.0.1:61235_ ] o.a.s.c.Overseer processMessage: queueSize: 1, message = {
[junit4] 2> "operation":"leader",
[junit4] 2> "shard":"shard1",
[junit4] 2> "collection":"control_collection",
[junit4] 2> "base_url":"http://127.0.0.1:61235",
[junit4] 2> "core":"collection1",
[junit4] 2> "state":"active"} current state version: 2
[junit4] 2> 1306979 INFO (zkCallback-1079-thread-1-processing-n:127.0.0.1:61235_) [n:127.0.0.1:61235_ ] o.a.s.c.c.ZkStateReader A cluster state change: WatchedEvent state:SyncConnected type:NodeDataChanged path:/clusterstate.json, has occurred - updating... (live nodes size: 1)
[junit4] 2> 1306991 INFO (coreZkRegister-4012-thread-1-processing-c:control_collection s:shard1 x:collection1 r:core_node1 n:127.0.0.1:61235_) [n:127.0.0.1:61235_ c:control_collection s:shard1 r:core_node1 x:collection1] o.a.s.c.ZkController We are http://127.0.0.1:61235/collection1/ and leader is http://127.0.0.1:61235/collection1/
[junit4] 2> 1306991 INFO (coreZkRegister-4012-thread-1-processing-c:control_collection s:shard1 x:collection1 r:core_node1 n:127.0.0.1:61235_) [n:127.0.0.1:61235_ c:control_collection s:shard1 r:core_node1 x:collection1] o.a.s.c.ZkController No LogReplay needed for core=collection1 baseURL=http://127.0.0.1:61235
[junit4] 2> 1306991 INFO (coreZkRegister-4012-thread-1-processing-c:control_collection s:shard1 x:collection1 r:core_node1 n:127.0.0.1:61235_) [n:127.0.0.1:61235_ c:control_collection s:shard1 r:core_node1 x:collection1] o.a.s.c.ZkController I am the leader, no recovery necessary
[junit4] 2> 1306991 INFO (coreZkRegister-4012-thread-1-processing-c:control_collection s:shard1 x:collection1 r:core_node1 n:127.0.0.1:61235_) [n:127.0.0.1:61235_ c:control_collection s:shard1 r:core_node1 x:collection1] o.a.s.c.ZkController publishing state=active
[junit4] 2> 1306991 INFO (coreZkRegister-4012-thread-1-processing-c:control_collection s:shard1 x:collection1 r:core_node1 n:127.0.0.1:61235_) [n:127.0.0.1:61235_ c:control_collection s:shard1 r:core_node1 x:collection1] o.a.s.c.ZkController numShards not found on descriptor - reading it from system property
[junit4] 2> 1307078 INFO (OverseerStateUpdate-94712405120450566-127.0.0.1:61235_-n_0000000000) [n:127.0.0.1:61235_ ] o.a.s.c.Overseer processMessage: queueSize: 1, message = {
[junit4] 2> "collection":"control_collection",
[junit4] 2> "shard":"shard1",
[junit4] 2> "operation":"state",
[junit4] 2> "core_node_name":"core_node1",
[junit4] 2> "roles":null,
[junit4] 2> "numShards":"1",
[junit4] 2> "core":"collection1",
[junit4] 2> "base_url":"http://127.0.0.1:61235",
[junit4] 2> "state":"active",
[junit4] 2> "node_name":"127.0.0.1:61235_"} current state version: 3
[junit4] 2> 1307084 INFO (OverseerStateUpdate-94712405120450566-127.0.0.1:61235_-n_0000000000) [n:127.0.0.1:61235_ ] o.a.s.c.o.ReplicaMutator Update state numShards=1 message={
[junit4] 2> "collection":"control_collection",
[junit4] 2> "shard":"shard1",
[junit4] 2> "operation":"state",
[junit4] 2> "core_node_name":"core_node1",
[junit4] 2> "roles":null,
[junit4] 2> "numShards":"1",
[junit4] 2> "core":"collection1",
[junit4] 2> "base_url":"http://127.0.0.1:61235",
[junit4] 2> "state":"active",
[junit4] 2> "node_name":"127.0.0.1:61235_"}
[junit4] 2> 1307186 INFO (TEST-CollectionsAPIDistributedZkTest.test-seed#[EA6D67E07F66B2B]) [ ] o.a.s.c.c.SolrZkClient Using default ZkCredentialsProvider
[junit4] 2> 1307187 INFO (TEST-CollectionsAPIDistributedZkTest.test-seed#[EA6D67E07F66B2B]) [ ] o.a.s.c.c.ConnectionManager Waiting for client to connect to ZooKeeper
[junit4] 2> 1307268 INFO (zkCallback-1081-thread-1) [ ] o.a.s.c.c.ConnectionManager Watcher org.apache.solr.common.cloud.ConnectionManager@64675a name:ZooKeeperConnection Watcher:127.0.0.1:61208/solr got event WatchedEvent state:SyncConnected type:None path:null path:null type:None
[junit4] 2> 1307270 INFO (TEST-CollectionsAPIDistributedZkTest.test-seed#[EA6D67E07F66B2B]) [ ] o.a.s.c.c.ConnectionManager Client is connected to ZooKeeper
[junit4] 2> 1307270 INFO (TEST-CollectionsAPIDistributedZkTest.test-seed#[EA6D67E07F66B2B]) [ ] o.a.s.c.c.SolrZkClient Using default ZkACLProvider
[junit4] 2> 1307270 INFO (TEST-CollectionsAPIDistributedZkTest.test-seed#[EA6D67E07F66B2B]) [ ] o.a.s.c.c.ZkStateReader Updating cluster state from ZooKeeper...
[junit4] 2> 1307288 INFO (TEST-CollectionsAPIDistributedZkTest.test-seed#[EA6D67E07F66B2B]) [ ] o.a.s.c.ChaosMonkey monkey: init - expire sessions:false cause connection loss:false
[junit4] 2> 1307288 INFO (TEST-CollectionsAPIDistributedZkTest.test-seed#[EA6D67E07F66B2B]) [ ] o.a.s.c.AbstractFullDistribZkTestBase Creating collection1 with stateFormat=2
[junit4] 2> 1307288 INFO (TEST-CollectionsAPIDistributedZkTest.test-seed#[EA6D67E07F66B2B]) [ ] o.a.s.c.c.SolrZkClient Using default ZkCredentialsProvider
[junit4] 2> 1307298 INFO (TEST-CollectionsAPIDistributedZkTest.test-seed#[EA6D67E07F66B2B]) [ ] o.a.s.c.c.ConnectionManager Waiting for client to connect to ZooKeeper
[junit4] 2> 1307299 INFO (zkCallback-1079-thread-1-processing-n:127.0.0.1:61235_) [n:127.0.0.1:61235_ ] o.a.s.c.c.ZkStateReader A cluster state change: WatchedEvent state:SyncConnected type:NodeDataChanged path:/clusterstate.json, has occurred - updating... (live nodes size: 1)
[junit4] 2> 1307299 INFO (zkCallback-1081-thread-1) [ ] o.a.s.c.c.ZkStateReader A cluster state change: WatchedEvent state:SyncConnected type:NodeDataChanged path:/clusterstate.json, has occurred - updating... (live nodes size: 1)
[junit4] 2> 1307385 INFO (zkCallback-1082-thread-1) [ ] o.a.s.c.c.ConnectionManager Watcher org.apache.solr.common.cloud.ConnectionManager@777800 name:ZooKeeperConnection Watcher:127.0.0.1:61208/solr got event WatchedEvent state:SyncConnected type:None path:null path:null type:None
[junit4] 2> 1307386 INFO (TEST-CollectionsAPIDistributedZkTest.test-seed#[EA6D67E07F66B2B]) [ ] o.a.s.c.c.ConnectionManager Client is connected to ZooKeeper
[junit4] 2> 1307386 INFO (TEST-CollectionsAPIDistributedZkTest.test-seed#[EA6D67E07F66B2B]) [ ] o.a.s.c.c.SolrZkClient Using default ZkACLProvider
[junit4] 2> 1307393 INFO (OverseerStateUpdate-94712405120450566-127.0.0.1:61235_-n_0000000000) [n:127.0.0.1:61235_ ] o.a.s.c.Overseer processMessage: queueSize: 1, message = {
[junit4] 2> "operation":"create",
[junit4] 2> "name":"collection1",
[junit4] 2> "numShards":"2",
[junit4] 2> "stateFormat":"2"} current state version: 4
[junit4] 2> 1307393 INFO (OverseerStateUpdate-94712405120450566-127.0.0.1:61235_-n_0000000000) [n:127.0.0.1:61235_ ] o.a.s.c.o.ClusterStateMutator building a new cName: collection1
[junit4] 2> 1307612 INFO (OverseerStateUpdate-94712405120450566-127.0.0.1:61235_-n_0000000000) [n:127.0.0.1:61235_ ] o.a.s.c.o.ZkStateWriter going to create_collection /collections/collection1/state.json
[junit4] 2> 1308394 INFO (TEST-CollectionsAPIDistributedZkTest.test-seed#[EA6D67E07F66B2B]) [ ] o.a.s.SolrTestCaseJ4 Writing core.properties file to C:\Users\JenkinsSlave\workspace\Lucene-Solr-5.x-Windows\solr\build\solr-core\test\J1\temp\solr.cloud.CollectionsAPIDistributedZkTest_EA6D67E07F66B2B-001\shard-1-001\cores\collection1
[junit4] 2> 1308396 INFO (TEST-CollectionsAPIDistributedZkTest.test-seed#[EA6D67E07F66B2B]) [ ] o.a.s.c.AbstractFullDistribZkTestBase create jetty 1 in directory C:\Users\JenkinsSlave\workspace\Lucene-Solr-5.x-Windows\solr\build\solr-core\test\J1\temp\solr.cloud.CollectionsAPIDistributedZkTest_EA6D67E07F66B2B-001\shard-1-001
[junit4] 2> 1308397 INFO (TEST-CollectionsAPIDistributedZkTest.test-seed#[EA6D67E07F66B2B]) [ ] o.e.j.s.Server jetty-9.2.13.v20150730
[junit4] 2> 1308398 INFO (TEST-CollectionsAPIDistributedZkTest.test-seed#[EA6D67E07F66B2B]) [ ] o.e.j.s.h.ContextHandler Started o.e.j.s.ServletContextHandler@fd18d7{/,null,AVAILABLE}
[junit4] 2> 1308399 INFO (TEST-CollectionsAPIDistributedZkTest.test-seed#[EA6D67E07F66B2B]) [ ] o.e.j.s.ServerConnector Started ServerConnector@6a0c63{HTTP/1.1}{127.0.0.1:61274}
[junit4] 2> 1308399 INFO (TEST-CollectionsAPIDistributedZkTest.test-seed#[EA6D67E07F66B2B]) [ ] o.e.j.s.Server Started @1311401ms
[junit4] 2> 1308399 INFO (TEST-CollectionsAPIDistributedZkTest.test-seed#[EA6D67E07F66B2B]) [ ] o.a.s.c.s.e.JettySolrRunner Jetty properties: {hostPort=61274, solr.data.dir=C:\Users\JenkinsSlave\workspace\Lucene-Solr-5.x-Windows\solr\build\solr-core\test\J1\temp\solr.cloud.CollectionsAPIDistributedZkTest_EA6D67E07F66B2B-001\tempDir-001/jetty1, solrconfig=solrconfig.xml, coreRootDirectory=C:\Users\JenkinsSlave\workspace\Lucene-Solr-5.x-Windows\solr\build\solr-core\test\J1\..\..\..\..\..\..\..\..\..\Users\JenkinsSlave\workspace\Lucene-Solr-5.x-Windows\solr\build\solr-core\test\J1\temp\solr.cloud.CollectionsAPIDistributedZkTest_EA6D67E07F66B2B-001\shard-1-001\cores, hostContext=/}
[junit4] 2> 1308400 INFO (TEST-CollectionsAPIDistributedZkTest.test-seed#[EA6D67E07F66B2B]) [ ] o.a.s.s.SolrDispatchFilter SolrDispatchFilter.init(): sun.misc.Launcher$AppClassLoader@5f387c
[junit4] 2> 1308400 INFO (TEST-CollectionsAPIDistributedZkTest.test-seed#[EA6D67E07F66B2B]) [ ] o.a.s.c.SolrResourceLoader new SolrResourceLoader for directory: 'C:\Users\JenkinsSlave\workspace\Lucene-Solr-5.x-Windows\solr\build\solr-core\test\J1\..\..\..\..\..\..\..\..\..\Users\JenkinsSlave\workspace\Lucene-Solr-5.x-Windows\solr\build\solr-core\test\J1\temp\solr.cloud.CollectionsAPIDistributedZkTest_EA6D67E07F66B2B-001\shard-1-001\'
[junit4] 2> 1308400 INFO (TEST-CollectionsAPIDistributedZkTest.test-seed#[EA6D67E07F66B2B]) [ ] o.a.s.c.SolrResourceLoader JNDI not configured for solr (NoInitialContextEx)
[junit4] 2> 1308400 INFO (TEST-CollectionsAPIDistributedZkTest.test-seed#[EA6D67E07F66B2B]) [ ] o.a.s.c.SolrResourceLoader solr home defaulted to 'solr/' (could not find system property or JNDI)
[junit4] 2> 1308428 INFO (TEST-CollectionsAPIDistributedZkTest.test-seed#[EA6D67E07F66B2B]) [ ] o.a.s.c.c.SolrZkClient Using default ZkCredentialsProvider
[junit4] 2> 1308429 INFO (TEST-CollectionsAPIDistributedZkTest.test-seed#[EA6D67E07F66B2B]) [ ] o.a.s.c.c.ConnectionManager Waiting for client to connect to ZooKeeper
[junit4] 2> 1308430 INFO (zkCallback-1083-thread-1) [ ] o.a.s.c.c.ConnectionManager Watcher org.apache.solr.common.cloud.ConnectionManager@c035a9 name:ZooKeeperConnection Watcher:127.0.0.1:61208/solr got event WatchedEvent state:SyncConnected type:None path:null path:null type:None
[junit4] 2> 1308430 INFO (TEST-CollectionsAPIDistributedZkTest.test-seed#[EA6D67E07F66B2B]) [ ] o.a.s.c.c.ConnectionManager Client is connected to ZooKeeper
[junit4] 2> 1308431 INFO (TEST-CollectionsAPIDistributedZkTest.test-seed#[EA6D67E07F66B2B]) [ ] o.a.s.c.c.SolrZkClient Using default ZkACLProvider
[junit4] 2> 1308432 INFO (TEST-CollectionsAPIDistributedZkTest.test-seed#[EA6D67E07F66B2B]) [ ] o.a.s.s.SolrDispatchFilter Loading solr.xml from SolrHome (not found in ZooKeeper)
[junit4] 2> 1308432 INFO (TEST-CollectionsAPIDistributedZkTest.test-seed#[EA6D67E07F66B2B]) [ ] o.a.s.c.SolrXmlConfig Loading container configuration from C:\Users\JenkinsSlave\workspace\Lucene-Solr-5.x-Windows\solr\build\solr-core\test\J1\..\..\..\..\..\..\..\..\..\Users\JenkinsSlave\workspace\Lucene-Solr-5.x-Windows\solr\build\solr-core\test\J1\temp\solr.cloud.CollectionsAPIDistributedZkTest_EA6D67E07F66B2B-001\shard-1-001\solr.xml
[junit4] 2> 1308461 INFO (TEST-CollectionsAPIDistributedZkTest.test-seed#[EA6D67E07F66B2B]) [ ] o.a.s.c.CoresLocator Config-defined core root directory: C:\Users\JenkinsSlave\workspace\Lucene-Solr-5.x-Windows\solr\build\solr-core\test\J1\..\..\..\..\..\..\..\..\..\Users\JenkinsSlave\workspace\Lucene-Solr-5.x-Windows\solr\build\solr-core\test\J1\temp\solr.cloud.CollectionsAPIDistributedZkTest_EA6D67E07F66B2B-001\shard-1-001\cores
[junit4] 2> 1308461 INFO (TEST-CollectionsAPIDistributedZkTest.test-seed#[EA6D67E07F66B2B]) [ ] o.a.s.c.CoreContainer New CoreContainer 11154524
[junit4] 2> 1308461 INFO (TEST-CollectionsAPIDistributedZkTest.test-seed#[EA6D67E07F66B2B]) [ ] o.a.s.c.CoreContainer Loading cores into CoreContainer [instanceDir=C:\Users\JenkinsSlave\workspace\Lucene-Solr-5.x-Windows\solr\build\solr-core\test\J1\..\..\..\..\..\..\..\..\..\Users\JenkinsSlave\workspace\Lucene-Solr-5.x-Windows\solr\build\solr-core\test\J1\temp\solr.cloud.CollectionsAPIDistributedZkTest_EA6D67E07F66B2B-001\shard-1-001\]
[junit4] 2> 1308461 INFO (TEST-CollectionsAPIDistributedZkTest.test-seed#[EA6D67E07F66B2B]) [ ] o.a.s.c.CoreContainer loading shared library: C:\Users\JenkinsSlave\workspace\Lucene-Solr-5.x-Windows\solr\build\solr-core\test\J1\..\..\..\..\..\..\..\..\..\Users\JenkinsSlave\workspace\Lucene-Solr-5.x-Windows\solr\build\solr-core\test\J1\temp\solr.cloud.CollectionsAPIDistributedZkTest_EA6D67E07F66B2B-001\shard-1-001\lib
[junit4] 2> 1308461 WARN (TEST-CollectionsAPIDistributedZkTest.test-seed#[EA6D67E07F66B2B]) [ ] o.a.s.c.SolrResourceLoader Can't find (or read) directory to add to classloader: lib (resolved as: C:\Users\JenkinsSlave\workspace\Lucene-Solr-5.x-Windows\solr\build\solr-core\test\J1\..\..\..\..\..\..\..\..\..\Users\JenkinsSlave\workspace\Lucene-Solr-5.x-Windows\solr\build\solr-core\test\J1\temp\solr.cloud.CollectionsAPIDistributedZkTest_EA6D67E07F66B2B-001\shard-1-001\lib).
[junit4] 2> 1308471 INFO (TEST-CollectionsAPIDistributedZkTest.test-seed#[EA6D67E07F66B2B]) [ ] o.a.s.h.c.HttpShardHandlerFactory created with socketTimeout : 90000,urlScheme : ,connTimeout : 15000,maxConnectionsPerHost : 20,maxConnections : 10000,corePoolSize : 0,maximumPoolSize : 2147483647,maxThreadIdleTime : 5,sizeOfQueue : -1,fairnessPolicy : false,useRetries : false,
[junit4] 2> 1308473 INFO (TEST-CollectionsAPIDistributedZkTest.test-seed#[EA6D67E07F66B2B]) [ ] o.a.s.u.UpdateShardHandler Creating UpdateShardHandler HTTP client with params: socketTimeout=340000&connTimeout=45000&retry=true
[junit4] 2> 1308474 INFO (TEST-CollectionsAPIDistributedZkTest.test-seed#[EA6D67E07F66B2B]) [ ] o.a.s.l.LogWatcher SLF4J impl is org.slf4j.impl.Log4jLoggerFactory
[junit4] 2> 1308474 INFO (TEST-CollectionsAPIDistributedZkTest.test-seed#[EA6D67E07F66B2B]) [ ] o.a.s.l.LogWatcher Registering Log Listener [Log4j (org.slf4j.impl.Log4jLoggerFactory)]
[junit4] 2> 1308474 INFO (TEST-CollectionsAPIDistributedZkTest.test-seed#[EA6D67E07F66B2B]) [ ] o.a.s.c.ZkContainer Zookeeper client=127.0.0.1:61208/solr
[junit4] 2> 1308474 INFO (TEST-CollectionsAPIDistributedZkTest.test-seed#[EA6D67E07F66B2B]) [ ] o.a.s.c.ZkController zkHost includes chroot
[junit4] 2> 1308474 INFO (TEST-CollectionsAPIDistributedZkTest.test-seed#[EA6D67E07F66B2B]) [ ] o.a.s.c.c.SolrZkClient Using default ZkCredentialsProvider
[junit4] 2> 1308475 INFO (TEST-CollectionsAPIDistributedZkTest.test-seed#[EA6D67E07F66B2B]) [ ] o.a.s.c.c.ConnectionManager Waiting for client to connect to ZooKeeper
[junit4] 2> 1308477 INFO (zkCallback-1085-thread-1) [ ] o.a.s.c.c.ConnectionManager Watcher org.apache.solr.common.cloud.ConnectionManager@18cdbd name:ZooKeeperConnection Watcher:127.0.0.1:61208 got event WatchedEvent state:SyncConnected type:None path:null path:null type:None
[junit4] 2> 1308477 INFO (TEST-CollectionsAPIDistributedZkTest.test-seed#[EA6D67E07F66B2B]) [ ] o.a.s.c.c.ConnectionManager Client is connected to ZooKeeper
[junit4] 2> 1308477 INFO (TEST-CollectionsAPIDistributedZkTest.test-seed#[EA6D67E07F66B2B]) [ ] o.a.s.c.c.SolrZkClient Using default ZkACLProvider
[junit4] 2> 1308479 WARN (NIOServerCxn.Factory:0.0.0.0/0.0.0.0:0) [ ] o.a.z.s.NIOServerCnxn caught end of stream exception
[junit4] 2> EndOfStreamException: Unable to read additional data from client sessionid 0x1507c6e3f07000a, likely client has closed socket
[junit4] 2> at org.apache.zookeeper.server.NIOServerCnxn.doIO(NIOServerCnxn.java:228)
[junit4] 2> at org.apache.zookeeper.server.NIOServerCnxnFactory.run(NIOServerCnxnFactory.java:208)
[junit4] 2> at java.lang.Thread.run(Thread.java:745)
[junit4] 2> 1308481 INFO (TEST-CollectionsAPIDistributedZkTest.test-seed#[EA6D67E07F66B2B]) [n:127.0.0.1:61274_ ] o.a.s.c.c.ConnectionManager Waiting for client to connect to ZooKeeper
[junit4] 2> 1308482 INFO (zkCallback-1086-thread-1-processing-n:127.0.0.1:61274_) [n:127.0.0.1:61274_ ] o.a.s.c.c.ConnectionManager Watcher org.apache.solr.common.cloud.ConnectionManager@1eca063 name:ZooKeeperConnection Watcher:127.0.0.1:61208/solr got event WatchedEvent state:SyncConnected type:None path:null path:null type:None
[junit4] 2> 1308483 INFO (TEST-CollectionsAPIDistributedZkTest.test-seed#[EA6D67E07F66B2B]) [n:127.0.0.1:61274_ ] o.a.s.c.c.ConnectionManager Client is connected to ZooKeeper
[junit4] 2> 1308490 INFO (TEST-CollectionsAPIDistributedZkTest.test-seed#[EA6D67E07F66B2B]) [n:127.0.0.1:61274_ ] o.a.s.c.c.ZkStateReader Updating cluster state from ZooKeeper...
[junit4] 2> 1309678 INFO (TEST-CollectionsAPIDistributedZkTest.test-seed#[EA6D67E07F66B2B]) [n:127.0.0.1:61274_ ] o.a.s.c.ZkController Register node as live in ZooKeeper:/live_nodes/127.0.0.1:61274_
[junit4] 2> 1309678 INFO (TEST-CollectionsAPIDistributedZkTest.test-seed#[EA6D67E07F66B2B]) [n:127.0.0.1:61274_ ] o.a.s.c.c.SolrZkClient makePath: /live_nodes/127.0.0.1:61274_
[junit4] 2> 1309785 INFO (zkCallback-1079-thread-1-processing-n:127.0.0.1:61235_) [n:127.0.0.1:61235_ ] o.a.s.c.c.ZkStateReader A live node change: WatchedEvent state:SyncConnected type:NodeChildrenChanged path:/live_nodes, has occurred - updating... (live nodes size: 1)
[junit4] 2> 1309786 INFO (zkCallback-1086-thread-1-processing-n:127.0.0.1:61274_) [n:127.0.0.1:61274_ ] o.a.s.c.c.ZkStateReader A live node change: WatchedEvent state:SyncConnected type:NodeChildrenChanged path:/live_nodes, has occurred - updating... (live nodes size: 1)
[junit4] 2> 1309785 INFO (zkCallback-1081-thread-1) [ ] o.a.s.c.c.ZkStateReader A live node change: WatchedEvent state:SyncConnected type:NodeChildrenChanged path:/live_nodes, has occurred - updating... (live nodes size: 1)
[junit4] 2> 1309792 INFO (TEST-CollectionsAPIDistributedZkTest.test-seed#[EA6D67E07F66B2B]) [n:127.0.0.1:61274_ ] o.a.s.c.Overseer Overseer (id=null) closing
[junit4] 2> 1309793 INFO (TEST-CollectionsAPIDistributedZkTest.test-seed#[EA6D67E07F66B2B]) [n:127.0.0.1:61274_ ] o.a.s.c.LeaderElector Joined leadership election with path: /overseer_elect/election/94712405120450571-127.0.0.1:61274_-n_0000000001
[junit4] 2> 1309796 INFO (TEST-CollectionsAPIDistributedZkTest.test-seed#[EA6D67E07F66B2B]) [n:127.0.0.1:61274_ ] o.a.s.c.LeaderElector Watching path /overseer_elect/election/94712405120450566-127.0.0.1:61235_-n_0000000000 to know if I could be the leader
[junit4] 2> 1309821 INFO (TEST-CollectionsAPIDistributedZkTest.test-seed#[EA6D67E07F66B2B]) [n:127.0.0.1:61274_ ] o.a.s.c.CoreContainer Security conf doesn't exist. Skipping setup for authorization module.
[junit4] 2> 1309821 INFO (TEST-CollectionsAPIDistributedZkTest.test-seed#[EA6D67E07F66B2B]) [n:127.0.0.1:61274_ ] o.a.s.c.CoreContainer No authentication plugin used.
[junit4] 2> 1309823 INFO (TEST-CollectionsAPIDistributedZkTest.test-seed#[EA6D67E07F66B2B]) [n:127.0.0.1:61274_ ] o.a.s.c.CoresLocator Looking for core definitions underneath C:\Users\JenkinsSlave\workspace\Lucene-Solr-5.x-Windows\solr\build\solr-core\test\J1\..\..\..\..\..\..\..\..\..\Users\JenkinsSlave\workspace\Lucene-Solr-5.x-Windows\solr\build\solr-core\test\J1\temp\s
[...truncated too long message...]
120450580-127.0.0.1:61404_-n_0000000004) closing
[junit4] 2> 1359564 INFO (OverseerStateUpdate-94712405120450580-127.0.0.1:61404_-n_0000000004) [n:127.0.0.1:61404_ ] o.a.s.c.Overseer Overseer Loop exiting : 127.0.0.1:61404_
[junit4] 2> 1359575 ERROR (TEST-CollectionsAPIDistributedZkTest.test-seed#[EA6D67E07F66B2B]-EventThread) [n:127.0.0.1:61404_ ] o.a.z.ClientCnxn Error while calling watcher
[junit4] 2> java.util.concurrent.RejectedExecutionException: Task org.apache.solr.common.util.ExecutorUtil$MDCAwareThreadPoolExecutor$1@629769 rejected from org.apache.solr.common.util.ExecutorUtil$MDCAwareThreadPoolExecutor@c29298[Shutting down, pool size = 2, active threads = 1, queued tasks = 0, completed tasks = 43]
[junit4] 2> at java.util.concurrent.ThreadPoolExecutor$AbortPolicy.rejectedExecution(ThreadPoolExecutor.java:2048)
[junit4] 2> at java.util.concurrent.ThreadPoolExecutor.reject(ThreadPoolExecutor.java:821)
[junit4] 2> at java.util.concurrent.ThreadPoolExecutor.execute(ThreadPoolExecutor.java:1372)
[junit4] 2> at org.apache.solr.common.util.ExecutorUtil$MDCAwareThreadPoolExecutor.execute(ExecutorUtil.java:214)
[junit4] 2> at java.util.concurrent.AbstractExecutorService.submit(AbstractExecutorService.java:110)
[junit4] 2> at org.apache.solr.common.cloud.SolrZkClient$3.process(SolrZkClient.java:261)
[junit4] 2> at org.apache.zookeeper.ClientCnxn$EventThread.processEvent(ClientCnxn.java:522)
[junit4] 2> at org.apache.zookeeper.ClientCnxn$EventThread.run(ClientCnxn.java:498)
[junit4] 2> 1359575 INFO (zkCallback-1099-thread-2-processing-n:127.0.0.1:61404_) [n:127.0.0.1:61404_ ] o.a.s.c.c.ZkStateReader Updating data for collection1 from 18 to 19
[junit4] 2> 1359581 INFO (TEST-CollectionsAPIDistributedZkTest.test-seed#[EA6D67E07F66B2B]) [ ] o.e.j.s.ServerConnector Stopped ServerConnector@1d9cbc{HTTP/1.1}{127.0.0.1:0}
[junit4] 2> 1359581 INFO (TEST-CollectionsAPIDistributedZkTest.test-seed#[EA6D67E07F66B2B]) [ ] o.e.j.s.h.ContextHandler Stopped o.e.j.s.ServletContextHandler@f83fb1{/,null,UNAVAILABLE}
[junit4] 2> 1359588 INFO (TEST-CollectionsAPIDistributedZkTest.test-seed#[EA6D67E07F66B2B]) [n:127.0.0.1:61404_ c:nodes_used_collection s:shard1 r:core_node3 x:nodes_used_collection_shard1_replica1] o.a.s.c.ZkTestServer connecting to 127.0.0.1:61208 61208
[junit4] 2> 1362627 INFO (Thread-3371) [ ] o.a.s.c.ZkTestServer connecting to 127.0.0.1:61208 61208
[junit4] 2> 1362627 WARN (Thread-3371) [ ] o.a.s.c.ZkTestServer Watch limit violations:
[junit4] 2> Maximum concurrent create/delete watches above limit:
[junit4] 2>
[junit4] 2> 7 /solr/aliases.json
[junit4] 2> 5 /solr/security.json
[junit4] 2> 5 /solr/configs/conf1
[junit4] 2>
[junit4] 2> Maximum concurrent data watches above limit:
[junit4] 2>
[junit4] 2> 7 /solr/clusterstate.json
[junit4] 2> 4 /solr/collections/nodes_used_collection/state.json
[junit4] 2> 4 /solr/collections/collection1/state.json
[junit4] 2>
[junit4] 2> Maximum concurrent children watches above limit:
[junit4] 2>
[junit4] 2> 7 /solr/live_nodes
[junit4] 2> 7 /solr/collections
[junit4] 2> 4 /solr/overseer/collection-queue-work
[junit4] 2> 4 /solr/overseer/queue
[junit4] 2>
[junit4] 2> NOTE: reproduce with: ant test -Dtestcase=CollectionsAPIDistributedZkTest -Dtests.method=test -Dtests.seed=EA6D67E07F66B2B -Dtests.slow=true -Dtests.locale=sr_ME -Dtests.timezone=Asia/Baghdad -Dtests.asserts=true -Dtests.file.encoding=UTF-8
[junit4] FAILURE 62.6s J1 | CollectionsAPIDistributedZkTest.test <<<
[junit4] > Throwable #1: java.lang.AssertionError
[junit4] > at __randomizedtesting.SeedInfo.seed([EA6D67E07F66B2B:86F2E9A4A90A06D3]:0)
[junit4] > at org.apache.solr.cloud.CollectionsAPIDistributedZkTest.testNoConfigSetExist(CollectionsAPIDistributedZkTest.java:519)
[junit4] > at org.apache.solr.cloud.CollectionsAPIDistributedZkTest.test(CollectionsAPIDistributedZkTest.java:166)
[junit4] > at org.apache.solr.BaseDistributedSearchTestCase$ShardsRepeatRule$ShardsFixedStatement.callStatement(BaseDistributedSearchTestCase.java:963)
[junit4] > at org.apache.solr.BaseDistributedSearchTestCase$ShardsRepeatRule$ShardsStatement.evaluate(BaseDistributedSearchTestCase.java:938)
[junit4] > at java.lang.Thread.run(Thread.java:745)
[junit4] 2> 1362637 INFO (SUITE-CollectionsAPIDistributedZkTest-seed#[EA6D67E07F66B2B]-worker) [n:127.0.0.1:61404_ c:nodes_used_collection s:shard1 r:core_node3 x:nodes_used_collection_shard1_replica1] o.a.s.SolrTestCaseJ4 ###deleteCore
[junit4] 2> NOTE: leaving temporary files on disk at: C:\Users\JenkinsSlave\workspace\Lucene-Solr-5.x-Windows\solr\build\solr-core\test\J1\temp\solr.cloud.CollectionsAPIDistributedZkTest_EA6D67E07F66B2B-001
[junit4] 2> NOTE: test params are: codec=Lucene53, sim=RandomSimilarityProvider(queryNorm=true,coord=no): {}, locale=sr_ME, timezone=Asia/Baghdad
[junit4] 2> NOTE: Windows 7 6.1 x86/Oracle Corporation 1.7.0_80 (32-bit)/cpus=3,threads=1,free=101088008,total=388497408
[junit4] 2> NOTE: All tests run in this JVM: [HdfsRecoverLeaseTest, TestSolrCloudWithKerberosAlt, DebugComponentTest, SliceStateTest, BasicFunctionalityTest, ClusterStateTest, TestIndexingPerformance, CopyFieldTest, TestFieldTypeResource, DistributedQueryComponentOptimizationTest, TestDistributedGrouping, CoreAdminCreateDiscoverTest, HdfsCollectionsAPIDistributedZkTest, TestQueryTypes, HighlighterConfigTest, LeaderElectionIntegrationTest, TestSolrCLIRunExample, TestRecovery, OverseerStatusTest, TestUtils, SolrXmlInZkTest, BadIndexSchemaTest, AtomicUpdatesTest, TestObjectReleaseTracker, PreAnalyzedUpdateProcessorTest, EchoParamsTest, FullHLLTest, TestDocBasedVersionConstraints, TestRealTimeGet, BasicDistributedZk2Test, RuleEngineTest, NoCacheHeaderTest, DistributedTermsComponentTest, BasicZkTest, TestRuleBasedAuthorizationPlugin, ActionThrottleTest, TestConfigSetsAPIExclusivity, AsyncCallRequestStatusResponseTest, SolrCmdDistributorTest, HdfsUnloadDistributedZkTest, OutOfBoxZkACLAndCredentialsProvidersTest, TestJsonRequest, CircularListTest, TestSolrQueryParserResource, SuggesterTest, TestManagedSynonymFilterFactory, IndexSchemaRuntimeFieldTest, TestManagedSchema, DistributedFacetPivotSmallTest, RAMDirectoryFactoryTest, TestDynamicLoading, HLLSerializationTest, BlockDirectoryTest, TestTrie, SpellingQueryConverterTest, WordBreakSolrSpellCheckerTest, DateMathParserTest, HttpPartitionTest, BinaryUpdateRequestHandlerTest, HdfsDirectoryFactoryTest, SimpleMLTQParserTest, StatsComponentTest, TestNoOpRegenerator, SignatureUpdateProcessorFactoryTest, CollectionStateFormat2Test, SpatialHeatmapFacetsTest, TestMacros, FieldAnalysisRequestHandlerTest, BigEndianAscendingWordDeserializerTest, TestDefaultSearchFieldResource, OverriddenZkACLAndCredentialsProvidersTest, HdfsNNFailoverTest, TestBinaryResponseWriter, FacetPivotSmallTest, SolrTestCaseJ4Test, TestIndexSearcher, TestSchemaNameResource, TestSolrIndexConfig, UUIDFieldTest, TestPerFieldSimilarity, TestDynamicFieldCollectionResource, TestReplicationHandlerBackup, LoggingHandlerTest, TestSimpleQParserPlugin, SpellPossibilityIteratorTest, ResponseLogComponentTest, SynonymTokenizerTest, TestZkChroot, URLClassifyProcessorTest, OutputWriterTest, DistributedIntervalFacetingTest, TestPHPSerializedResponseWriter, BufferStoreTest, MultiTermTest, TestAuthenticationFramework, CursorPagingTest, NotRequiredUniqueKeyTest, TestQueryUtils, TestFuzzyAnalyzedSuggestions, SpellCheckComponentTest, SolrPluginUtilsTest, ShowFileRequestHandlerTest, DirectUpdateHandlerOptimizeTest, AliasIntegrationTest, ChaosMonkeySafeLeaderTest, TestFoldingMultitermQuery, SecurityConfHandlerTest, TestInfoStreamLogging, TestCoreDiscovery, TestShardHandlerFactory, TestCollapseQParserPlugin, TestJoin, PreAnalyzedFieldTest, TestIntervalFaceting, TestFastOutputStream, CacheHeaderTest, SegmentsInfoRequestHandlerTest, TestSearcherReuse, TestReload, TestDefaultSimilarityFactory, TestSolrQueryParser, SpellCheckCollatorTest, DataDrivenBlockJoinTest, TestRestManager, DateRangeFieldTest, FieldMutatingUpdateProcessorTest, ZkStateReaderTest, SearchHandlerTest, OverseerCollectionConfigSetProcessorTest, TermVectorComponentDistributedTest, SolrCoreCheckLockOnStartupTest, TestComplexPhraseQParserPlugin, BasicDistributedZkTest, UnloadDistributedZkTest, CollectionsAPIDistributedZkTest]
[junit4] Completed [259/542] on J1 in 62.66s, 1 test, 1 failure <<< FAILURES!
[...truncated 920 lines...]
BUILD FAILED
C:\Users\JenkinsSlave\workspace\Lucene-Solr-5.x-Windows\build.xml:785: The following error occurred while executing this line:
C:\Users\JenkinsSlave\workspace\Lucene-Solr-5.x-Windows\build.xml:729: The following error occurred while executing this line:
C:\Users\JenkinsSlave\workspace\Lucene-Solr-5.x-Windows\build.xml:59: The following error occurred while executing this line:
C:\Users\JenkinsSlave\workspace\Lucene-Solr-5.x-Windows\solr\build.xml:233: The following error occurred while executing this line:
C:\Users\JenkinsSlave\workspace\Lucene-Solr-5.x-Windows\solr\common-build.xml:526: The following error occurred while executing this line:
C:\Users\JenkinsSlave\workspace\Lucene-Solr-5.x-Windows\lucene\common-build.xml:1452: The following error occurred while executing this line:
C:\Users\JenkinsSlave\workspace\Lucene-Solr-5.x-Windows\lucene\common-build.xml:1006: There were test failures: 542 suites (7 ignored), 2143 tests, 1 failure, 84 ignored (47 assumptions) [seed: EA6D67E07F66B2B]
Total time: 70 minutes 5 seconds
Build step 'Invoke Ant' marked build as failure
Archiving artifacts
[WARNINGS] Skipping publisher since build result is FAILURE
Recording test results
Email was triggered for: Failure - Any
Sending email for trigger: Failure - Any