You are viewing a plain text version of this content. The canonical link for it is here.
Posted to builds@beam.apache.org by Apache Jenkins Server <je...@builds.apache.org> on 2022/09/05 11:35:37 UTC

Build failed in Jenkins: beam_PostCommit_XVR_Direct #3102

See <https://ci-beam.apache.org/job/beam_PostCommit_XVR_Direct/3102/display/redirect?page=changes>

Changes:

[noreply] Generalize interface of InfluxDBPublisher to support more use cases


------------------------------------------
[...truncated 838.19 KB...]
        payload: "\202SNAPPY\000\000\000\000\001\000\000\000\001\000\000\006]\313\026\270\254\355\000\005sr\000Aorg.apache.beam.sdk.values.TimestampedV\001\022\000$>\021\000HCoder\364\376\202p\274iX-\002\000\001L\000\n\005;\005\030\034t\000\"Lorg/\t]\000/\001]\024/sdk/c\0015\004s/\005$\020;xr\000*N\202\000\t%(.Structured\005/8s\277\022\016\325\3246\021\002\000\000xr\000 j9\000\005/\034C\335\325\211\256\274~\370\001/\020psr\000#j1\000\010Row\0054\034\254\236\213\244M\203\363\250\0014\010r\000'N2\000 schemas.S\005\010\0056|\023\226L\354\244P\260l\002\000\004L\000\017fromRowFunctiont\0005R\t\001Xtransforms/Serializable\0217\014;L\000\006\tk\010t\000$RA\000\t\036\004s/\t\211\024;L\000\rto\035x`q\000~\000\007L\000\016typeDescriptort\000+RM\000%\271\010s/T2-\000!\240\000&N\004\001-\240\024Custom%\003\034j\260\010\235\013;\035\013!9\001z\020\003sr\000=N;\000\031\367\000.N\367\000Ds$Identity\033n\367C9'S\320\001R!\277\000\"NN\000-\004-\215d7\242\227\362z%\204e\002\000\007Z\000\033encodingPosi!\211DsOverriddenI\000\010hash\001\272\010L\000\021B)\000\220t\000\017Ljava/util/Map;L\000\014fieldIndicest\000HL>\335\002 vendor/gu\0019Lv26_0_jre/com/google\001\0134mon/collect/Bi\tZ\000\006\005Z\014st\000\020\035u$List;L\000\007op\005\273\010t\000,R\267\001-\000M\004\004$O\t.\034;L\000\004uuid6S\000<UUID;xp\000\342\007i\330sr\000\021\001\342\000.\001\342\360I.HashMap\005\007\332\301\303\026`\321\003\000\002F\000\nloadFactorI\000\tthresholdxp?@\000\000\000\000\000\014w\010\000\000\000\020\000\000\000\001t\000\007role_id\025Wdlang.Integer\022\342\240\244\367\201\2078\002\000\001I\000\005Ei\014xr\000\020\005\177\005(4Number\206\254\225\035\013\224\340\213%\360\001b\020xsr\000J>\365\001)f\000.%f\000.5f\020.com.)f\001\013\014mon.-f\000.\001\334%j\001S\001\001(\003\000\000xpw\004\000\000\000\001A\251\000\027\001\005\000\032\001l\000\023\005\222%\021\020Array!\203 x\201\322\035\231\307a\235\003\001\274\024\004sizex\001I\000\001\t@\014sr\0002>\241\000\241A-\226\024.AutoV\241;\000_i\244\004_FAD\034\303\343i\345\363l$\364\205.\004\013dm\233\205*\000\022I\002!\026\030/String!\313\014name\001\246\010 L\000Q\020\001\017\014\022L\000\004a\335\010t\000.\216\034\002\005|a\340a\326\000(n\267\000\t\255\t1\034\263\021\225\3324!\217\246%\226\010t\000\000\001y\004\027sZ\267\005\021\370\rA\000OI\216\034\367\031\n\2336X\271\227\305\".\301\000\014\017xps\001P\004\025?IS\004\000wQS%\374\0006n\244\000V[\001\001\33749\304m\364S\243\227P\002\000\010L\000\025M\007$ionElement\001#\001u(!L\000\013logical\001\023\010t\0000\216E\001\000L\0312$;L\000\nmapKey\001@\rS\014\014map%\362\035\024 \010metadata\001$\034\017L\000\010null\241\353\010t\000\023=\3604Boolean;L\000\trow)C\0012\014\010L\000\010!\347\030Namet\000-\216\246\000\001}\001/!\352\000,nF\001\tf)\352\0015\034\013PLl[\357\3103%\356\001\001\014sr\000\036y\027\000C\211\272Lions$EmptyMapY6\024\205Z\334\347\265\247\211WA\302\000.\r\3224\315 r\200\325\234\372\356\002\000\001Z\000\005\211\000\030p\000p~r\000+\212\234\000\001\227\001\314a\273\001\001\000\022\345\375\000\016\005\225\005f\014Enum\001\031\001\001\001\035$pt\000\005INT64xE]\000%\005\006Zc\002\tGe\363\241\036x\274\231\003\367\230m\205/\002\000\002J\000\014leastSigBitsJ\000\013mo\025\016Dxp\236\375\037\366_x\253U\304:C\000\001@K\311\005e\014\014sr\000Ro\001\005\364\004s.\001\313\371\212(s$9z\2164\213\005/\271\347!o\010r\000)N\016\001R;\000\034x\237G[\330\210\240{eR \005tokent\000LB\032\002\251,\212\222\006\010ref\305\222\001\241\000T\001N\000;\345r\000Z>\221\000\tQ\212}\005\rQ\005\362\005Q\024$Simple\026\005\020!\255\001\001\t\372\346\346\005Bi\000\0342{#\261\276\3768|%\033\030\013runtim\005w\010t\000\030}m\r8\005\362\030;xpvr\000\036>\355\000\241\311-~(Row\032Q\006\2060\230\247\034\005X4\006schemaq\000~\000\010xp"
      >
    >
  >
  coders: <
    key: "EBGazLfspGVarIntCoder"
    value: <
      spec: <
        urn: "beam:coders:javasdk:0.1"
        payload: "\202SNAPPY\000\000\000\000\001\000\000\000\001\000\000\000\210\330\001\350\254\355\000\005sr\000&org.apache.beam.sdk.coders.VarIntCoder\300K2\332\251KVh\002\000\000xrr5\000\024Atomic\0055 \307\354\265\314\205tPF\002\0055\000*jj\000$Structured\0059\034s\277\022\016\325\3246\021\t9\000 j9\000\005/0C\335\325\211\256\274~\370\002\000\000xp"
      >
    >
  >
  coders: <
    key: "EBGazLfspGVoidCoder"
    value: <
      spec: <
        urn: "beam:coders:javasdk:0.1"
        payload: "\202SNAPPY\000\000\000\000\001\000\000\000\001\000\000\000\210\326\001\350\254\355\000\005sr\000$org.apache.beam.sdk.coders.VoidCoder\271\277U\233\350\r\257U\002\000\000xr\000&j3\000\024Atomic\0055 \307\354\265\314\205tPF\002\0055\000*j5\000$Structured\0059\034s\277\022\016\325\3246\021\t9\000 j9\000\005/0C\335\325\211\256\274~\370\002\000\000xp"
      >
    >
  >
  coders: <
    key: "c0"
    value: <
      spec: <
        urn: "beam:coder:bytes:v1"
      >
    >
  >
  coders: <
    key: "c1"
    value: <
      spec: <
        urn: "beam:coder:global_window:v1"
      >
    >
  >
  coders: <
    key: "c2"
    value: <
      spec: <
        urn: "beam:coder:row:v1"
        payload: "\n\r\n\007role_id\032\002\020\003\022$abc5e222-ab8f-4f6f-800a-a58bb0f45675"
      >
    >
  >
  environments: <
    key: "EBGazLfspGbeam:env:docker:v1"
    value: <
      urn: "beam:env:docker:v1"
      payload: "\n apache/beam_java8_sdk:2.42.0.dev"
      capabilities: "beam:coder:bytes:v1"
      capabilities: "beam:coder:bool:v1"
      capabilities: "beam:coder:varint:v1"
      capabilities: "beam:coder:string_utf8:v1"
      capabilities: "beam:coder:iterable:v1"
      capabilities: "beam:coder:timer:v1"
      capabilities: "beam:coder:kv:v1"
      capabilities: "beam:coder:length_prefix:v1"
      capabilities: "beam:coder:global_window:v1"
      capabilities: "beam:coder:interval_window:v1"
      capabilities: "beam:coder:custom_window:v1"
      capabilities: "beam:coder:windowed_value:v1"
      capabilities: "beam:coder:double:v1"
      capabilities: "beam:coder:row:v1"
      capabilities: "beam:coder:param_windowed_value:v1"
      capabilities: "beam:coder:state_backed_iterable:v1"
      capabilities: "beam:coder:sharded_key:v1"
      capabilities: "beam:coder:nullable:v1"
      capabilities: "beam:protocol:multi_core_bundle_processing:v1"
      capabilities: "beam:protocol:progress_reporting:v1"
      capabilities: "beam:protocol:harness_monitoring_infos:v1"
      capabilities: "beam:protocol:control_request_elements_embedding:v1"
      capabilities: "beam:protocol:state_caching:v1"
      capabilities: "beam:version:sdk_base:apache/beam_java8_sdk:2.42.0.dev"
      capabilities: "beam:transform:sdf_truncate_sized_restrictions:v1"
      capabilities: "beam:transform:to_string:v1"
      dependencies: <
        type_urn: "beam:artifact:type:file:v1"
        type_payload: "\nL/tmp/artifacts/icedtea-sound-CGRxIE9edPHnbxQhM-L5mp8h21H-ySB79uQtSquPV_Q.jar\022@086471204f5e74f1e76f142133e2f99a9f21db51fec9207bf6e42d4aab8f57f4"
        role_urn: "beam:artifact:role:staging_to:v1"
        role_payload: "\n=icedtea-sound-CGRxIE9edPHnbxQhM-L5mp8h21H-ySB79uQtSquPV_Q.jar"
      >
      dependencies: <
        type_urn: "beam:artifact:type:file:v1"
        type_payload: "\nF/tmp/artifacts/jaccess-FBI0Bb27lF3oEBieWAi7SP8X1zBR8k4BJQOVpsoK9a0.jar\022@14123405bdbb945de810189e5808bb48ff17d73051f24e01250395a6ca0af5ad"
        role_urn: "beam:artifact:role:staging_to:v1"
        role_payload: "\n7jaccess-FBI0Bb27lF3oEBieWAi7SP8X1zBR8k4BJQOVpsoK9a0.jar"
      >
      dependencies: <
        type_urn: "beam:artifact:type:file:v1"
        type_payload: "\nI/tmp/artifacts/localedata-kJ2mc8rBH5-IklhfR1XzNotlIQ_mnVMA-pgaXv2r8Ag.jar\022@909da673cac11f9f8892585f4755f3368b65210fe69d5300fa981a5efdabf008"
        role_urn: "beam:artifact:role:staging_to:v1"
        role_payload: "\n:localedata-kJ2mc8rBH5-IklhfR1XzNotlIQ_mnVMA-pgaXv2r8Ag.jar"
      >
      dependencies: <
        type_urn: "beam:artifact:type:file:v1"
        type_payload: "\nF/tmp/artifacts/nashorn-B0CAb3QpJET_6VsT3hcC_89VtvhV616H8N2bHAIaqWo.jar\022@0740806f74292444ffe95b13de1702ffcf55b6f855eb5e87f0dd9b1c021aa96a"
        role_urn: "beam:artifact:role:staging_to:v1"
        role_payload: "\n7nashorn-B0CAb3QpJET_6VsT3hcC_89VtvhV616H8N2bHAIaqWo.jar"
      >
      dependencies: <
        type_urn: "beam:artifact:type:file:v1"
        type_payload: "\nG/tmp/artifacts/cldrdata-gclqV9lOGqQOKesG-a6TAUTGEYlyIDqpyd4M_k7gtWo.jar\022@81c96a57d94e1aa40e29eb06f9ae930144c6118972203aa9c9de0cfe4ee0b56a"
        role_urn: "beam:artifact:role:staging_to:v1"
        role_payload: "\n8cldrdata-gclqV9lOGqQOKesG-a6TAUTGEYlyIDqpyd4M_k7gtWo.jar"
      >
      dependencies: <
        type_urn: "beam:artifact:type:file:v1"
        type_payload: "\nD/tmp/artifacts/dnsns-byzoQxdXengTvA5IlbH9gSIzfhNQElRYltuMJN0vjcc.jar\022@6f2ce84317577a7813bc0e4895b1fd8122337e135012545896db8c24dd2f8dc7"
        role_urn: "beam:artifact:role:staging_to:v1"
        role_payload: "\n5dnsns-byzoQxdXengTvA5IlbH9gSIzfhNQElRYltuMJN0vjcc.jar"
      >
      dependencies: <
        type_urn: "beam:artifact:type:file:v1"
        type_payload: "\n\203\001/tmp/artifacts/beam-sdks-java-extensions-schemaio-expansion-service-2.42.0-SNAPSHOT-_vqtn6fpKNgqW6gb5yCi1yHVRPoFq-9toX5lGnyJ6b0.jar\022@fefaad9fa7e928d82a5ba81be720a2d721d544fa05abef6da17e651a7c89e9bd"
        role_urn: "beam:artifact:role:staging_to:v1"
        role_payload: "\ntbeam-sdks-java-extensions-schemaio-expansion-service-2.42.0-SNAPSHOT-_vqtn6fpKNgqW6gb5yCi1yHVRPoFq-9toX5lGnyJ6b0.jar"
      >
    >
  >
  environments: <
    key: "go"
    value: <
      urn: "beam:env:docker:v1"
      payload: "\n\026apache/beam_go_sdk:dev"
      capabilities: "beam:protocol:progress_reporting:v1"
      capabilities: "beam:protocol:multi_core_bundle_processing:v1"
      capabilities: "beam:transform:sdf_truncate_sized_restrictions:v1"
      capabilities: "beam:protocol:worker_status:v1"
      capabilities: "beam:protocol:monitoring_info_short_ids:v1"
      capabilities: "beam:version:sdk_base:go"
      capabilities: "beam:coder:bytes:v1"
      capabilities: "beam:coder:bool:v1"
      capabilities: "beam:coder:varint:v1"
      capabilities: "beam:coder:double:v1"
      capabilities: "beam:coder:string_utf8:v1"
      capabilities: "beam:coder:length_prefix:v1"
      capabilities: "beam:coder:kv:v1"
      capabilities: "beam:coder:iterable:v1"
      capabilities: "beam:coder:state_backed_iterable:v1"
      capabilities: "beam:coder:windowed_value:v1"
      capabilities: "beam:coder:global_window:v1"
      capabilities: "beam:coder:interval_window:v1"
      capabilities: "beam:coder:row:v1"
      capabilities: "beam:coder:nullable:v1"
      dependencies: <
        type_urn: "beam:artifact:type:file:v1"
        role_urn: "beam:artifact:role:go_worker_binary:v1"
      >
    >
  >
>
root_transform_ids: "e2"
root_transform_ids: "s1"
root_transform_ids: "e3"
root_transform_ids: "s3"
requirements: "beam:requirement:pardo:splittable_dofn:v1"
2022/09/05 11:21:26 Cross-compiling <https://ci-beam.apache.org/job/beam_PostCommit_XVR_Direct/ws/src/sdks/go/test/integration/io/xlang/jdbc/jdbc_test.go> as /tmp/worker-4-1662376886446913709
2022/09/05 11:21:28 Prepared job with id: go-testjdbcio_postgresreadwrite-418-a7ea97d5-4809-4d5b-b1ef-fc9e41138cb2 and staging token: go-testjdbcio_postgresreadwrite-418-a7ea97d5-4809-4d5b-b1ef-fc9e41138cb2
2022/09/05 11:21:28 Staged binary artifact with token: 
2022/09/05 11:21:28 Submitted job: go-testjdbcio_postgresreadwrite-418-a7ea97d5-4809-4d5b-b1ef-fc9e41138cb2
2022/09/05 11:21:28 2022-09-05 11:21:28. (6): ==================== <function expand_sdf at 0x7f479f4cab00> ====================
2022/09/05 11:21:28 2022-09-05 11:21:28. (7): ==================== <function expand_gbk at 0x7f479f4cab90> ====================
2022/09/05 11:21:28 2022-09-05 11:21:28. (8): ==================== <function sink_flattens at 0x7f479f4cacb0> ====================
2022/09/05 11:21:28 2022-09-05 11:21:28. (9): ==================== <function greedily_fuse at 0x7f479f4cad40> ====================
2022/09/05 11:21:28 2022-09-05 11:21:28. (10): ==================== <function read_to_impulse at 0x7f479f4cadd0> ====================
2022/09/05 11:21:28 2022-09-05 11:21:28. (11): ==================== <function impulse_to_input at 0x7f479f4cae60> ====================
2022/09/05 11:21:28 2022-09-05 11:21:28. (12): ==================== <function sort_stages at 0x7f479f4cb0e0> ====================
2022/09/05 11:21:28 2022-09-05 11:21:28. (13): ==================== <function add_impulse_to_dangling_transforms at 0x7f479f4cb200> ====================
2022/09/05 11:21:28 2022-09-05 11:21:28. (14): ==================== <function setup_timer_mapping at 0x7f479f4cb050> ====================
2022/09/05 11:21:28 2022-09-05 11:21:28. (15): ==================== <function populate_data_channel_coders at 0x7f479f4cb170> ====================
2022/09/05 11:21:28 Job state: STOPPED
2022/09/05 11:21:28 Job state: STARTING
2022/09/05 11:21:28 Job state: RUNNING
2022/09/05 11:21:28 2022-09-05 11:21:28. (16): starting control server on port 37941
2022/09/05 11:21:28 2022-09-05 11:21:28. (17): starting data server on port 39297
2022/09/05 11:21:28 2022-09-05 11:21:28. (18): starting state server on port 41833
2022/09/05 11:21:28 2022-09-05 11:21:28. (19): starting logging server on port 40185
2022/09/05 11:21:28 2022-09-05 11:21:28. (20): Created Worker handler <apache_beam.runners.portability.fn_api_runner.worker_handlers.DockerSdkWorkerHandler object at 0x7f479daacad0> for environment EBGazLfspGbeam:env:docker:v1 (beam:env:docker:v1, b'\n apache/beam_java8_sdk:2.42.0.dev')
2022/09/05 11:21:28 2022-09-05 11:21:28. (21): Attempting to pull image apache/beam_java8_sdk:2.42.0.dev
2022/09/05 11:21:29 2022-09-05 11:21:29. (22): Unable to pull image apache/beam_java8_sdk:2.42.0.dev, defaulting to local image if it exists
2022/09/05 11:21:32 2022-09-05 11:21:32. (23): Waiting for docker to start up. Current status is running
2022/09/05 11:21:32 2022-09-05 11:21:32. (24): Docker container is running. container_id = b'd40116d36b138b2a720050b6570de4f0959e02c44101184af5ac24c1ec2b08b5', worker_id = worker_16
2022/09/05 11:21:33 2022-09-05 11:21:33. (25): Created Worker handler <apache_beam.runners.portability.fn_api_runner.worker_handlers.DockerSdkWorkerHandler object at 0x7f479da541d0> for environment go (beam:env:docker:v1, b'\n\x16apache/beam_go_sdk:dev')
2022/09/05 11:21:35 2022-09-05 11:21:35. (26): Attempting to pull image apache/beam_go_sdk:dev
2022/09/05 11:21:36 2022-09-05 11:21:36. (27): Unable to pull image apache/beam_go_sdk:dev, defaulting to local image if it exists
2022/09/05 11:21:36 2022-09-05 11:21:36. (28): Waiting for docker to start up. Current status is running
2022/09/05 11:21:36 2022-09-05 11:21:36. (29): Docker container is running. container_id = b'1d9ef626af2f46c839c71dc6486b2c99b145006530325f89c04a2cbf5f6766b5', worker_id = worker_18
2022/09/05 11:21:41 2022-09-05 11:21:41. (30): Completed job in 12.938554763793945 seconds with state DONE.
2022/09/05 11:21:41 Job state: DONE
--- PASS: TestJDBCIO_PostgresReadWrite (35.60s)
PASS
ok  	github.com/apache/beam/sdks/v2/go/test/integration/io/xlang/jdbc	92.314s
=== RUN   TestKafkaIO_BasicReadWrite
    integration.go:308: Test TestKafkaIO_BasicReadWrite is currently filtered for runner portable
--- SKIP: TestKafkaIO_BasicReadWrite (0.00s)
PASS
ok  	github.com/apache/beam/sdks/v2/go/test/integration/io/xlang/kafka	6.036s

> Task :sdks:python:test-suites:direct:xlang:validatesCrossLanguageRunnerJavaUsingPython

org.apache.beam.sdk.extensions.python.transforms.RunInferenceTransformTest > testRunInferenceWithKVs FAILED
    java.lang.IllegalStateException at RunInferenceTransformTest.java:108
    java.lang.NullPointerException at Preconditions.java:980

org.apache.beam.sdk.extensions.python.transforms.RunInferenceTransformTest > testRunInference FAILED
    java.lang.IllegalStateException at RunInferenceTransformTest.java:60
    java.lang.NullPointerException at Preconditions.java:980

16 tests completed, 2 failed, 2 skipped

> Task :sdks:python:test-suites:direct:xlang:validatesCrossLanguageRunnerJavaUsingPython FAILED
> Task :sdks:python:test-suites:direct:xlang:validatesCrossLanguageRunnerPythonUsingJava
> Task :sdks:python:test-suites:direct:xlang:validatesCrossLanguageRunnerPythonUsingSql
> Task :sdks:python:test-suites:direct:xlang:validatesCrossLanguageRunnerCleanup
> Task :sdks:python:test-suites:direct:xlang:fnApiJobServerCleanup

FAILURE: Build failed with an exception.

* What went wrong:
Execution failed for task ':sdks:python:test-suites:direct:xlang:validatesCrossLanguageRunnerJavaUsingPython'.
> There were failing tests. See the report at: file://<https://ci-beam.apache.org/job/beam_PostCommit_XVR_Direct/ws/src/sdks/python/test-suites/direct/xlang/build/reports/tests/validatesCrossLanguageRunnerJavaUsingPython/index.html>

* Try:
> Run with --stacktrace option to get the stack trace.
> Run with --info or --debug option to get more log output.
> Run with --scan to get full insights.

* Get more help at https://help.gradle.org

Deprecated Gradle features were used in this build, making it incompatible with Gradle 8.0.

You can use '--warning-mode all' to show the individual deprecation warnings and determine if they come from your own scripts or plugins.

See https://docs.gradle.org/7.4/userguide/command_line_interface.html#sec:command_line_warnings

Execution optimizations have been disabled for 1 invalid unit(s) of work during this build to ensure correctness.
Please consult deprecation warnings for more details.

BUILD FAILED in 25m 4s
247 actionable tasks: 162 executed, 73 from cache, 12 up-to-date

Publishing build scan...
https://gradle.com/s/vr7fi4mssiywk

Build step 'Invoke Gradle script' changed build result to FAILURE
Build step 'Invoke Gradle script' marked build as failure

---------------------------------------------------------------------
To unsubscribe, e-mail: builds-unsubscribe@beam.apache.org
For additional commands, e-mail: builds-help@beam.apache.org


Jenkins build is back to normal : beam_PostCommit_XVR_Direct #3110

Posted by Apache Jenkins Server <je...@builds.apache.org>.
See <https://ci-beam.apache.org/job/beam_PostCommit_XVR_Direct/3110/display/redirect?page=changes>


---------------------------------------------------------------------
To unsubscribe, e-mail: builds-unsubscribe@beam.apache.org
For additional commands, e-mail: builds-help@beam.apache.org


Build failed in Jenkins: beam_PostCommit_XVR_Direct #3109

Posted by Apache Jenkins Server <je...@builds.apache.org>.
See <https://ci-beam.apache.org/job/beam_PostCommit_XVR_Direct/3109/display/redirect?page=changes>

Changes:

[Kenneth Knowles] Cosmetic checkstyle fix to TextRowCountEstimator

[Kenneth Knowles] Upgrade to Gradle 7.5.1

[Heejong Lee] [BEAM-22856] PythonService Beam version compatibility


------------------------------------------
[...truncated 1.43 MB...]
INFO     root:portable_runner.py:577 Default Python SDK image for environment is apache/beam_python3.7_sdk:2.42.0.dev
INFO     root:portable_runner.py:577 ==================== <function annotate_downstream_side_inputs at 0x7f9312deb8c0> ====================
INFO     root:portable_runner.py:577 ==================== <function fix_side_input_pcoll_coders at 0x7f9312deb9e0> ====================
INFO     root:portable_runner.py:577 ==================== <function pack_combiners at 0x7f9312debef0> ====================
INFO     root:portable_runner.py:577 ==================== <function lift_combiners at 0x7f9312debf80> ====================
INFO     root:portable_runner.py:577 ==================== <function expand_sdf at 0x7f9312dec170> ====================
INFO     root:portable_runner.py:577 ==================== <function expand_gbk at 0x7f9312dec200> ====================
INFO     root:portable_runner.py:577 ==================== <function sink_flattens at 0x7f9312dec320> ====================
INFO     root:portable_runner.py:577 ==================== <function greedily_fuse at 0x7f9312dec3b0> ====================
INFO     root:portable_runner.py:577 ==================== <function read_to_impulse at 0x7f9312dec440> ====================
INFO     root:portable_runner.py:577 ==================== <function impulse_to_input at 0x7f9312dec4d0> ====================
INFO     root:portable_runner.py:577 ==================== <function sort_stages at 0x7f9312dec710> ====================
INFO     root:portable_runner.py:577 ==================== <function add_impulse_to_dangling_transforms at 0x7f9312dec830> ====================
INFO     root:portable_runner.py:577 ==================== <function setup_timer_mapping at 0x7f9312dec680> ====================
INFO     root:portable_runner.py:577 ==================== <function populate_data_channel_coders at 0x7f9312dec7a0> ====================
INFO     root:portable_runner.py:577 starting control server on port 44903
INFO     root:portable_runner.py:577 starting data server on port 39657
INFO     root:portable_runner.py:577 starting state server on port 41671
INFO     root:portable_runner.py:577 starting logging server on port 38287
INFO     root:portable_runner.py:577 Created Worker handler <apache_beam.runners.portability.fn_api_runner.worker_handlers.DockerSdkWorkerHandler object at 0x7f93396cff50> for environment ref_Environment_default_environment_2 (beam:env:docker:v1, b'\n$apache/beam_python3.7_sdk:2.42.0.dev')
INFO     root:portable_runner.py:577 Attempting to pull image apache/beam_python3.7_sdk:2.42.0.dev
INFO     root:portable_runner.py:577 Unable to pull image apache/beam_python3.7_sdk:2.42.0.dev, defaulting to local image if it exists
INFO     root:portable_runner.py:577 Waiting for docker to start up. Current status is running
INFO     root:portable_runner.py:577 Docker container is running. container_id = b'0a87954e4565a8abb387ed000e0c0553f0ef0eac0dee4a56c2990507746c8af1', worker_id = worker_79
INFO     root:portable_runner.py:577 Created Worker handler <apache_beam.runners.portability.fn_api_runner.worker_handlers.DockerSdkWorkerHandler object at 0x7f93396cae50> for environment external_7beam:env:docker:v1 (beam:env:docker:v1, b'\n apache/beam_java8_sdk:2.42.0.dev')
INFO     root:portable_runner.py:577 Attempting to pull image apache/beam_java8_sdk:2.42.0.dev
INFO     root:portable_runner.py:577 Unable to pull image apache/beam_java8_sdk:2.42.0.dev, defaulting to local image if it exists
INFO     root:portable_runner.py:577 Waiting for docker to start up. Current status is running
INFO     root:portable_runner.py:577 Docker container is running. container_id = b'1100086efdfe583b97019c685ec4504e1405e0f7c84e3f53379c3a9286b4c25a', worker_id = worker_80
INFO     root:portable_runner.py:577 Completed job in 13.238803386688232 seconds with state DONE.
INFO     apache_beam.runners.portability.portable_runner:portable_runner.py:583 Job state changed to DONE
PASSED                                                                   [ 77%]
apache_beam/transforms/sql_test.py::SqlTransformTest::test_windowing_before_sql 
-------------------------------- live log call ---------------------------------
INFO     apache_beam.utils.subprocess_server:subprocess_server.py:239 Using pre-built snapshot at <https://ci-beam.apache.org/job/beam_PostCommit_XVR_Direct/ws/src/sdks/java/extensions/sql/expansion-service/build/libs/beam-sdks-java-extensions-sql-expansion-service-2.42.0-SNAPSHOT.jar>
INFO     root:external.py:773 Starting a JAR-based expansion service from JAR <https://ci-beam.apache.org/job/beam_PostCommit_XVR_Direct/ws/src/sdks/java/extensions/sql/expansion-service/build/libs/beam-sdks-java-extensions-sql-expansion-service-2.42.0-SNAPSHOT.jar> 
INFO     apache_beam.utils.subprocess_server:subprocess_server.py:116 Starting service with ['java' '-jar' '<https://ci-beam.apache.org/job/beam_PostCommit_XVR_Direct/ws/src/sdks/java/extensions/sql/expansion-service/build/libs/beam-sdks-java-extensions-sql-expansion-service-2.42.0-SNAPSHOT.jar'> '60205' '--filesToStage=<https://ci-beam.apache.org/job/beam_PostCommit_XVR_Direct/ws/src/sdks/java/extensions/sql/expansion-service/build/libs/beam-sdks-java-extensions-sql-expansion-service-2.42.0-SNAPSHOT.jar']>
INFO     apache_beam.utils.subprocess_server:subprocess_server.py:126 Starting expansion service at localhost:60205
INFO     apache_beam.utils.subprocess_server:subprocess_server.py:126 Sep 07, 2022 5:34:44 AM org.apache.beam.sdk.expansion.service.ExpansionService loadRegisteredTransforms
INFO     apache_beam.utils.subprocess_server:subprocess_server.py:126 INFO: Registering external transforms: [beam:external:java:sql:v1, beam:transform:org.apache.beam:pubsub_read:v1, beam:transform:org.apache.beam:pubsub_write:v1, beam:transform:org.apache.beam:pubsublite_write:v1, beam:transform:org.apache.beam:pubsublite_read:v1, beam:transform:org.apache.beam:spanner_insert:v1, beam:transform:org.apache.beam:spanner_update:v1, beam:transform:org.apache.beam:spanner_replace:v1, beam:transform:org.apache.beam:spanner_insert_or_update:v1, beam:transform:org.apache.beam:spanner_delete:v1, beam:transform:org.apache.beam:spanner_read:v1, beam:transform:org.apache.beam:kafka_read_with_metadata:v1, beam:transform:org.apache.beam:kafka_read_without_metadata:v1, beam:transform:org.apache.beam:kafka_write:v1, beam:external:java:generate_sequence:v1]
INFO     apache_beam.utils.subprocess_server:subprocess_server.py:126 	beam:external:java:sql:v1: org.apache.beam.sdk.expansion.service.ExpansionService$ExternalTransformRegistrarLoader$1@47eaca72
INFO     apache_beam.utils.subprocess_server:subprocess_server.py:126 	beam:transform:org.apache.beam:pubsub_read:v1: org.apache.beam.sdk.expansion.service.ExpansionService$ExternalTransformRegistrarLoader$1@55141def
INFO     apache_beam.utils.subprocess_server:subprocess_server.py:126 	beam:transform:org.apache.beam:pubsub_write:v1: org.apache.beam.sdk.expansion.service.ExpansionService$ExternalTransformRegistrarLoader$1@55182842
INFO     apache_beam.utils.subprocess_server:subprocess_server.py:126 	beam:transform:org.apache.beam:pubsublite_write:v1: org.apache.beam.sdk.expansion.service.ExpansionService$ExternalTransformRegistrarLoader$1@3270d194
INFO     apache_beam.utils.subprocess_server:subprocess_server.py:126 	beam:transform:org.apache.beam:pubsublite_read:v1: org.apache.beam.sdk.expansion.service.ExpansionService$ExternalTransformRegistrarLoader$1@235834f2
INFO     apache_beam.utils.subprocess_server:subprocess_server.py:126 	beam:transform:org.apache.beam:spanner_insert:v1: org.apache.beam.sdk.expansion.service.ExpansionService$ExternalTransformRegistrarLoader$1@5656be13
INFO     apache_beam.utils.subprocess_server:subprocess_server.py:126 	beam:transform:org.apache.beam:spanner_update:v1: org.apache.beam.sdk.expansion.service.ExpansionService$ExternalTransformRegistrarLoader$1@4218d6a3
INFO     apache_beam.utils.subprocess_server:subprocess_server.py:126 	beam:transform:org.apache.beam:spanner_replace:v1: org.apache.beam.sdk.expansion.service.ExpansionService$ExternalTransformRegistrarLoader$1@76505305
INFO     apache_beam.utils.subprocess_server:subprocess_server.py:126 	beam:transform:org.apache.beam:spanner_insert_or_update:v1: org.apache.beam.sdk.expansion.service.ExpansionService$ExternalTransformRegistrarLoader$1@14cd1699
INFO     apache_beam.utils.subprocess_server:subprocess_server.py:126 	beam:transform:org.apache.beam:spanner_delete:v1: org.apache.beam.sdk.expansion.service.ExpansionService$ExternalTransformRegistrarLoader$1@77888435
INFO     apache_beam.utils.subprocess_server:subprocess_server.py:126 	beam:transform:org.apache.beam:spanner_read:v1: org.apache.beam.sdk.expansion.service.ExpansionService$ExternalTransformRegistrarLoader$1@73a1e9a9
INFO     apache_beam.utils.subprocess_server:subprocess_server.py:126 	beam:transform:org.apache.beam:kafka_read_with_metadata:v1: org.apache.beam.sdk.expansion.service.ExpansionService$ExternalTransformRegistrarLoader$1@71d44a3
INFO     apache_beam.utils.subprocess_server:subprocess_server.py:126 	beam:transform:org.apache.beam:kafka_read_without_metadata:v1: org.apache.beam.sdk.expansion.service.ExpansionService$ExternalTransformRegistrarLoader$1@7b98f307
INFO     apache_beam.utils.subprocess_server:subprocess_server.py:126 	beam:transform:org.apache.beam:kafka_write:v1: org.apache.beam.sdk.expansion.service.ExpansionService$ExternalTransformRegistrarLoader$1@4802796d
INFO     apache_beam.utils.subprocess_server:subprocess_server.py:126 	beam:external:java:generate_sequence:v1: org.apache.beam.sdk.expansion.service.ExpansionService$ExternalTransformRegistrarLoader$1@34123d65
WARNING  root:subprocess_server.py:98 Waiting for grpc channel to be ready at localhost:60205.
INFO     apache_beam.utils.subprocess_server:subprocess_server.py:126 Sep 07, 2022 5:34:48 AM org.apache.beam.sdk.expansion.service.ExpansionService expand
INFO     apache_beam.utils.subprocess_server:subprocess_server.py:126 INFO: Expanding 'SqlTransform(beam:external:java:sql:v1)' with URN 'beam:external:java:sql:v1'
INFO     apache_beam.utils.subprocess_server:subprocess_server.py:126 Sep 07, 2022 5:34:48 AM org.apache.beam.sdk.expansion.service.ExpansionService$ExternalTransformRegistrarLoader payloadToConfig
INFO     apache_beam.utils.subprocess_server:subprocess_server.py:126 WARNING: Configuration class 'org.apache.beam.sdk.extensions.sql.expansion.ExternalSqlTransformRegistrar$Configuration' has no schema registered. Attempting to construct with setter approach.
INFO     apache_beam.utils.subprocess_server:subprocess_server.py:126 Sep 07, 2022 5:34:48 AM org.apache.beam.sdk.expansion.service.ExpansionService$ExternalTransformRegistrarLoader payloadToConfig
INFO     apache_beam.utils.subprocess_server:subprocess_server.py:126 WARNING: Configuration class 'org.apache.beam.sdk.extensions.sql.expansion.ExternalSqlTransformRegistrar$Configuration' has no schema registered. Attempting to construct with setter approach.
INFO     apache_beam.utils.subprocess_server:subprocess_server.py:126 Sep 07, 2022 5:34:50 AM org.apache.beam.sdk.extensions.sql.impl.CalciteQueryPlanner convertToBeamRel
INFO     apache_beam.utils.subprocess_server:subprocess_server.py:126 INFO: SQL:
INFO     apache_beam.utils.subprocess_server:subprocess_server.py:126 SELECT COUNT(*) AS `count`
INFO     apache_beam.utils.subprocess_server:subprocess_server.py:126 FROM `beam`.`PCOLLECTION` AS `PCOLLECTION`
INFO     apache_beam.utils.subprocess_server:subprocess_server.py:126 Sep 07, 2022 5:34:50 AM org.apache.beam.sdk.extensions.sql.impl.CalciteQueryPlanner convertToBeamRel
INFO     apache_beam.utils.subprocess_server:subprocess_server.py:126 INFO: SQLPlan>
INFO     apache_beam.utils.subprocess_server:subprocess_server.py:126 LogicalAggregate(group=[{}], count=[COUNT()])
INFO     apache_beam.utils.subprocess_server:subprocess_server.py:126   BeamIOSourceRel(table=[[beam, PCOLLECTION]])
INFO     apache_beam.utils.subprocess_server:subprocess_server.py:126 
INFO     apache_beam.utils.subprocess_server:subprocess_server.py:126 Sep 07, 2022 5:34:50 AM org.apache.beam.sdk.extensions.sql.impl.CalciteQueryPlanner convertToBeamRel
INFO     apache_beam.utils.subprocess_server:subprocess_server.py:126 INFO: BEAMPlan>
INFO     apache_beam.utils.subprocess_server:subprocess_server.py:126 BeamAggregationRel(group=[{}], count=[COUNT()])
INFO     apache_beam.utils.subprocess_server:subprocess_server.py:126   BeamIOSourceRel(table=[[beam, PCOLLECTION]])
INFO     apache_beam.utils.subprocess_server:subprocess_server.py:126 
INFO     root:environments.py:376 Default Python SDK image for environment is apache/beam_python3.7_sdk:2.42.0.dev
INFO     root:environments.py:299 No image given, using default Python SDK image
INFO     root:environments.py:376 Default Python SDK image for environment is apache/beam_python3.7_sdk:2.42.0.dev
INFO     root:environments.py:304 Python SDK container image set to "apache/beam_python3.7_sdk:2.42.0.dev" for Docker environment
INFO     apache_beam.runners.portability.fn_api_runner.translations:translations.py:714 ==================== <function pack_combiners at 0x7fae8a462320> ====================
INFO     apache_beam.runners.portability.fn_api_runner.translations:translations.py:714 ==================== <function lift_combiners at 0x7fae8a4623b0> ====================
INFO     apache_beam.runners.portability.fn_api_runner.translations:translations.py:714 ==================== <function sort_stages at 0x7fae8a462b00> ====================
INFO     apache_beam.runners.portability.portable_runner:portable_runner.py:583 Job state changed to STOPPED
INFO     apache_beam.runners.portability.portable_runner:portable_runner.py:583 Job state changed to STARTING
INFO     apache_beam.runners.portability.portable_runner:portable_runner.py:583 Job state changed to RUNNING
INFO     root:portable_runner.py:577 Default Python SDK image for environment is apache/beam_python3.7_sdk:2.42.0.dev
INFO     root:portable_runner.py:577 ==================== <function annotate_downstream_side_inputs at 0x7f9312deb8c0> ====================
INFO     root:portable_runner.py:577 ==================== <function fix_side_input_pcoll_coders at 0x7f9312deb9e0> ====================
INFO     root:portable_runner.py:577 ==================== <function pack_combiners at 0x7f9312debef0> ====================
INFO     root:portable_runner.py:577 ==================== <function lift_combiners at 0x7f9312debf80> ====================
INFO     root:portable_runner.py:577 ==================== <function expand_sdf at 0x7f9312dec170> ====================
INFO     root:portable_runner.py:577 ==================== <function expand_gbk at 0x7f9312dec200> ====================
INFO     root:portable_runner.py:577 ==================== <function sink_flattens at 0x7f9312dec320> ====================
INFO     root:portable_runner.py:577 ==================== <function greedily_fuse at 0x7f9312dec3b0> ====================
INFO     root:portable_runner.py:577 ==================== <function read_to_impulse at 0x7f9312dec440> ====================
INFO     root:portable_runner.py:577 ==================== <function impulse_to_input at 0x7f9312dec4d0> ====================
INFO     root:portable_runner.py:577 ==================== <function sort_stages at 0x7f9312dec710> ====================
INFO     root:portable_runner.py:577 ==================== <function add_impulse_to_dangling_transforms at 0x7f9312dec830> ====================
INFO     root:portable_runner.py:577 ==================== <function setup_timer_mapping at 0x7f9312dec680> ====================
INFO     root:portable_runner.py:577 ==================== <function populate_data_channel_coders at 0x7f9312dec7a0> ====================
INFO     root:portable_runner.py:577 starting control server on port 36297
INFO     root:portable_runner.py:577 starting data server on port 36227
INFO     root:portable_runner.py:577 starting state server on port 41411
INFO     root:portable_runner.py:577 starting logging server on port 33971
INFO     root:portable_runner.py:577 Created Worker handler <apache_beam.runners.portability.fn_api_runner.worker_handlers.DockerSdkWorkerHandler object at 0x7f93396ca210> for environment ref_Environment_default_environment_2 (beam:env:docker:v1, b'\n$apache/beam_python3.7_sdk:2.42.0.dev')
INFO     root:portable_runner.py:577 Attempting to pull image apache/beam_python3.7_sdk:2.42.0.dev
INFO     root:portable_runner.py:577 Unable to pull image apache/beam_python3.7_sdk:2.42.0.dev, defaulting to local image if it exists
INFO     root:portable_runner.py:577 Waiting for docker to start up. Current status is running
INFO     root:portable_runner.py:577 Docker container is running. container_id = b'9faf4904f274afdd684061655a946863bc7efc75c4a0dadd395b0a1146452075', worker_id = worker_81
INFO     root:portable_runner.py:577 Created Worker handler <apache_beam.runners.portability.fn_api_runner.worker_handlers.DockerSdkWorkerHandler object at 0x7f9339655550> for environment external_8beam:env:docker:v1 (beam:env:docker:v1, b'\n apache/beam_java8_sdk:2.42.0.dev')
INFO     root:portable_runner.py:577 Attempting to pull image apache/beam_java8_sdk:2.42.0.dev
INFO     root:portable_runner.py:577 Unable to pull image apache/beam_java8_sdk:2.42.0.dev, defaulting to local image if it exists
INFO     root:portable_runner.py:577 Waiting for docker to start up. Current status is running
INFO     root:portable_runner.py:577 Docker container is running. container_id = b'884b6ea2b2b51934eeb4b541a00004a0b7503bb3beea2167b3266c28967d8ca9', worker_id = worker_82
INFO     root:portable_runner.py:577 Completed job in 12.95447587966919 seconds with state DONE.
INFO     apache_beam.runners.portability.portable_runner:portable_runner.py:583 Job state changed to DONE
PASSED                                                                   [ 88%]
apache_beam/transforms/sql_test.py::SqlTransformTest::test_zetasql_generate_data 
-------------------------------- live log call ---------------------------------
INFO     apache_beam.utils.subprocess_server:subprocess_server.py:239 Using pre-built snapshot at <https://ci-beam.apache.org/job/beam_PostCommit_XVR_Direct/ws/src/sdks/java/extensions/sql/expansion-service/build/libs/beam-sdks-java-extensions-sql-expansion-service-2.42.0-SNAPSHOT.jar>
INFO     root:external.py:773 Starting a JAR-based expansion service from JAR <https://ci-beam.apache.org/job/beam_PostCommit_XVR_Direct/ws/src/sdks/java/extensions/sql/expansion-service/build/libs/beam-sdks-java-extensions-sql-expansion-service-2.42.0-SNAPSHOT.jar> 
INFO     apache_beam.utils.subprocess_server:subprocess_server.py:116 Starting service with ['java' '-jar' '<https://ci-beam.apache.org/job/beam_PostCommit_XVR_Direct/ws/src/sdks/java/extensions/sql/expansion-service/build/libs/beam-sdks-java-extensions-sql-expansion-service-2.42.0-SNAPSHOT.jar'> '45231' '--filesToStage=<https://ci-beam.apache.org/job/beam_PostCommit_XVR_Direct/ws/src/sdks/java/extensions/sql/expansion-service/build/libs/beam-sdks-java-extensions-sql-expansion-service-2.42.0-SNAPSHOT.jar']>
INFO     apache_beam.utils.subprocess_server:subprocess_server.py:126 Starting expansion service at localhost:45231
INFO     apache_beam.utils.subprocess_server:subprocess_server.py:126 Sep 07, 2022 5:35:12 AM org.apache.beam.sdk.expansion.service.ExpansionService loadRegisteredTransforms
INFO     apache_beam.utils.subprocess_server:subprocess_server.py:126 INFO: Registering external transforms: [beam:external:java:sql:v1, beam:transform:org.apache.beam:pubsub_read:v1, beam:transform:org.apache.beam:pubsub_write:v1, beam:transform:org.apache.beam:pubsublite_write:v1, beam:transform:org.apache.beam:pubsublite_read:v1, beam:transform:org.apache.beam:spanner_insert:v1, beam:transform:org.apache.beam:spanner_update:v1, beam:transform:org.apache.beam:spanner_replace:v1, beam:transform:org.apache.beam:spanner_insert_or_update:v1, beam:transform:org.apache.beam:spanner_delete:v1, beam:transform:org.apache.beam:spanner_read:v1, beam:transform:org.apache.beam:kafka_read_with_metadata:v1, beam:transform:org.apache.beam:kafka_read_without_metadata:v1, beam:transform:org.apache.beam:kafka_write:v1, beam:external:java:generate_sequence:v1]
INFO     apache_beam.utils.subprocess_server:subprocess_server.py:126 	beam:external:java:sql:v1: org.apache.beam.sdk.expansion.service.ExpansionService$ExternalTransformRegistrarLoader$1@47eaca72
INFO     apache_beam.utils.subprocess_server:subprocess_server.py:126 	beam:transform:org.apache.beam:pubsub_read:v1: org.apache.beam.sdk.expansion.service.ExpansionService$ExternalTransformRegistrarLoader$1@55141def
INFO     apache_beam.utils.subprocess_server:subprocess_server.py:126 	beam:transform:org.apache.beam:pubsub_write:v1: org.apache.beam.sdk.expansion.service.ExpansionService$ExternalTransformRegistrarLoader$1@55182842
INFO     apache_beam.utils.subprocess_server:subprocess_server.py:126 	beam:transform:org.apache.beam:pubsublite_write:v1: org.apache.beam.sdk.expansion.service.ExpansionService$ExternalTransformRegistrarLoader$1@3270d194
INFO     apache_beam.utils.subprocess_server:subprocess_server.py:126 	beam:transform:org.apache.beam:pubsublite_read:v1: org.apache.beam.sdk.expansion.service.ExpansionService$ExternalTransformRegistrarLoader$1@235834f2
INFO     apache_beam.utils.subprocess_server:subprocess_server.py:126 	beam:transform:org.apache.beam:spanner_insert:v1: org.apache.beam.sdk.expansion.service.ExpansionService$ExternalTransformRegistrarLoader$1@5656be13
INFO     apache_beam.utils.subprocess_server:subprocess_server.py:126 	beam:transform:org.apache.beam:spanner_update:v1: org.apache.beam.sdk.expansion.service.ExpansionService$ExternalTransformRegistrarLoader$1@4218d6a3
INFO     apache_beam.utils.subprocess_server:subprocess_server.py:126 	beam:transform:org.apache.beam:spanner_replace:v1: org.apache.beam.sdk.expansion.service.ExpansionService$ExternalTransformRegistrarLoader$1@76505305
INFO     apache_beam.utils.subprocess_server:subprocess_server.py:126 	beam:transform:org.apache.beam:spanner_insert_or_update:v1: org.apache.beam.sdk.expansion.service.ExpansionService$ExternalTransformRegistrarLoader$1@14cd1699
INFO     apache_beam.utils.subprocess_server:subprocess_server.py:126 	beam:transform:org.apache.beam:spanner_delete:v1: org.apache.beam.sdk.expansion.service.ExpansionService$ExternalTransformRegistrarLoader$1@77888435
INFO     apache_beam.utils.subprocess_server:subprocess_server.py:126 	beam:transform:org.apache.beam:spanner_read:v1: org.apache.beam.sdk.expansion.service.ExpansionService$ExternalTransformRegistrarLoader$1@73a1e9a9
INFO     apache_beam.utils.subprocess_server:subprocess_server.py:126 	beam:transform:org.apache.beam:kafka_read_with_metadata:v1: org.apache.beam.sdk.expansion.service.ExpansionService$ExternalTransformRegistrarLoader$1@71d44a3
INFO     apache_beam.utils.subprocess_server:subprocess_server.py:126 	beam:transform:org.apache.beam:kafka_read_without_metadata:v1: org.apache.beam.sdk.expansion.service.ExpansionService$ExternalTransformRegistrarLoader$1@7b98f307
INFO     apache_beam.utils.subprocess_server:subprocess_server.py:126 	beam:transform:org.apache.beam:kafka_write:v1: org.apache.beam.sdk.expansion.service.ExpansionService$ExternalTransformRegistrarLoader$1@4802796d
INFO     apache_beam.utils.subprocess_server:subprocess_server.py:126 	beam:external:java:generate_sequence:v1: org.apache.beam.sdk.expansion.service.ExpansionService$ExternalTransformRegistrarLoader$1@34123d65
INFO     apache_beam.utils.subprocess_server:subprocess_server.py:126 Sep 07, 2022 5:35:14 AM org.apache.beam.sdk.expansion.service.ExpansionService expand
INFO     apache_beam.utils.subprocess_server:subprocess_server.py:126 INFO: Expanding 'SqlTransform(beam:external:java:sql:v1)' with URN 'beam:external:java:sql:v1'
INFO     apache_beam.utils.subprocess_server:subprocess_server.py:126 Sep 07, 2022 5:35:14 AM org.apache.beam.sdk.expansion.service.ExpansionService$ExternalTransformRegistrarLoader payloadToConfig
INFO     apache_beam.utils.subprocess_server:subprocess_server.py:126 WARNING: Configuration class 'org.apache.beam.sdk.extensions.sql.expansion.ExternalSqlTransformRegistrar$Configuration' has no schema registered. Attempting to construct with setter approach.
INFO     apache_beam.utils.subprocess_server:subprocess_server.py:126 Sep 07, 2022 5:35:14 AM org.apache.beam.sdk.expansion.service.ExpansionService$ExternalTransformRegistrarLoader payloadToConfig
INFO     apache_beam.utils.subprocess_server:subprocess_server.py:126 WARNING: Configuration class 'org.apache.beam.sdk.extensions.sql.expansion.ExternalSqlTransformRegistrar$Configuration' has no schema registered. Attempting to construct with setter approach.
INFO     apache_beam.utils.subprocess_server:subprocess_server.py:126 Sep 07, 2022 5:35:16 AM com.google.zetasql.io.grpc.NameResolverRegistry getDefaultRegistry
INFO     apache_beam.utils.subprocess_server:subprocess_server.py:126 WARNING: No NameResolverProviders found via ServiceLoader, including for DNS. This is probably due to a broken build. If using ProGuard, check your configuration
INFO     apache_beam.utils.subprocess_server:subprocess_server.py:126 Sep 07, 2022 5:35:18 AM org.apache.beam.sdk.extensions.sql.zetasql.ZetaSQLQueryPlanner convertToBeamRelInternal
INFO     apache_beam.utils.subprocess_server:subprocess_server.py:126 INFO: BEAMPlan>
INFO     apache_beam.utils.subprocess_server:subprocess_server.py:126 BeamZetaSqlCalcRel(expr#0=[{inputs}], expr#1=[1:BIGINT], expr#2=['foo':VARCHAR], expr#3=[3.1400000000000001243E0:DOUBLE], int=[$t1], str=[$t2], flt=[$t3])
INFO     apache_beam.utils.subprocess_server:subprocess_server.py:126   BeamValuesRel(tuples=[[{ 0 }]])
INFO     apache_beam.utils.subprocess_server:subprocess_server.py:126 
INFO     root:environments.py:376 Default Python SDK image for environment is apache/beam_python3.7_sdk:2.42.0.dev
INFO     root:environments.py:299 No image given, using default Python SDK image
INFO     root:environments.py:376 Default Python SDK image for environment is apache/beam_python3.7_sdk:2.42.0.dev
INFO     root:environments.py:304 Python SDK container image set to "apache/beam_python3.7_sdk:2.42.0.dev" for Docker environment
INFO     apache_beam.runners.portability.fn_api_runner.translations:translations.py:714 ==================== <function pack_combiners at 0x7fae8a462320> ====================
INFO     apache_beam.runners.portability.fn_api_runner.translations:translations.py:714 ==================== <function lift_combiners at 0x7fae8a4623b0> ====================
INFO     apache_beam.runners.portability.fn_api_runner.translations:translations.py:714 ==================== <function sort_stages at 0x7fae8a462b00> ====================
INFO     apache_beam.runners.portability.portable_runner:portable_runner.py:583 Job state changed to STOPPED
INFO     apache_beam.runners.portability.portable_runner:portable_runner.py:583 Job state changed to STARTING
INFO     apache_beam.runners.portability.portable_runner:portable_runner.py:583 Job state changed to RUNNING
INFO     root:portable_runner.py:577 Default Python SDK image for environment is apache/beam_python3.7_sdk:2.42.0.dev
INFO     root:portable_runner.py:577 ==================== <function annotate_downstream_side_inputs at 0x7f9312deb8c0> ====================
INFO     root:portable_runner.py:577 ==================== <function fix_side_input_pcoll_coders at 0x7f9312deb9e0> ====================
INFO     root:portable_runner.py:577 ==================== <function pack_combiners at 0x7f9312debef0> ====================
INFO     root:portable_runner.py:577 ==================== <function lift_combiners at 0x7f9312debf80> ====================
INFO     root:portable_runner.py:577 ==================== <function expand_sdf at 0x7f9312dec170> ====================
INFO     root:portable_runner.py:577 ==================== <function expand_gbk at 0x7f9312dec200> ====================
INFO     root:portable_runner.py:577 ==================== <function sink_flattens at 0x7f9312dec320> ====================
INFO     root:portable_runner.py:577 ==================== <function greedily_fuse at 0x7f9312dec3b0> ====================
INFO     root:portable_runner.py:577 ==================== <function read_to_impulse at 0x7f9312dec440> ====================
INFO     root:portable_runner.py:577 ==================== <function impulse_to_input at 0x7f9312dec4d0> ====================
INFO     root:portable_runner.py:577 ==================== <function sort_stages at 0x7f9312dec710> ====================
INFO     root:portable_runner.py:577 ==================== <function add_impulse_to_dangling_transforms at 0x7f9312dec830> ====================
INFO     root:portable_runner.py:577 ==================== <function setup_timer_mapping at 0x7f9312dec680> ====================
INFO     root:portable_runner.py:577 ==================== <function populate_data_channel_coders at 0x7f9312dec7a0> ====================
INFO     root:portable_runner.py:577 starting control server on port 44935
INFO     root:portable_runner.py:577 starting data server on port 39063
INFO     root:portable_runner.py:577 starting state server on port 37737
INFO     root:portable_runner.py:577 starting logging server on port 38675
INFO     root:portable_runner.py:577 Created Worker handler <apache_beam.runners.portability.fn_api_runner.worker_handlers.DockerSdkWorkerHandler object at 0x7f92f3fe1ed0> for environment external_9beam:env:docker:v1 (beam:env:docker:v1, b'\n apache/beam_java8_sdk:2.42.0.dev')
INFO     root:portable_runner.py:577 Attempting to pull image apache/beam_java8_sdk:2.42.0.dev
INFO     root:portable_runner.py:577 Unable to pull image apache/beam_java8_sdk:2.42.0.dev, defaulting to local image if it exists
INFO     root:portable_runner.py:577 Waiting for docker to start up. Current status is running
INFO     root:portable_runner.py:577 Docker container is running. container_id = b'51e12bdaab9a4ee2024bbcdad377fa3eb2e92dc9cd019effe1cb987ffb8afe18', worker_id = worker_83
INFO     root:portable_runner.py:577 Created Worker handler <apache_beam.runners.portability.fn_api_runner.worker_handlers.DockerSdkWorkerHandler object at 0x7f933972a750> for environment ref_Environment_default_environment_2 (beam:env:docker:v1, b'\n$apache/beam_python3.7_sdk:2.42.0.dev')
INFO     root:portable_runner.py:577 Attempting to pull image apache/beam_python3.7_sdk:2.42.0.dev
INFO     root:portable_runner.py:577 Unable to pull image apache/beam_python3.7_sdk:2.42.0.dev, defaulting to local image if it exists
INFO     root:portable_runner.py:577 Waiting for docker to start up. Current status is running
INFO     root:portable_runner.py:577 Docker container is running. container_id = b'd2fba382509b0a463f317cd50678f4672830c0cb5cddca4e525b1f51a3e6a72c', worker_id = worker_84
INFO     root:portable_runner.py:577 Completed job in 11.643773794174194 seconds with state DONE.
INFO     apache_beam.runners.portability.portable_runner:portable_runner.py:583 Job state changed to DONE
PASSED                                                                   [100%]

=============================== warnings summary ===============================
../../build/gradleenv/1922375555/lib/python3.7/site-packages/hdfs/config.py:15
  <https://ci-beam.apache.org/job/beam_PostCommit_XVR_Direct/ws/src/build/gradleenv/1922375555/lib/python3.7/site-packages/hdfs/config.py>:15: DeprecationWarning: the imp module is deprecated in favour of importlib; see the module's documentation for alternative uses
    from imp import load_source

../../build/gradleenv/1922375555/lib/python3.7/site-packages/google/api_core/grpc_helpers.py:42
  <https://ci-beam.apache.org/job/beam_PostCommit_XVR_Direct/ws/src/build/gradleenv/1922375555/lib/python3.7/site-packages/google/api_core/grpc_helpers.py>:42: DeprecationWarning: Support for grpcio-gcp is deprecated. This feature will be
              removed from `google-api-core` after January 1, 2024. If you need to
              continue to use this feature, please pin to a specific version of
              `google-api-core`.
    DeprecationWarning,

-- Docs: https://docs.pytest.org/en/stable/how-to/capture-warnings.html
- generated xml file: <https://ci-beam.apache.org/job/beam_PostCommit_XVR_Direct/ws/src/sdks/python/pytest_xlangSqlValidateRunner.xml> -
==== 9 passed, 2 skipped, 6648 deselected, 2 warnings in 239.90s (0:03:59) =====

> Task :sdks:python:test-suites:direct:xlang:fnApiJobServerCleanup
Killing process at 1214270

> Task :sdks:python:test-suites:direct:xlang:validatesCrossLanguageRunnerCleanup
Stopping expansion service pid: 1217101.
Stopping expansion service pid: 1217102.

FAILURE: Build failed with an exception.

* What went wrong:
Execution failed for task ':sdks:python:test-suites:direct:xlang:validatesCrossLanguageRunnerJavaUsingPython'.
> There were failing tests. See the report at: file://<https://ci-beam.apache.org/job/beam_PostCommit_XVR_Direct/ws/src/sdks/python/test-suites/direct/xlang/build/reports/tests/validatesCrossLanguageRunnerJavaUsingPython/index.html>

* Try:
> Run with --stacktrace option to get the stack trace.
> Run with --info or --debug option to get more log output.

* Get more help at https://help.gradle.org

Deprecated Gradle features were used in this build, making it incompatible with Gradle 8.0.

You can use '--warning-mode all' to show the individual deprecation warnings and determine if they come from your own scripts or plugins.

See https://docs.gradle.org/7.5.1/userguide/command_line_interface.html#sec:command_line_warnings

Execution optimizations have been disabled for 1 invalid unit(s) of work during this build to ensure correctness.
Please consult deprecation warnings for more details.

BUILD FAILED in 25m 16s
247 actionable tasks: 195 executed, 42 from cache, 10 up-to-date

Publishing build scan...
https://gradle.com/s/7worzmwxp3vv2

Build step 'Invoke Gradle script' changed build result to FAILURE
Build step 'Invoke Gradle script' marked build as failure

---------------------------------------------------------------------
To unsubscribe, e-mail: builds-unsubscribe@beam.apache.org
For additional commands, e-mail: builds-help@beam.apache.org


Build failed in Jenkins: beam_PostCommit_XVR_Direct #3108

Posted by Apache Jenkins Server <je...@builds.apache.org>.
See <https://ci-beam.apache.org/job/beam_PostCommit_XVR_Direct/3108/display/redirect?page=changes>

Changes:

[Robert Bradshaw] Allow expansion service to choose pickler.

[noreply] Disable singleIterate (#23042)

[Robert Bradshaw] Accept "default" as pickler library.

[Robert Bradshaw] Clarifying comment.


------------------------------------------
[...truncated 1.42 MB...]
INFO     root:portable_runner.py:577 Default Python SDK image for environment is apache/beam_python3.7_sdk:2.42.0.dev
INFO     root:portable_runner.py:577 ==================== <function annotate_downstream_side_inputs at 0x7fb067c1f200> ====================
INFO     root:portable_runner.py:577 ==================== <function fix_side_input_pcoll_coders at 0x7fb067c1f320> ====================
INFO     root:portable_runner.py:577 ==================== <function pack_combiners at 0x7fb067c1f830> ====================
INFO     root:portable_runner.py:577 ==================== <function lift_combiners at 0x7fb067c1f8c0> ====================
INFO     root:portable_runner.py:577 ==================== <function expand_sdf at 0x7fb067c1fa70> ====================
INFO     root:portable_runner.py:577 ==================== <function expand_gbk at 0x7fb067c1fb00> ====================
INFO     root:portable_runner.py:577 ==================== <function sink_flattens at 0x7fb067c1fc20> ====================
INFO     root:portable_runner.py:577 ==================== <function greedily_fuse at 0x7fb067c1fcb0> ====================
INFO     root:portable_runner.py:577 ==================== <function read_to_impulse at 0x7fb067c1fd40> ====================
INFO     root:portable_runner.py:577 ==================== <function impulse_to_input at 0x7fb067c1fdd0> ====================
INFO     root:portable_runner.py:577 ==================== <function sort_stages at 0x7fb067c20050> ====================
INFO     root:portable_runner.py:577 ==================== <function add_impulse_to_dangling_transforms at 0x7fb067c20170> ====================
INFO     root:portable_runner.py:577 ==================== <function setup_timer_mapping at 0x7fb067c1ff80> ====================
INFO     root:portable_runner.py:577 ==================== <function populate_data_channel_coders at 0x7fb067c200e0> ====================
INFO     root:portable_runner.py:577 starting control server on port 40939
INFO     root:portable_runner.py:577 starting data server on port 42683
INFO     root:portable_runner.py:577 starting state server on port 35253
INFO     root:portable_runner.py:577 starting logging server on port 33207
INFO     root:portable_runner.py:577 Created Worker handler <apache_beam.runners.portability.fn_api_runner.worker_handlers.DockerSdkWorkerHandler object at 0x7fb092394890> for environment ref_Environment_default_environment_2 (beam:env:docker:v1, b'\n$apache/beam_python3.7_sdk:2.42.0.dev')
INFO     root:portable_runner.py:577 Attempting to pull image apache/beam_python3.7_sdk:2.42.0.dev
INFO     root:portable_runner.py:577 Unable to pull image apache/beam_python3.7_sdk:2.42.0.dev, defaulting to local image if it exists
INFO     root:portable_runner.py:577 Waiting for docker to start up. Current status is running
INFO     root:portable_runner.py:577 Docker container is running. container_id = b'e76f1915ad7cc3748b92cc1e7c0c89a8b9c9b91cc93517ce723336805d39b21e', worker_id = worker_79
INFO     root:portable_runner.py:577 Created Worker handler <apache_beam.runners.portability.fn_api_runner.worker_handlers.DockerSdkWorkerHandler object at 0x7fb09238b750> for environment external_7beam:env:docker:v1 (beam:env:docker:v1, b'\n apache/beam_java8_sdk:2.42.0.dev')
INFO     root:portable_runner.py:577 Attempting to pull image apache/beam_java8_sdk:2.42.0.dev
INFO     root:portable_runner.py:577 Unable to pull image apache/beam_java8_sdk:2.42.0.dev, defaulting to local image if it exists
INFO     root:portable_runner.py:577 Waiting for docker to start up. Current status is running
INFO     root:portable_runner.py:577 Docker container is running. container_id = b'678782a9efb4bc06ba7a11ede1629bab215712ea2f1dbdcc8c7e170df2f3b4e9', worker_id = worker_80
INFO     root:portable_runner.py:577 Completed job in 17.714826583862305 seconds with state DONE.
INFO     apache_beam.runners.portability.portable_runner:portable_runner.py:583 Job state changed to DONE
PASSED                                                                   [ 77%]
apache_beam/transforms/sql_test.py::SqlTransformTest::test_windowing_before_sql 
-------------------------------- live log call ---------------------------------
INFO     apache_beam.utils.subprocess_server:subprocess_server.py:239 Using pre-built snapshot at <https://ci-beam.apache.org/job/beam_PostCommit_XVR_Direct/ws/src/sdks/java/extensions/sql/expansion-service/build/libs/beam-sdks-java-extensions-sql-expansion-service-2.42.0-SNAPSHOT.jar>
INFO     root:external.py:773 Starting a JAR-based expansion service from JAR <https://ci-beam.apache.org/job/beam_PostCommit_XVR_Direct/ws/src/sdks/java/extensions/sql/expansion-service/build/libs/beam-sdks-java-extensions-sql-expansion-service-2.42.0-SNAPSHOT.jar> 
INFO     apache_beam.utils.subprocess_server:subprocess_server.py:116 Starting service with ['java' '-jar' '<https://ci-beam.apache.org/job/beam_PostCommit_XVR_Direct/ws/src/sdks/java/extensions/sql/expansion-service/build/libs/beam-sdks-java-extensions-sql-expansion-service-2.42.0-SNAPSHOT.jar'> '53615' '--filesToStage=<https://ci-beam.apache.org/job/beam_PostCommit_XVR_Direct/ws/src/sdks/java/extensions/sql/expansion-service/build/libs/beam-sdks-java-extensions-sql-expansion-service-2.42.0-SNAPSHOT.jar']>
INFO     apache_beam.utils.subprocess_server:subprocess_server.py:126 Starting expansion service at localhost:53615
INFO     apache_beam.utils.subprocess_server:subprocess_server.py:126 Sep 06, 2022 11:39:56 PM org.apache.beam.sdk.expansion.service.ExpansionService loadRegisteredTransforms
INFO     apache_beam.utils.subprocess_server:subprocess_server.py:126 INFO: Registering external transforms: [beam:external:java:sql:v1, beam:transform:org.apache.beam:pubsub_read:v1, beam:transform:org.apache.beam:pubsub_write:v1, beam:transform:org.apache.beam:pubsublite_write:v1, beam:transform:org.apache.beam:pubsublite_read:v1, beam:transform:org.apache.beam:spanner_insert:v1, beam:transform:org.apache.beam:spanner_update:v1, beam:transform:org.apache.beam:spanner_replace:v1, beam:transform:org.apache.beam:spanner_insert_or_update:v1, beam:transform:org.apache.beam:spanner_delete:v1, beam:transform:org.apache.beam:spanner_read:v1, beam:transform:org.apache.beam:kafka_read_with_metadata:v1, beam:transform:org.apache.beam:kafka_read_without_metadata:v1, beam:transform:org.apache.beam:kafka_write:v1, beam:external:java:generate_sequence:v1]
INFO     apache_beam.utils.subprocess_server:subprocess_server.py:126 	beam:external:java:sql:v1: org.apache.beam.sdk.expansion.service.ExpansionService$ExternalTransformRegistrarLoader$1@47eaca72
INFO     apache_beam.utils.subprocess_server:subprocess_server.py:126 	beam:transform:org.apache.beam:pubsub_read:v1: org.apache.beam.sdk.expansion.service.ExpansionService$ExternalTransformRegistrarLoader$1@55141def
INFO     apache_beam.utils.subprocess_server:subprocess_server.py:126 	beam:transform:org.apache.beam:pubsub_write:v1: org.apache.beam.sdk.expansion.service.ExpansionService$ExternalTransformRegistrarLoader$1@55182842
INFO     apache_beam.utils.subprocess_server:subprocess_server.py:126 	beam:transform:org.apache.beam:pubsublite_write:v1: org.apache.beam.sdk.expansion.service.ExpansionService$ExternalTransformRegistrarLoader$1@3270d194
INFO     apache_beam.utils.subprocess_server:subprocess_server.py:126 	beam:transform:org.apache.beam:pubsublite_read:v1: org.apache.beam.sdk.expansion.service.ExpansionService$ExternalTransformRegistrarLoader$1@235834f2
INFO     apache_beam.utils.subprocess_server:subprocess_server.py:126 	beam:transform:org.apache.beam:spanner_insert:v1: org.apache.beam.sdk.expansion.service.ExpansionService$ExternalTransformRegistrarLoader$1@5656be13
INFO     apache_beam.utils.subprocess_server:subprocess_server.py:126 	beam:transform:org.apache.beam:spanner_update:v1: org.apache.beam.sdk.expansion.service.ExpansionService$ExternalTransformRegistrarLoader$1@4218d6a3
INFO     apache_beam.utils.subprocess_server:subprocess_server.py:126 	beam:transform:org.apache.beam:spanner_replace:v1: org.apache.beam.sdk.expansion.service.ExpansionService$ExternalTransformRegistrarLoader$1@76505305
INFO     apache_beam.utils.subprocess_server:subprocess_server.py:126 	beam:transform:org.apache.beam:spanner_insert_or_update:v1: org.apache.beam.sdk.expansion.service.ExpansionService$ExternalTransformRegistrarLoader$1@14cd1699
INFO     apache_beam.utils.subprocess_server:subprocess_server.py:126 	beam:transform:org.apache.beam:spanner_delete:v1: org.apache.beam.sdk.expansion.service.ExpansionService$ExternalTransformRegistrarLoader$1@77888435
INFO     apache_beam.utils.subprocess_server:subprocess_server.py:126 	beam:transform:org.apache.beam:spanner_read:v1: org.apache.beam.sdk.expansion.service.ExpansionService$ExternalTransformRegistrarLoader$1@73a1e9a9
INFO     apache_beam.utils.subprocess_server:subprocess_server.py:126 	beam:transform:org.apache.beam:kafka_read_with_metadata:v1: org.apache.beam.sdk.expansion.service.ExpansionService$ExternalTransformRegistrarLoader$1@71d44a3
INFO     apache_beam.utils.subprocess_server:subprocess_server.py:126 	beam:transform:org.apache.beam:kafka_read_without_metadata:v1: org.apache.beam.sdk.expansion.service.ExpansionService$ExternalTransformRegistrarLoader$1@7b98f307
INFO     apache_beam.utils.subprocess_server:subprocess_server.py:126 	beam:transform:org.apache.beam:kafka_write:v1: org.apache.beam.sdk.expansion.service.ExpansionService$ExternalTransformRegistrarLoader$1@4802796d
INFO     apache_beam.utils.subprocess_server:subprocess_server.py:126 	beam:external:java:generate_sequence:v1: org.apache.beam.sdk.expansion.service.ExpansionService$ExternalTransformRegistrarLoader$1@34123d65
INFO     apache_beam.utils.subprocess_server:subprocess_server.py:126 Sep 06, 2022 11:39:58 PM org.apache.beam.sdk.expansion.service.ExpansionService expand
INFO     apache_beam.utils.subprocess_server:subprocess_server.py:126 INFO: Expanding 'SqlTransform(beam:external:java:sql:v1)' with URN 'beam:external:java:sql:v1'
INFO     apache_beam.utils.subprocess_server:subprocess_server.py:126 Sep 06, 2022 11:39:58 PM org.apache.beam.sdk.expansion.service.ExpansionService$ExternalTransformRegistrarLoader payloadToConfig
INFO     apache_beam.utils.subprocess_server:subprocess_server.py:126 WARNING: Configuration class 'org.apache.beam.sdk.extensions.sql.expansion.ExternalSqlTransformRegistrar$Configuration' has no schema registered. Attempting to construct with setter approach.
INFO     apache_beam.utils.subprocess_server:subprocess_server.py:126 Sep 06, 2022 11:39:58 PM org.apache.beam.sdk.expansion.service.ExpansionService$ExternalTransformRegistrarLoader payloadToConfig
INFO     apache_beam.utils.subprocess_server:subprocess_server.py:126 WARNING: Configuration class 'org.apache.beam.sdk.extensions.sql.expansion.ExternalSqlTransformRegistrar$Configuration' has no schema registered. Attempting to construct with setter approach.
INFO     apache_beam.utils.subprocess_server:subprocess_server.py:126 Sep 06, 2022 11:40:00 PM org.apache.beam.sdk.extensions.sql.impl.CalciteQueryPlanner convertToBeamRel
INFO     apache_beam.utils.subprocess_server:subprocess_server.py:126 INFO: SQL:
INFO     apache_beam.utils.subprocess_server:subprocess_server.py:126 SELECT COUNT(*) AS `count`
INFO     apache_beam.utils.subprocess_server:subprocess_server.py:126 FROM `beam`.`PCOLLECTION` AS `PCOLLECTION`
INFO     apache_beam.utils.subprocess_server:subprocess_server.py:126 Sep 06, 2022 11:40:00 PM org.apache.beam.sdk.extensions.sql.impl.CalciteQueryPlanner convertToBeamRel
INFO     apache_beam.utils.subprocess_server:subprocess_server.py:126 INFO: SQLPlan>
INFO     apache_beam.utils.subprocess_server:subprocess_server.py:126 LogicalAggregate(group=[{}], count=[COUNT()])
INFO     apache_beam.utils.subprocess_server:subprocess_server.py:126   BeamIOSourceRel(table=[[beam, PCOLLECTION]])
INFO     apache_beam.utils.subprocess_server:subprocess_server.py:126 
INFO     apache_beam.utils.subprocess_server:subprocess_server.py:126 Sep 06, 2022 11:40:00 PM org.apache.beam.sdk.extensions.sql.impl.CalciteQueryPlanner convertToBeamRel
INFO     apache_beam.utils.subprocess_server:subprocess_server.py:126 INFO: BEAMPlan>
INFO     apache_beam.utils.subprocess_server:subprocess_server.py:126 BeamAggregationRel(group=[{}], count=[COUNT()])
INFO     apache_beam.utils.subprocess_server:subprocess_server.py:126   BeamIOSourceRel(table=[[beam, PCOLLECTION]])
INFO     apache_beam.utils.subprocess_server:subprocess_server.py:126 
INFO     root:environments.py:376 Default Python SDK image for environment is apache/beam_python3.7_sdk:2.42.0.dev
INFO     root:environments.py:299 No image given, using default Python SDK image
INFO     root:environments.py:376 Default Python SDK image for environment is apache/beam_python3.7_sdk:2.42.0.dev
INFO     root:environments.py:304 Python SDK container image set to "apache/beam_python3.7_sdk:2.42.0.dev" for Docker environment
INFO     apache_beam.runners.portability.fn_api_runner.translations:translations.py:714 ==================== <function pack_combiners at 0x7fd1dfc57b90> ====================
INFO     apache_beam.runners.portability.fn_api_runner.translations:translations.py:714 ==================== <function lift_combiners at 0x7fd1dfc57c20> ====================
INFO     apache_beam.runners.portability.fn_api_runner.translations:translations.py:714 ==================== <function sort_stages at 0x7fd1dfc583b0> ====================
INFO     apache_beam.runners.portability.portable_runner:portable_runner.py:583 Job state changed to STOPPED
INFO     apache_beam.runners.portability.portable_runner:portable_runner.py:583 Job state changed to STARTING
INFO     apache_beam.runners.portability.portable_runner:portable_runner.py:583 Job state changed to RUNNING
INFO     root:portable_runner.py:577 Default Python SDK image for environment is apache/beam_python3.7_sdk:2.42.0.dev
INFO     root:portable_runner.py:577 ==================== <function annotate_downstream_side_inputs at 0x7fb067c1f200> ====================
INFO     root:portable_runner.py:577 ==================== <function fix_side_input_pcoll_coders at 0x7fb067c1f320> ====================
INFO     root:portable_runner.py:577 ==================== <function pack_combiners at 0x7fb067c1f830> ====================
INFO     root:portable_runner.py:577 ==================== <function lift_combiners at 0x7fb067c1f8c0> ====================
INFO     root:portable_runner.py:577 ==================== <function expand_sdf at 0x7fb067c1fa70> ====================
INFO     root:portable_runner.py:577 ==================== <function expand_gbk at 0x7fb067c1fb00> ====================
INFO     root:portable_runner.py:577 ==================== <function sink_flattens at 0x7fb067c1fc20> ====================
INFO     root:portable_runner.py:577 ==================== <function greedily_fuse at 0x7fb067c1fcb0> ====================
INFO     root:portable_runner.py:577 ==================== <function read_to_impulse at 0x7fb067c1fd40> ====================
INFO     root:portable_runner.py:577 ==================== <function impulse_to_input at 0x7fb067c1fdd0> ====================
INFO     root:portable_runner.py:577 ==================== <function sort_stages at 0x7fb067c20050> ====================
INFO     root:portable_runner.py:577 ==================== <function add_impulse_to_dangling_transforms at 0x7fb067c20170> ====================
INFO     root:portable_runner.py:577 ==================== <function setup_timer_mapping at 0x7fb067c1ff80> ====================
INFO     root:portable_runner.py:577 ==================== <function populate_data_channel_coders at 0x7fb067c200e0> ====================
INFO     root:portable_runner.py:577 starting control server on port 40803
INFO     root:portable_runner.py:577 starting data server on port 35429
INFO     root:portable_runner.py:577 starting state server on port 44267
INFO     root:portable_runner.py:577 starting logging server on port 45771
INFO     root:portable_runner.py:577 Created Worker handler <apache_beam.runners.portability.fn_api_runner.worker_handlers.DockerSdkWorkerHandler object at 0x7fb0923e3dd0> for environment ref_Environment_default_environment_2 (beam:env:docker:v1, b'\n$apache/beam_python3.7_sdk:2.42.0.dev')
INFO     root:portable_runner.py:577 Attempting to pull image apache/beam_python3.7_sdk:2.42.0.dev
INFO     root:portable_runner.py:577 Unable to pull image apache/beam_python3.7_sdk:2.42.0.dev, defaulting to local image if it exists
INFO     root:portable_runner.py:577 Waiting for docker to start up. Current status is running
INFO     root:portable_runner.py:577 Docker container is running. container_id = b'dc05809a4bdc129badd31be0d5f4e9399ca3552dd04f823660b6dc47601eaaba', worker_id = worker_81
INFO     root:portable_runner.py:577 Created Worker handler <apache_beam.runners.portability.fn_api_runner.worker_handlers.DockerSdkWorkerHandler object at 0x7fb0928d8150> for environment external_8beam:env:docker:v1 (beam:env:docker:v1, b'\n apache/beam_java8_sdk:2.42.0.dev')
INFO     root:portable_runner.py:577 Attempting to pull image apache/beam_java8_sdk:2.42.0.dev
INFO     root:portable_runner.py:577 Unable to pull image apache/beam_java8_sdk:2.42.0.dev, defaulting to local image if it exists
INFO     root:portable_runner.py:577 Waiting for docker to start up. Current status is running
INFO     root:portable_runner.py:577 Docker container is running. container_id = b'dab7c264c370a443cbfbe57dfc24106fa580a2e222bb6375201e8bceb038d1b2', worker_id = worker_82
INFO     root:portable_runner.py:577 Completed job in 16.81438660621643 seconds with state DONE.
INFO     apache_beam.runners.portability.portable_runner:portable_runner.py:583 Job state changed to DONE
PASSED                                                                   [ 88%]
apache_beam/transforms/sql_test.py::SqlTransformTest::test_zetasql_generate_data 
-------------------------------- live log call ---------------------------------
INFO     apache_beam.utils.subprocess_server:subprocess_server.py:239 Using pre-built snapshot at <https://ci-beam.apache.org/job/beam_PostCommit_XVR_Direct/ws/src/sdks/java/extensions/sql/expansion-service/build/libs/beam-sdks-java-extensions-sql-expansion-service-2.42.0-SNAPSHOT.jar>
INFO     root:external.py:773 Starting a JAR-based expansion service from JAR <https://ci-beam.apache.org/job/beam_PostCommit_XVR_Direct/ws/src/sdks/java/extensions/sql/expansion-service/build/libs/beam-sdks-java-extensions-sql-expansion-service-2.42.0-SNAPSHOT.jar> 
INFO     apache_beam.utils.subprocess_server:subprocess_server.py:116 Starting service with ['java' '-jar' '<https://ci-beam.apache.org/job/beam_PostCommit_XVR_Direct/ws/src/sdks/java/extensions/sql/expansion-service/build/libs/beam-sdks-java-extensions-sql-expansion-service-2.42.0-SNAPSHOT.jar'> '43599' '--filesToStage=<https://ci-beam.apache.org/job/beam_PostCommit_XVR_Direct/ws/src/sdks/java/extensions/sql/expansion-service/build/libs/beam-sdks-java-extensions-sql-expansion-service-2.42.0-SNAPSHOT.jar']>
INFO     apache_beam.utils.subprocess_server:subprocess_server.py:126 Starting expansion service at localhost:43599
INFO     apache_beam.utils.subprocess_server:subprocess_server.py:126 Sep 06, 2022 11:40:26 PM org.apache.beam.sdk.expansion.service.ExpansionService loadRegisteredTransforms
INFO     apache_beam.utils.subprocess_server:subprocess_server.py:126 INFO: Registering external transforms: [beam:external:java:sql:v1, beam:transform:org.apache.beam:pubsub_read:v1, beam:transform:org.apache.beam:pubsub_write:v1, beam:transform:org.apache.beam:pubsublite_write:v1, beam:transform:org.apache.beam:pubsublite_read:v1, beam:transform:org.apache.beam:spanner_insert:v1, beam:transform:org.apache.beam:spanner_update:v1, beam:transform:org.apache.beam:spanner_replace:v1, beam:transform:org.apache.beam:spanner_insert_or_update:v1, beam:transform:org.apache.beam:spanner_delete:v1, beam:transform:org.apache.beam:spanner_read:v1, beam:transform:org.apache.beam:kafka_read_with_metadata:v1, beam:transform:org.apache.beam:kafka_read_without_metadata:v1, beam:transform:org.apache.beam:kafka_write:v1, beam:external:java:generate_sequence:v1]
INFO     apache_beam.utils.subprocess_server:subprocess_server.py:126 	beam:external:java:sql:v1: org.apache.beam.sdk.expansion.service.ExpansionService$ExternalTransformRegistrarLoader$1@47eaca72
INFO     apache_beam.utils.subprocess_server:subprocess_server.py:126 	beam:transform:org.apache.beam:pubsub_read:v1: org.apache.beam.sdk.expansion.service.ExpansionService$ExternalTransformRegistrarLoader$1@55141def
INFO     apache_beam.utils.subprocess_server:subprocess_server.py:126 	beam:transform:org.apache.beam:pubsub_write:v1: org.apache.beam.sdk.expansion.service.ExpansionService$ExternalTransformRegistrarLoader$1@55182842
INFO     apache_beam.utils.subprocess_server:subprocess_server.py:126 	beam:transform:org.apache.beam:pubsublite_write:v1: org.apache.beam.sdk.expansion.service.ExpansionService$ExternalTransformRegistrarLoader$1@3270d194
INFO     apache_beam.utils.subprocess_server:subprocess_server.py:126 	beam:transform:org.apache.beam:pubsublite_read:v1: org.apache.beam.sdk.expansion.service.ExpansionService$ExternalTransformRegistrarLoader$1@235834f2
INFO     apache_beam.utils.subprocess_server:subprocess_server.py:126 	beam:transform:org.apache.beam:spanner_insert:v1: org.apache.beam.sdk.expansion.service.ExpansionService$ExternalTransformRegistrarLoader$1@5656be13
INFO     apache_beam.utils.subprocess_server:subprocess_server.py:126 	beam:transform:org.apache.beam:spanner_update:v1: org.apache.beam.sdk.expansion.service.ExpansionService$ExternalTransformRegistrarLoader$1@4218d6a3
INFO     apache_beam.utils.subprocess_server:subprocess_server.py:126 	beam:transform:org.apache.beam:spanner_replace:v1: org.apache.beam.sdk.expansion.service.ExpansionService$ExternalTransformRegistrarLoader$1@76505305
INFO     apache_beam.utils.subprocess_server:subprocess_server.py:126 	beam:transform:org.apache.beam:spanner_insert_or_update:v1: org.apache.beam.sdk.expansion.service.ExpansionService$ExternalTransformRegistrarLoader$1@14cd1699
INFO     apache_beam.utils.subprocess_server:subprocess_server.py:126 	beam:transform:org.apache.beam:spanner_delete:v1: org.apache.beam.sdk.expansion.service.ExpansionService$ExternalTransformRegistrarLoader$1@77888435
INFO     apache_beam.utils.subprocess_server:subprocess_server.py:126 	beam:transform:org.apache.beam:spanner_read:v1: org.apache.beam.sdk.expansion.service.ExpansionService$ExternalTransformRegistrarLoader$1@73a1e9a9
INFO     apache_beam.utils.subprocess_server:subprocess_server.py:126 	beam:transform:org.apache.beam:kafka_read_with_metadata:v1: org.apache.beam.sdk.expansion.service.ExpansionService$ExternalTransformRegistrarLoader$1@71d44a3
INFO     apache_beam.utils.subprocess_server:subprocess_server.py:126 	beam:transform:org.apache.beam:kafka_read_without_metadata:v1: org.apache.beam.sdk.expansion.service.ExpansionService$ExternalTransformRegistrarLoader$1@7b98f307
INFO     apache_beam.utils.subprocess_server:subprocess_server.py:126 	beam:transform:org.apache.beam:kafka_write:v1: org.apache.beam.sdk.expansion.service.ExpansionService$ExternalTransformRegistrarLoader$1@4802796d
INFO     apache_beam.utils.subprocess_server:subprocess_server.py:126 	beam:external:java:generate_sequence:v1: org.apache.beam.sdk.expansion.service.ExpansionService$ExternalTransformRegistrarLoader$1@34123d65
INFO     apache_beam.utils.subprocess_server:subprocess_server.py:126 Sep 06, 2022 11:40:27 PM org.apache.beam.sdk.expansion.service.ExpansionService expand
INFO     apache_beam.utils.subprocess_server:subprocess_server.py:126 INFO: Expanding 'SqlTransform(beam:external:java:sql:v1)' with URN 'beam:external:java:sql:v1'
INFO     apache_beam.utils.subprocess_server:subprocess_server.py:126 Sep 06, 2022 11:40:27 PM org.apache.beam.sdk.expansion.service.ExpansionService$ExternalTransformRegistrarLoader payloadToConfig
INFO     apache_beam.utils.subprocess_server:subprocess_server.py:126 WARNING: Configuration class 'org.apache.beam.sdk.extensions.sql.expansion.ExternalSqlTransformRegistrar$Configuration' has no schema registered. Attempting to construct with setter approach.
INFO     apache_beam.utils.subprocess_server:subprocess_server.py:126 Sep 06, 2022 11:40:27 PM org.apache.beam.sdk.expansion.service.ExpansionService$ExternalTransformRegistrarLoader payloadToConfig
INFO     apache_beam.utils.subprocess_server:subprocess_server.py:126 WARNING: Configuration class 'org.apache.beam.sdk.extensions.sql.expansion.ExternalSqlTransformRegistrar$Configuration' has no schema registered. Attempting to construct with setter approach.
INFO     apache_beam.utils.subprocess_server:subprocess_server.py:126 Sep 06, 2022 11:40:29 PM com.google.zetasql.io.grpc.NameResolverRegistry getDefaultRegistry
INFO     apache_beam.utils.subprocess_server:subprocess_server.py:126 WARNING: No NameResolverProviders found via ServiceLoader, including for DNS. This is probably due to a broken build. If using ProGuard, check your configuration
INFO     apache_beam.utils.subprocess_server:subprocess_server.py:126 Sep 06, 2022 11:40:31 PM org.apache.beam.sdk.extensions.sql.zetasql.ZetaSQLQueryPlanner convertToBeamRelInternal
INFO     apache_beam.utils.subprocess_server:subprocess_server.py:126 INFO: BEAMPlan>
INFO     apache_beam.utils.subprocess_server:subprocess_server.py:126 BeamZetaSqlCalcRel(expr#0=[{inputs}], expr#1=[1:BIGINT], expr#2=['foo':VARCHAR], expr#3=[3.1400000000000001243E0:DOUBLE], int=[$t1], str=[$t2], flt=[$t3])
INFO     apache_beam.utils.subprocess_server:subprocess_server.py:126   BeamValuesRel(tuples=[[{ 0 }]])
INFO     apache_beam.utils.subprocess_server:subprocess_server.py:126 
INFO     root:environments.py:376 Default Python SDK image for environment is apache/beam_python3.7_sdk:2.42.0.dev
INFO     root:environments.py:299 No image given, using default Python SDK image
INFO     root:environments.py:376 Default Python SDK image for environment is apache/beam_python3.7_sdk:2.42.0.dev
INFO     root:environments.py:304 Python SDK container image set to "apache/beam_python3.7_sdk:2.42.0.dev" for Docker environment
INFO     apache_beam.runners.portability.fn_api_runner.translations:translations.py:714 ==================== <function pack_combiners at 0x7fd1dfc57b90> ====================
INFO     apache_beam.runners.portability.fn_api_runner.translations:translations.py:714 ==================== <function lift_combiners at 0x7fd1dfc57c20> ====================
INFO     apache_beam.runners.portability.fn_api_runner.translations:translations.py:714 ==================== <function sort_stages at 0x7fd1dfc583b0> ====================
INFO     apache_beam.runners.portability.portable_runner:portable_runner.py:583 Job state changed to STOPPED
INFO     apache_beam.runners.portability.portable_runner:portable_runner.py:583 Job state changed to STARTING
INFO     apache_beam.runners.portability.portable_runner:portable_runner.py:583 Job state changed to RUNNING
INFO     root:portable_runner.py:577 Default Python SDK image for environment is apache/beam_python3.7_sdk:2.42.0.dev
INFO     root:portable_runner.py:577 ==================== <function annotate_downstream_side_inputs at 0x7fb067c1f200> ====================
INFO     root:portable_runner.py:577 ==================== <function fix_side_input_pcoll_coders at 0x7fb067c1f320> ====================
INFO     root:portable_runner.py:577 ==================== <function pack_combiners at 0x7fb067c1f830> ====================
INFO     root:portable_runner.py:577 ==================== <function lift_combiners at 0x7fb067c1f8c0> ====================
INFO     root:portable_runner.py:577 ==================== <function expand_sdf at 0x7fb067c1fa70> ====================
INFO     root:portable_runner.py:577 ==================== <function expand_gbk at 0x7fb067c1fb00> ====================
INFO     root:portable_runner.py:577 ==================== <function sink_flattens at 0x7fb067c1fc20> ====================
INFO     root:portable_runner.py:577 ==================== <function greedily_fuse at 0x7fb067c1fcb0> ====================
INFO     root:portable_runner.py:577 ==================== <function read_to_impulse at 0x7fb067c1fd40> ====================
INFO     root:portable_runner.py:577 ==================== <function impulse_to_input at 0x7fb067c1fdd0> ====================
INFO     root:portable_runner.py:577 ==================== <function sort_stages at 0x7fb067c20050> ====================
INFO     root:portable_runner.py:577 ==================== <function add_impulse_to_dangling_transforms at 0x7fb067c20170> ====================
INFO     root:portable_runner.py:577 ==================== <function setup_timer_mapping at 0x7fb067c1ff80> ====================
INFO     root:portable_runner.py:577 ==================== <function populate_data_channel_coders at 0x7fb067c200e0> ====================
INFO     root:portable_runner.py:577 starting control server on port 42269
INFO     root:portable_runner.py:577 starting data server on port 33643
INFO     root:portable_runner.py:577 starting state server on port 45195
INFO     root:portable_runner.py:577 starting logging server on port 44919
INFO     root:portable_runner.py:577 Created Worker handler <apache_beam.runners.portability.fn_api_runner.worker_handlers.DockerSdkWorkerHandler object at 0x7fb0929fd210> for environment external_9beam:env:docker:v1 (beam:env:docker:v1, b'\n apache/beam_java8_sdk:2.42.0.dev')
INFO     root:portable_runner.py:577 Attempting to pull image apache/beam_java8_sdk:2.42.0.dev
INFO     root:portable_runner.py:577 Unable to pull image apache/beam_java8_sdk:2.42.0.dev, defaulting to local image if it exists
INFO     root:portable_runner.py:577 Waiting for docker to start up. Current status is running
INFO     root:portable_runner.py:577 Docker container is running. container_id = b'47ce4080142d35a06dcbc3955d4c926671340ec584a8ee849e5a9fda951712ec', worker_id = worker_83
INFO     root:portable_runner.py:577 Created Worker handler <apache_beam.runners.portability.fn_api_runner.worker_handlers.DockerSdkWorkerHandler object at 0x7fb0928e4b10> for environment ref_Environment_default_environment_2 (beam:env:docker:v1, b'\n$apache/beam_python3.7_sdk:2.42.0.dev')
INFO     root:portable_runner.py:577 Attempting to pull image apache/beam_python3.7_sdk:2.42.0.dev
INFO     root:portable_runner.py:577 Unable to pull image apache/beam_python3.7_sdk:2.42.0.dev, defaulting to local image if it exists
INFO     root:portable_runner.py:577 Waiting for docker to start up. Current status is running
INFO     root:portable_runner.py:577 Docker container is running. container_id = b'76fa59b31045918ca6196d4f1186d6f6048b4efafe6e2daabcaf5a9f7866322c', worker_id = worker_84
INFO     root:portable_runner.py:577 Completed job in 11.963207244873047 seconds with state DONE.
INFO     apache_beam.runners.portability.portable_runner:portable_runner.py:583 Job state changed to DONE
PASSED                                                                   [100%]

=============================== warnings summary ===============================
../../build/gradleenv/1922375555/lib/python3.7/site-packages/hdfs/config.py:15
  <https://ci-beam.apache.org/job/beam_PostCommit_XVR_Direct/ws/src/build/gradleenv/1922375555/lib/python3.7/site-packages/hdfs/config.py>:15: DeprecationWarning: the imp module is deprecated in favour of importlib; see the module's documentation for alternative uses
    from imp import load_source

../../build/gradleenv/1922375555/lib/python3.7/site-packages/google/api_core/grpc_helpers.py:42
  <https://ci-beam.apache.org/job/beam_PostCommit_XVR_Direct/ws/src/build/gradleenv/1922375555/lib/python3.7/site-packages/google/api_core/grpc_helpers.py>:42: DeprecationWarning: Support for grpcio-gcp is deprecated. This feature will be
              removed from `google-api-core` after January 1, 2024. If you need to
              continue to use this feature, please pin to a specific version of
              `google-api-core`.
    DeprecationWarning,

-- Docs: https://docs.pytest.org/en/stable/how-to/capture-warnings.html
- generated xml file: <https://ci-beam.apache.org/job/beam_PostCommit_XVR_Direct/ws/src/sdks/python/pytest_xlangSqlValidateRunner.xml> -
==== 9 passed, 2 skipped, 6648 deselected, 2 warnings in 265.43s (0:04:25) =====

> Task :sdks:python:test-suites:direct:xlang:validatesCrossLanguageRunnerCleanup
Stopping expansion service pid: 639278.
Stopping expansion service pid: 639279.

> Task :sdks:python:test-suites:direct:xlang:fnApiJobServerCleanup
Killing process at 624306

FAILURE: Build failed with an exception.

* What went wrong:
Execution failed for task ':sdks:python:test-suites:direct:xlang:validatesCrossLanguageRunnerJavaUsingPython'.
> There were failing tests. See the report at: file://<https://ci-beam.apache.org/job/beam_PostCommit_XVR_Direct/ws/src/sdks/python/test-suites/direct/xlang/build/reports/tests/validatesCrossLanguageRunnerJavaUsingPython/index.html>

* Try:
> Run with --stacktrace option to get the stack trace.
> Run with --info or --debug option to get more log output.
> Run with --scan to get full insights.

* Get more help at https://help.gradle.org

Deprecated Gradle features were used in this build, making it incompatible with Gradle 8.0.

You can use '--warning-mode all' to show the individual deprecation warnings and determine if they come from your own scripts or plugins.

See https://docs.gradle.org/7.4/userguide/command_line_interface.html#sec:command_line_warnings

Execution optimizations have been disabled for 1 invalid unit(s) of work during this build to ensure correctness.
Please consult deprecation warnings for more details.

BUILD FAILED in 30m 21s
247 actionable tasks: 171 executed, 64 from cache, 12 up-to-date

Publishing build scan...
https://gradle.com/s/5sl2gkckxjena

Build step 'Invoke Gradle script' changed build result to FAILURE
Build step 'Invoke Gradle script' marked build as failure

---------------------------------------------------------------------
To unsubscribe, e-mail: builds-unsubscribe@beam.apache.org
For additional commands, e-mail: builds-help@beam.apache.org


Build failed in Jenkins: beam_PostCommit_XVR_Direct #3107

Posted by Apache Jenkins Server <je...@builds.apache.org>.
See <https://ci-beam.apache.org/job/beam_PostCommit_XVR_Direct/3107/display/redirect?page=changes>

Changes:

[Brian Hulette] Use typehints in benchmark utilities

[oleg.borisevich] fixing condition for db index creation

[noreply] Allow users to pass classloader to dynamically load JDBC drivers.

[noreply] Fix withCheckStopReadingFn to not cause the pipeline to crash (#22962)

[noreply] Inference benchmark tests (#21738)

[noreply] [Go SDK]: Add support for Google Cloud Profiler for pipelines (#22824)

[noreply] Listen to window messages to switch SDK and to load content (#22959)


------------------------------------------
[...truncated 1.21 MB...]
      spec: <
        urn: "beam:coder:row:v1"
        payload: "\n\r\n\007role_id\032\002\020\004\022$8b128d57-5f4b-48c1-8a97-06a8eab278b4"
      >
    >
  >
  coders: <
    key: "rsJLAdrDNvSnappyCoder"
    value: <
      spec: <
        urn: "beam:coders:javasdk:0.1"
        payload: "\202SNAPPY\000\000\000\000\001\000\000\000\001\000\000\001.\307\003\360@\254\355\000\005sr\000&org.apache.beam.sdk.coders.SnappyCoder1\033\243\356\177\362\366,\002\000\001L\000\ninner\005\030 t\000\"Lorg/a\005B\000/\001B\020/sdk/\tB\000/\005$\020;xr\000*ng\000 tructured\005/8s\277\022\016\325\3246\021\002\000\000xr\000 j9\000\005/\034C\335\325\211\256\274~\370\001/\020psr\000,j1\000,Serializable\005= \010\364 \216\305ynl\002\001\327\\\004typet\000\021Ljava/lang/Class\001\300n'\001\024Custom\005PPj\260\010\235\013;\035\013\002\000\000xq\000~\000\003vr\000$N\221\000\\io.BoundedSource!`v\023\177\370QA\0019\010r\000\035Z3\000\t,0\020\213\372\020Y\214\347\323\002\000\000xp"
      >
    >
  >
  coders: <
    key: "rsJLAdrDNvTimestampedValueCoder"
    value: <
      spec: <
        urn: "beam:coders:javasdk:0.1"
        payload: "\202SNAPPY\000\000\000\000\001\000\000\000\001\000\000\006^\313\026\270\254\355\000\005sr\000Aorg.apache.beam.sdk.values.TimestampedV\001\022\000$>\021\000HCoder\364\376\202p\274iX-\002\000\001L\000\n\005;\005\030\034t\000\"Lorg/\t]\000/\001]\024/sdk/c\0015\004s/\005$\020;xr\000*N\202\000\t%(.Structured\005/8s\277\022\016\325\3246\021\002\000\000xr\000 j9\000\005/\034C\335\325\211\256\274~\370\001/\020psr\000#j1\000\010Row\0054\034\254\236\213\244M\203\363\250\0014\010r\000'N2\000 schemas.S\005\010\0056|\023\226L\354\244P\260l\002\000\004L\000\017fromRowFunctiont\0005R\t\001Xtransforms/Serializable\0217\014;L\000\006\tk\010t\000$RA\000\t\036\004s/\t\211\024;L\000\rto\035x`q\000~\000\007L\000\016typeDescriptort\000+RM\000%\271\010s/T2-\000!\240\000&N\004\001-\240\024Custom%\003\034j\260\010\235\013;\035\013!9\001z\020\003sr\000=N;\000\031\367\000.N\367\000Ds$Identity\033n\367C9'S\320\001R!\277\000\"NN\000-\004-\215d7\242\227\362z%\204e\002\000\007Z\000\033encodingPosi!\211DsOverriddenI\000\010hash\001\272\010L\000\021B)\000\220t\000\017Ljava/util/Map;L\000\014fieldIndicest\000HL>\335\002 vendor/gu\0019Lv26_0_jre/com/google\001\0134mon/collect/Bi\tZ\000\006\005Z\014st\000\020\035u$List;L\000\007op\005\273\010t\000,R\267\001-\000M\004\004$O\t.\034;L\000\004uuid6S\000<UUID;xp\000%\316r\257sr\000\021\001\342\000.\001\342\360I.HashMap\005\007\332\301\303\026`\321\003\000\002F\000\nloadFactorI\000\tthresholdxp?@\000\000\000\000\000\014w\010\000\000\000\020\000\000\000\001t\000\007role_id\025Wdlang.Integer\022\342\240\244\367\201\2078\002\000\001I\000\005Ei\014xr\000\020\005\177\005(4Number\206\254\225\035\013\224\340\213%\360\001b\020xsr\000J>\365\001)f\000.%f\000.5f\020.com.)f\001\013\014mon.-f\000.\001\334%j\001S\001\001(\003\000\000xpw\004\000\000\000\001A\251\000\027\001\005\000\032\001l\000\023\005\222%\021\020Array!\203 x\201\322\035\231\307a\235\003\001\274\024\004sizex\001I\000\001\t@\014sr\0002>\241\000\241A-\226\024.AutoV\241;\000_i\244\004_FAD\034\303\343i\345\363l$\364\205.\004\013dm\233\205*\000\022I\002!\026\030/String!\313\014name\001\246\010 L\000Q\020\001\017\014\022L\000\004a\335\010t\000.\216\034\002\005|a\340a\326\000(n\267\000\t\255\t1\034\263\021\225\3324!\217\246%\226\010t\000\000\001y\004\027sZ\267\005\021\370\rA\000OI\216\034\367\031\n\2336X\271\227\305\".\301\000\014\017xps\001P\004\025?IS\004\000wQS%\374\0006n\244\000V[\001\001\33749\304m\364S\243\227P\002\000\010L\000\025M\007$ionElement\001#\001u(!L\000\013logical\001\023\010t\0000\216E\001\000L\0312$;L\000\nmapKey\001@\rS\014\014map%\362\035\024 \010metadata\001$\034\017L\000\010null\241\353\010t\000\023=\3604Boolean;L\000\trow)C\0012\014\010L\000\010!\347\030Namet\000-\216\246\000\001}\001/!\352\000,nF\001\tf)\352\0015\034\013PLl[\357\3103%\356\001\001\014sr\000\036y\027\000C\211\272Lions$EmptyMapY6\024\205Z\334\347\265\247\211WA\302\000.\r\3224\315 r\200\325\234\372\356\002\000\001Z\000\005\211\000\030p\000p~r\000+\212\234\000\001\227\001\314a\273\001\001\000\022\345\375\000\016\005\225\005f\014Enum\001\031\001\001\001\035$pt\000\005INT64xE]\000%\005\006Zc\002\tGe\363\241\036x\274\231\003\367\230m\205/\002\000\002J\000\014leastSigBitsJ\000\013mo\025\016Dxp\221<\231\032\212\343\324#\374\224\230\324\343PC.\005e\014\014sr\000Ro\001\005\364\004s.\001\313\371\212(s$9z\2164\213\005/\271\347!o\010r\000)N\016\001R;\000\034x\237G[\330\210\240{eR \005tokent\000LB\032\002\251,\212\222\006\010ref\305\222\001\241\000T\001N\000;\345r\000Z>\221\000\tQ\212}\005\rQ\005\362\005Q\024$Simple\026\005\020!\255\001\001\t\372\000J\376i\000\031i\0342{#\261\276\3768|%\033\030\013runtim\005w\010t\000\030}m\r\241\005\362\030;xpvr\000\036>\204\000\241\311-~(Row\032Q\006\2060\230\247\034\005X4\006schemaq\000~\000\010xp"
      >
    >
  >
  coders: <
    key: "rsJLAdrDNvVarIntCoder"
    value: <
      spec: <
        urn: "beam:coders:javasdk:0.1"
        payload: "\202SNAPPY\000\000\000\000\001\000\000\000\001\000\000\000\210\330\001\350\254\355\000\005sr\000&org.apache.beam.sdk.coders.VarIntCoder\300K2\332\251KVh\002\000\000xrr5\000\024Atomic\0055 \307\354\265\314\205tPF\002\0055\000*jj\000$Structured\0059\034s\277\022\016\325\3246\021\t9\000 j9\000\005/0C\335\325\211\256\274~\370\002\000\000xp"
      >
    >
  >
  coders: <
    key: "rsJLAdrDNvVoidCoder"
    value: <
      spec: <
        urn: "beam:coders:javasdk:0.1"
        payload: "\202SNAPPY\000\000\000\000\001\000\000\000\001\000\000\000\210\326\001\350\254\355\000\005sr\000$org.apache.beam.sdk.coders.VoidCoder\271\277U\233\350\r\257U\002\000\000xr\000&j3\000\024Atomic\0055 \307\354\265\314\205tPF\002\0055\000*j5\000$Structured\0059\034s\277\022\016\325\3246\021\t9\000 j9\000\005/0C\335\325\211\256\274~\370\002\000\000xp"
      >
    >
  >
  environments: <
    key: "go"
    value: <
      urn: "beam:env:docker:v1"
      payload: "\n\026apache/beam_go_sdk:dev"
      capabilities: "beam:protocol:progress_reporting:v1"
      capabilities: "beam:protocol:multi_core_bundle_processing:v1"
      capabilities: "beam:transform:sdf_truncate_sized_restrictions:v1"
      capabilities: "beam:protocol:worker_status:v1"
      capabilities: "beam:protocol:monitoring_info_short_ids:v1"
      capabilities: "beam:version:sdk_base:go"
      capabilities: "beam:coder:bytes:v1"
      capabilities: "beam:coder:bool:v1"
      capabilities: "beam:coder:varint:v1"
      capabilities: "beam:coder:double:v1"
      capabilities: "beam:coder:string_utf8:v1"
      capabilities: "beam:coder:length_prefix:v1"
      capabilities: "beam:coder:kv:v1"
      capabilities: "beam:coder:iterable:v1"
      capabilities: "beam:coder:state_backed_iterable:v1"
      capabilities: "beam:coder:windowed_value:v1"
      capabilities: "beam:coder:global_window:v1"
      capabilities: "beam:coder:interval_window:v1"
      capabilities: "beam:coder:row:v1"
      capabilities: "beam:coder:nullable:v1"
      dependencies: <
        type_urn: "beam:artifact:type:file:v1"
        role_urn: "beam:artifact:role:go_worker_binary:v1"
      >
    >
  >
  environments: <
    key: "rsJLAdrDNvbeam:env:docker:v1"
    value: <
      urn: "beam:env:docker:v1"
      payload: "\n apache/beam_java8_sdk:2.42.0.dev"
      capabilities: "beam:coder:bytes:v1"
      capabilities: "beam:coder:bool:v1"
      capabilities: "beam:coder:varint:v1"
      capabilities: "beam:coder:string_utf8:v1"
      capabilities: "beam:coder:iterable:v1"
      capabilities: "beam:coder:timer:v1"
      capabilities: "beam:coder:kv:v1"
      capabilities: "beam:coder:length_prefix:v1"
      capabilities: "beam:coder:global_window:v1"
      capabilities: "beam:coder:interval_window:v1"
      capabilities: "beam:coder:custom_window:v1"
      capabilities: "beam:coder:windowed_value:v1"
      capabilities: "beam:coder:double:v1"
      capabilities: "beam:coder:row:v1"
      capabilities: "beam:coder:param_windowed_value:v1"
      capabilities: "beam:coder:state_backed_iterable:v1"
      capabilities: "beam:coder:sharded_key:v1"
      capabilities: "beam:coder:nullable:v1"
      capabilities: "beam:protocol:multi_core_bundle_processing:v1"
      capabilities: "beam:protocol:progress_reporting:v1"
      capabilities: "beam:protocol:harness_monitoring_infos:v1"
      capabilities: "beam:protocol:control_request_elements_embedding:v1"
      capabilities: "beam:protocol:state_caching:v1"
      capabilities: "beam:version:sdk_base:apache/beam_java8_sdk:2.42.0.dev"
      capabilities: "beam:transform:sdf_truncate_sized_restrictions:v1"
      capabilities: "beam:transform:to_string:v1"
      dependencies: <
        type_urn: "beam:artifact:type:file:v1"
        type_payload: "\nL/tmp/artifacts/icedtea-sound-CGRxIE9edPHnbxQhM-L5mp8h21H-ySB79uQtSquPV_Q.jar\022@086471204f5e74f1e76f142133e2f99a9f21db51fec9207bf6e42d4aab8f57f4"
        role_urn: "beam:artifact:role:staging_to:v1"
        role_payload: "\n=icedtea-sound-CGRxIE9edPHnbxQhM-L5mp8h21H-ySB79uQtSquPV_Q.jar"
      >
      dependencies: <
        type_urn: "beam:artifact:type:file:v1"
        type_payload: "\nF/tmp/artifacts/jaccess-FBI0Bb27lF3oEBieWAi7SP8X1zBR8k4BJQOVpsoK9a0.jar\022@14123405bdbb945de810189e5808bb48ff17d73051f24e01250395a6ca0af5ad"
        role_urn: "beam:artifact:role:staging_to:v1"
        role_payload: "\n7jaccess-FBI0Bb27lF3oEBieWAi7SP8X1zBR8k4BJQOVpsoK9a0.jar"
      >
      dependencies: <
        type_urn: "beam:artifact:type:file:v1"
        type_payload: "\nI/tmp/artifacts/localedata-kJ2mc8rBH5-IklhfR1XzNotlIQ_mnVMA-pgaXv2r8Ag.jar\022@909da673cac11f9f8892585f4755f3368b65210fe69d5300fa981a5efdabf008"
        role_urn: "beam:artifact:role:staging_to:v1"
        role_payload: "\n:localedata-kJ2mc8rBH5-IklhfR1XzNotlIQ_mnVMA-pgaXv2r8Ag.jar"
      >
      dependencies: <
        type_urn: "beam:artifact:type:file:v1"
        type_payload: "\nF/tmp/artifacts/nashorn-B0CAb3QpJET_6VsT3hcC_89VtvhV616H8N2bHAIaqWo.jar\022@0740806f74292444ffe95b13de1702ffcf55b6f855eb5e87f0dd9b1c021aa96a"
        role_urn: "beam:artifact:role:staging_to:v1"
        role_payload: "\n7nashorn-B0CAb3QpJET_6VsT3hcC_89VtvhV616H8N2bHAIaqWo.jar"
      >
      dependencies: <
        type_urn: "beam:artifact:type:file:v1"
        type_payload: "\nG/tmp/artifacts/cldrdata-gclqV9lOGqQOKesG-a6TAUTGEYlyIDqpyd4M_k7gtWo.jar\022@81c96a57d94e1aa40e29eb06f9ae930144c6118972203aa9c9de0cfe4ee0b56a"
        role_urn: "beam:artifact:role:staging_to:v1"
        role_payload: "\n8cldrdata-gclqV9lOGqQOKesG-a6TAUTGEYlyIDqpyd4M_k7gtWo.jar"
      >
      dependencies: <
        type_urn: "beam:artifact:type:file:v1"
        type_payload: "\nD/tmp/artifacts/dnsns-byzoQxdXengTvA5IlbH9gSIzfhNQElRYltuMJN0vjcc.jar\022@6f2ce84317577a7813bc0e4895b1fd8122337e135012545896db8c24dd2f8dc7"
        role_urn: "beam:artifact:role:staging_to:v1"
        role_payload: "\n5dnsns-byzoQxdXengTvA5IlbH9gSIzfhNQElRYltuMJN0vjcc.jar"
      >
      dependencies: <
        type_urn: "beam:artifact:type:file:v1"
        type_payload: "\n\203\001/tmp/artifacts/beam-sdks-java-extensions-schemaio-expansion-service-2.42.0-SNAPSHOT-6wxh-IlguJ_nLvvu6aLYm4k8xaS2REjfC0gXPKjAZmE.jar\022@eb0c61f88960b89fe72efbeee9a2d89b893cc5a4b64448df0b48173ca8c06661"
        role_urn: "beam:artifact:role:staging_to:v1"
        role_payload: "\ntbeam-sdks-java-extensions-schemaio-expansion-service-2.42.0-SNAPSHOT-6wxh-IlguJ_nLvvu6aLYm4k8xaS2REjfC0gXPKjAZmE.jar"
      >
    >
  >
>
root_transform_ids: "s1"
root_transform_ids: "e2"
root_transform_ids: "e3"
root_transform_ids: "s3"
requirements: "beam:requirement:pardo:splittable_dofn:v1"
2022/09/06 17:22:21 Cross-compiling <https://ci-beam.apache.org/job/beam_PostCommit_XVR_Direct/ws/src/sdks/go/test/integration/io/xlang/jdbc/jdbc_test.go> as /tmp/worker-4-1662484941286506589
2022/09/06 17:22:23 Prepared job with id: go-testjdbcio_postgresreadwrite-853-d42c3b01-c5a3-4ccb-a882-29775db06ecf and staging token: go-testjdbcio_postgresreadwrite-853-d42c3b01-c5a3-4ccb-a882-29775db06ecf
2022/09/06 17:22:24 Staged binary artifact with token: 
2022/09/06 17:22:24 Submitted job: go-testjdbcio_postgresreadwrite-853-d42c3b01-c5a3-4ccb-a882-29775db06ecf
2022/09/06 17:22:24 2022-09-06 17:22:24. (1): Default Python SDK image for environment is apache/beam_python3.7_sdk:2.42.0.dev
2022/09/06 17:22:24 Job state: STOPPED
2022/09/06 17:22:24 Job state: STARTING
2022/09/06 17:22:24 Job state: RUNNING
2022/09/06 17:22:24 2022-09-06 17:22:24. (2): ==================== <function annotate_downstream_side_inputs at 0x7f7509021290> ====================
2022/09/06 17:22:24 2022-09-06 17:22:24. (3): ==================== <function fix_side_input_pcoll_coders at 0x7f75090213b0> ====================
2022/09/06 17:22:24 2022-09-06 17:22:24. (4): ==================== <function pack_combiners at 0x7f75090218c0> ====================
2022/09/06 17:22:24 2022-09-06 17:22:24. (5): ==================== <function lift_combiners at 0x7f7509021950> ====================
2022/09/06 17:22:24 2022-09-06 17:22:24. (6): ==================== <function expand_sdf at 0x7f7509021b00> ====================
2022/09/06 17:22:24 2022-09-06 17:22:24. (7): ==================== <function expand_gbk at 0x7f7509021b90> ====================
2022/09/06 17:22:24 2022-09-06 17:22:24. (8): ==================== <function sink_flattens at 0x7f7509021cb0> ====================
2022/09/06 17:22:24 2022-09-06 17:22:24. (9): ==================== <function greedily_fuse at 0x7f7509021d40> ====================
2022/09/06 17:22:24 2022-09-06 17:22:24. (10): ==================== <function read_to_impulse at 0x7f7509021dd0> ====================
2022/09/06 17:22:24 2022-09-06 17:22:24. (11): ==================== <function impulse_to_input at 0x7f7509021e60> ====================
2022/09/06 17:22:24 2022-09-06 17:22:24. (12): ==================== <function sort_stages at 0x7f75090220e0> ====================
2022/09/06 17:22:24 2022-09-06 17:22:24. (13): ==================== <function add_impulse_to_dangling_transforms at 0x7f7509022200> ====================
2022/09/06 17:22:24 2022-09-06 17:22:24. (14): ==================== <function setup_timer_mapping at 0x7f7509022050> ====================
2022/09/06 17:22:24 2022-09-06 17:22:24. (15): ==================== <function populate_data_channel_coders at 0x7f7509022170> ====================
2022/09/06 17:22:24 2022-09-06 17:22:24. (16): starting control server on port 39539
2022/09/06 17:22:24 2022-09-06 17:22:24. (17): starting data server on port 37733
2022/09/06 17:22:24 2022-09-06 17:22:24. (18): starting state server on port 36319
2022/09/06 17:22:24 2022-09-06 17:22:24. (19): starting logging server on port 33473
2022/09/06 17:22:24 2022-09-06 17:22:24. (20): Created Worker handler <apache_beam.runners.portability.fn_api_runner.worker_handlers.DockerSdkWorkerHandler object at 0x7f751d649710> for environment rsJLAdrDNvbeam:env:docker:v1 (beam:env:docker:v1, b'\n apache/beam_java8_sdk:2.42.0.dev')
2022/09/06 17:22:25 2022-09-06 17:22:25. (21): Attempting to pull image apache/beam_java8_sdk:2.42.0.dev
2022/09/06 17:22:25 2022-09-06 17:22:25. (22): Unable to pull image apache/beam_java8_sdk:2.42.0.dev, defaulting to local image if it exists
2022/09/06 17:22:27 2022-09-06 17:22:27. (23): Waiting for docker to start up. Current status is running
2022/09/06 17:22:27 2022-09-06 17:22:27. (24): Docker container is running. container_id = b'c5220e895b1a967a0b3ba056013e4f0d73a96e58102a9e35d49db666b5457065', worker_id = worker_16
2022/09/06 17:22:28 2022-09-06 17:22:28. (25): Created Worker handler <apache_beam.runners.portability.fn_api_runner.worker_handlers.DockerSdkWorkerHandler object at 0x7f751d658ed0> for environment go (beam:env:docker:v1, b'\n\x16apache/beam_go_sdk:dev')
2022/09/06 17:22:28 2022-09-06 17:22:28. (26): Attempting to pull image apache/beam_go_sdk:dev
2022/09/06 17:22:29 2022-09-06 17:22:29. (27): Unable to pull image apache/beam_go_sdk:dev, defaulting to local image if it exists
2022/09/06 17:22:30 2022-09-06 17:22:30. (28): Waiting for docker to start up. Current status is running
2022/09/06 17:22:30 2022-09-06 17:22:30. (29): Docker container is running. container_id = b'b53495eb9da77422c99948b42f45282406e93c6f5ff4c13b6b5e043386f843d4', worker_id = worker_17
2022/09/06 17:22:35 2022-09-06 17:22:35. (30): Completed job in 11.105710983276367 seconds with state DONE.
2022/09/06 17:22:35 Job state: DONE
--- PASS: TestJDBCIO_PostgresReadWrite (34.88s)
PASS
ok  	github.com/apache/beam/sdks/v2/go/test/integration/io/xlang/jdbc	80.675s
=== RUN   TestKafkaIO_BasicReadWrite
    integration.go:308: Test TestKafkaIO_BasicReadWrite is currently filtered for runner portable
--- SKIP: TestKafkaIO_BasicReadWrite (0.00s)
PASS
ok  	github.com/apache/beam/sdks/v2/go/test/integration/io/xlang/kafka	6.054s

> Task :sdks:python:test-suites:direct:xlang:validatesCrossLanguageRunnerJavaUsingPython

org.apache.beam.sdk.extensions.python.transforms.RunInferenceTransformTest > testRunInferenceWithKVs FAILED
    java.lang.IllegalStateException at RunInferenceTransformTest.java:108
    java.lang.NullPointerException at Preconditions.java:980

org.apache.beam.sdk.extensions.python.transforms.RunInferenceTransformTest > testRunInference FAILED
    java.lang.IllegalStateException at RunInferenceTransformTest.java:60
    java.lang.NullPointerException at Preconditions.java:980

16 tests completed, 2 failed, 2 skipped

> Task :sdks:python:test-suites:direct:xlang:validatesCrossLanguageRunnerJavaUsingPython FAILED
> Task :sdks:python:test-suites:direct:xlang:validatesCrossLanguageRunnerPythonUsingJava
> Task :sdks:python:test-suites:direct:xlang:validatesCrossLanguageRunnerPythonUsingSql
> Task :sdks:python:test-suites:direct:xlang:validatesCrossLanguageRunnerCleanup
> Task :sdks:python:test-suites:direct:xlang:fnApiJobServerCleanup

FAILURE: Build failed with an exception.

* What went wrong:
Execution failed for task ':sdks:python:test-suites:direct:xlang:validatesCrossLanguageRunnerJavaUsingPython'.
> There were failing tests. See the report at: file://<https://ci-beam.apache.org/job/beam_PostCommit_XVR_Direct/ws/src/sdks/python/test-suites/direct/xlang/build/reports/tests/validatesCrossLanguageRunnerJavaUsingPython/index.html>

* Try:
> Run with --stacktrace option to get the stack trace.
> Run with --info or --debug option to get more log output.
> Run with --scan to get full insights.

* Get more help at https://help.gradle.org

Deprecated Gradle features were used in this build, making it incompatible with Gradle 8.0.

You can use '--warning-mode all' to show the individual deprecation warnings and determine if they come from your own scripts or plugins.

See https://docs.gradle.org/7.4/userguide/command_line_interface.html#sec:command_line_warnings

Execution optimizations have been disabled for 1 invalid unit(s) of work during this build to ensure correctness.
Please consult deprecation warnings for more details.

BUILD FAILED in 35m 4s
247 actionable tasks: 174 executed, 61 from cache, 12 up-to-date

Publishing build scan...
https://gradle.com/s/3dqc32gvozgym

Build step 'Invoke Gradle script' changed build result to FAILURE
Build step 'Invoke Gradle script' marked build as failure

---------------------------------------------------------------------
To unsubscribe, e-mail: builds-unsubscribe@beam.apache.org
For additional commands, e-mail: builds-help@beam.apache.org


Build failed in Jenkins: beam_PostCommit_XVR_Direct #3106

Posted by Apache Jenkins Server <je...@builds.apache.org>.
See <https://ci-beam.apache.org/job/beam_PostCommit_XVR_Direct/3106/display/redirect>

Changes:


------------------------------------------
[...truncated 843.72 KB...]
    key: "LNEGfXDqPgVarIntCoder"
    value: <
      spec: <
        urn: "beam:coders:javasdk:0.1"
        payload: "\202SNAPPY\000\000\000\000\001\000\000\000\001\000\000\000\210\330\001\350\254\355\000\005sr\000&org.apache.beam.sdk.coders.VarIntCoder\300K2\332\251KVh\002\000\000xrr5\000\024Atomic\0055 \307\354\265\314\205tPF\002\0055\000*jj\000$Structured\0059\034s\277\022\016\325\3246\021\t9\000 j9\000\005/0C\335\325\211\256\274~\370\002\000\000xp"
      >
    >
  >
  coders: <
    key: "LNEGfXDqPgVoidCoder"
    value: <
      spec: <
        urn: "beam:coders:javasdk:0.1"
        payload: "\202SNAPPY\000\000\000\000\001\000\000\000\001\000\000\000\210\326\001\350\254\355\000\005sr\000$org.apache.beam.sdk.coders.VoidCoder\271\277U\233\350\r\257U\002\000\000xr\000&j3\000\024Atomic\0055 \307\354\265\314\205tPF\002\0055\000*j5\000$Structured\0059\034s\277\022\016\325\3246\021\t9\000 j9\000\005/0C\335\325\211\256\274~\370\002\000\000xp"
      >
    >
  >
  coders: <
    key: "c0"
    value: <
      spec: <
        urn: "beam:coder:bytes:v1"
      >
    >
  >
  coders: <
    key: "c1"
    value: <
      spec: <
        urn: "beam:coder:global_window:v1"
      >
    >
  >
  coders: <
    key: "c2"
    value: <
      spec: <
        urn: "beam:coder:row:v1"
        payload: "\n\r\n\007role_id\032\002\020\003\022$abc5e222-ab8f-4f6f-800a-a58bb0f45675"
      >
    >
  >
  environments: <
    key: "LNEGfXDqPgbeam:env:docker:v1"
    value: <
      urn: "beam:env:docker:v1"
      payload: "\n apache/beam_java8_sdk:2.42.0.dev"
      capabilities: "beam:coder:bytes:v1"
      capabilities: "beam:coder:bool:v1"
      capabilities: "beam:coder:varint:v1"
      capabilities: "beam:coder:string_utf8:v1"
      capabilities: "beam:coder:iterable:v1"
      capabilities: "beam:coder:timer:v1"
      capabilities: "beam:coder:kv:v1"
      capabilities: "beam:coder:length_prefix:v1"
      capabilities: "beam:coder:global_window:v1"
      capabilities: "beam:coder:interval_window:v1"
      capabilities: "beam:coder:custom_window:v1"
      capabilities: "beam:coder:windowed_value:v1"
      capabilities: "beam:coder:double:v1"
      capabilities: "beam:coder:row:v1"
      capabilities: "beam:coder:param_windowed_value:v1"
      capabilities: "beam:coder:state_backed_iterable:v1"
      capabilities: "beam:coder:sharded_key:v1"
      capabilities: "beam:coder:nullable:v1"
      capabilities: "beam:protocol:multi_core_bundle_processing:v1"
      capabilities: "beam:protocol:progress_reporting:v1"
      capabilities: "beam:protocol:harness_monitoring_infos:v1"
      capabilities: "beam:protocol:control_request_elements_embedding:v1"
      capabilities: "beam:protocol:state_caching:v1"
      capabilities: "beam:version:sdk_base:apache/beam_java8_sdk:2.42.0.dev"
      capabilities: "beam:transform:sdf_truncate_sized_restrictions:v1"
      capabilities: "beam:transform:to_string:v1"
      dependencies: <
        type_urn: "beam:artifact:type:file:v1"
        type_payload: "\nL/tmp/artifacts/icedtea-sound-CGRxIE9edPHnbxQhM-L5mp8h21H-ySB79uQtSquPV_Q.jar\022@086471204f5e74f1e76f142133e2f99a9f21db51fec9207bf6e42d4aab8f57f4"
        role_urn: "beam:artifact:role:staging_to:v1"
        role_payload: "\n=icedtea-sound-CGRxIE9edPHnbxQhM-L5mp8h21H-ySB79uQtSquPV_Q.jar"
      >
      dependencies: <
        type_urn: "beam:artifact:type:file:v1"
        type_payload: "\nF/tmp/artifacts/jaccess-FBI0Bb27lF3oEBieWAi7SP8X1zBR8k4BJQOVpsoK9a0.jar\022@14123405bdbb945de810189e5808bb48ff17d73051f24e01250395a6ca0af5ad"
        role_urn: "beam:artifact:role:staging_to:v1"
        role_payload: "\n7jaccess-FBI0Bb27lF3oEBieWAi7SP8X1zBR8k4BJQOVpsoK9a0.jar"
      >
      dependencies: <
        type_urn: "beam:artifact:type:file:v1"
        type_payload: "\nI/tmp/artifacts/localedata-kJ2mc8rBH5-IklhfR1XzNotlIQ_mnVMA-pgaXv2r8Ag.jar\022@909da673cac11f9f8892585f4755f3368b65210fe69d5300fa981a5efdabf008"
        role_urn: "beam:artifact:role:staging_to:v1"
        role_payload: "\n:localedata-kJ2mc8rBH5-IklhfR1XzNotlIQ_mnVMA-pgaXv2r8Ag.jar"
      >
      dependencies: <
        type_urn: "beam:artifact:type:file:v1"
        type_payload: "\nF/tmp/artifacts/nashorn-B0CAb3QpJET_6VsT3hcC_89VtvhV616H8N2bHAIaqWo.jar\022@0740806f74292444ffe95b13de1702ffcf55b6f855eb5e87f0dd9b1c021aa96a"
        role_urn: "beam:artifact:role:staging_to:v1"
        role_payload: "\n7nashorn-B0CAb3QpJET_6VsT3hcC_89VtvhV616H8N2bHAIaqWo.jar"
      >
      dependencies: <
        type_urn: "beam:artifact:type:file:v1"
        type_payload: "\nG/tmp/artifacts/cldrdata-gclqV9lOGqQOKesG-a6TAUTGEYlyIDqpyd4M_k7gtWo.jar\022@81c96a57d94e1aa40e29eb06f9ae930144c6118972203aa9c9de0cfe4ee0b56a"
        role_urn: "beam:artifact:role:staging_to:v1"
        role_payload: "\n8cldrdata-gclqV9lOGqQOKesG-a6TAUTGEYlyIDqpyd4M_k7gtWo.jar"
      >
      dependencies: <
        type_urn: "beam:artifact:type:file:v1"
        type_payload: "\nD/tmp/artifacts/dnsns-byzoQxdXengTvA5IlbH9gSIzfhNQElRYltuMJN0vjcc.jar\022@6f2ce84317577a7813bc0e4895b1fd8122337e135012545896db8c24dd2f8dc7"
        role_urn: "beam:artifact:role:staging_to:v1"
        role_payload: "\n5dnsns-byzoQxdXengTvA5IlbH9gSIzfhNQElRYltuMJN0vjcc.jar"
      >
      dependencies: <
        type_urn: "beam:artifact:type:file:v1"
        type_payload: "\n\203\001/tmp/artifacts/beam-sdks-java-extensions-schemaio-expansion-service-2.42.0-SNAPSHOT-_vqtn6fpKNgqW6gb5yCi1yHVRPoFq-9toX5lGnyJ6b0.jar\022@fefaad9fa7e928d82a5ba81be720a2d721d544fa05abef6da17e651a7c89e9bd"
        role_urn: "beam:artifact:role:staging_to:v1"
        role_payload: "\ntbeam-sdks-java-extensions-schemaio-expansion-service-2.42.0-SNAPSHOT-_vqtn6fpKNgqW6gb5yCi1yHVRPoFq-9toX5lGnyJ6b0.jar"
      >
    >
  >
  environments: <
    key: "go"
    value: <
      urn: "beam:env:docker:v1"
      payload: "\n\026apache/beam_go_sdk:dev"
      capabilities: "beam:protocol:progress_reporting:v1"
      capabilities: "beam:protocol:multi_core_bundle_processing:v1"
      capabilities: "beam:transform:sdf_truncate_sized_restrictions:v1"
      capabilities: "beam:protocol:worker_status:v1"
      capabilities: "beam:protocol:monitoring_info_short_ids:v1"
      capabilities: "beam:version:sdk_base:go"
      capabilities: "beam:coder:bytes:v1"
      capabilities: "beam:coder:bool:v1"
      capabilities: "beam:coder:varint:v1"
      capabilities: "beam:coder:double:v1"
      capabilities: "beam:coder:string_utf8:v1"
      capabilities: "beam:coder:length_prefix:v1"
      capabilities: "beam:coder:kv:v1"
      capabilities: "beam:coder:iterable:v1"
      capabilities: "beam:coder:state_backed_iterable:v1"
      capabilities: "beam:coder:windowed_value:v1"
      capabilities: "beam:coder:global_window:v1"
      capabilities: "beam:coder:interval_window:v1"
      capabilities: "beam:coder:row:v1"
      capabilities: "beam:coder:nullable:v1"
      dependencies: <
        type_urn: "beam:artifact:type:file:v1"
        role_urn: "beam:artifact:role:go_worker_binary:v1"
      >
    >
  >
>
root_transform_ids: "s1"
root_transform_ids: "e2"
root_transform_ids: "e3"
root_transform_ids: "s3"
requirements: "beam:requirement:pardo:splittable_dofn:v1"
2022/09/06 11:21:16 Cross-compiling <https://ci-beam.apache.org/job/beam_PostCommit_XVR_Direct/ws/src/sdks/go/test/integration/io/xlang/jdbc/jdbc_test.go> as /tmp/worker-4-1662463276730235784
2022/09/06 11:21:18 Prepared job with id: go-testjdbcio_postgresreadwrite-984-d964916e-9675-4c57-bbcd-7ca1a686003b and staging token: go-testjdbcio_postgresreadwrite-984-d964916e-9675-4c57-bbcd-7ca1a686003b
2022/09/06 11:21:19 Staged binary artifact with token: 
2022/09/06 11:21:19 Submitted job: go-testjdbcio_postgresreadwrite-984-d964916e-9675-4c57-bbcd-7ca1a686003b
2022/09/06 11:21:19 2022-09-06 11:21:19. (1): Default Python SDK image for environment is apache/beam_python3.7_sdk:2.42.0.dev
2022/09/06 11:21:19 Job state: STOPPED
2022/09/06 11:21:19 Job state: STARTING
2022/09/06 11:21:19 Job state: RUNNING
2022/09/06 11:21:19 2022-09-06 11:21:19. (2): ==================== <function annotate_downstream_side_inputs at 0x7fa4f458d290> ====================
2022/09/06 11:21:19 2022-09-06 11:21:19. (3): ==================== <function fix_side_input_pcoll_coders at 0x7fa4f458d3b0> ====================
2022/09/06 11:21:19 2022-09-06 11:21:19. (4): ==================== <function pack_combiners at 0x7fa4f458d8c0> ====================
2022/09/06 11:21:19 2022-09-06 11:21:19. (5): ==================== <function lift_combiners at 0x7fa4f458d950> ====================
2022/09/06 11:21:19 2022-09-06 11:21:19. (6): ==================== <function expand_sdf at 0x7fa4f458db00> ====================
2022/09/06 11:21:19 2022-09-06 11:21:19. (7): ==================== <function expand_gbk at 0x7fa4f458db90> ====================
2022/09/06 11:21:19 2022-09-06 11:21:19. (8): ==================== <function sink_flattens at 0x7fa4f458dcb0> ====================
2022/09/06 11:21:19 2022-09-06 11:21:19. (9): ==================== <function greedily_fuse at 0x7fa4f458dd40> ====================
2022/09/06 11:21:19 2022-09-06 11:21:19. (10): ==================== <function read_to_impulse at 0x7fa4f458ddd0> ====================
2022/09/06 11:21:19 2022-09-06 11:21:19. (11): ==================== <function impulse_to_input at 0x7fa4f458de60> ====================
2022/09/06 11:21:19 2022-09-06 11:21:19. (12): ==================== <function sort_stages at 0x7fa4f458f0e0> ====================
2022/09/06 11:21:19 2022-09-06 11:21:19. (13): ==================== <function add_impulse_to_dangling_transforms at 0x7fa4f458f200> ====================
2022/09/06 11:21:19 2022-09-06 11:21:19. (14): ==================== <function setup_timer_mapping at 0x7fa4f458f050> ====================
2022/09/06 11:21:19 2022-09-06 11:21:19. (15): ==================== <function populate_data_channel_coders at 0x7fa4f458f170> ====================
2022/09/06 11:21:19 2022-09-06 11:21:19. (16): starting control server on port 46869
2022/09/06 11:21:19 2022-09-06 11:21:19. (17): starting data server on port 41029
2022/09/06 11:21:19 2022-09-06 11:21:19. (18): starting state server on port 44399
2022/09/06 11:21:19 2022-09-06 11:21:19. (19): starting logging server on port 39753
2022/09/06 11:21:19 2022-09-06 11:21:19. (20): Created Worker handler <apache_beam.runners.portability.fn_api_runner.worker_handlers.DockerSdkWorkerHandler object at 0x7fa4f42b19d0> for environment go (beam:env:docker:v1, b'\n\x16apache/beam_go_sdk:dev')
2022/09/06 11:21:21 2022-09-06 11:21:21. (21): Attempting to pull image apache/beam_go_sdk:dev
2022/09/06 11:21:21 2022-09-06 11:21:21. (22): Unable to pull image apache/beam_go_sdk:dev, defaulting to local image if it exists
2022/09/06 11:21:22 2022-09-06 11:21:22. (23): Waiting for docker to start up. Current status is running
2022/09/06 11:21:22 2022-09-06 11:21:22. (24): Docker container is running. container_id = b'81541a530cc065b23fac4f66268da66f8076294f31bb1218e2f732d1d9767fa2', worker_id = worker_17
2022/09/06 11:21:23 2022-09-06 11:21:23. (25): Created Worker handler <apache_beam.runners.portability.fn_api_runner.worker_handlers.DockerSdkWorkerHandler object at 0x7fa508b9f890> for environment LNEGfXDqPgbeam:env:docker:v1 (beam:env:docker:v1, b'\n apache/beam_java8_sdk:2.42.0.dev')
2022/09/06 11:21:25 2022-09-06 11:21:25. (26): Attempting to pull image apache/beam_java8_sdk:2.42.0.dev
2022/09/06 11:21:26 2022-09-06 11:21:26. (27): Unable to pull image apache/beam_java8_sdk:2.42.0.dev, defaulting to local image if it exists
2022/09/06 11:21:27 2022-09-06 11:21:27. (28): Waiting for docker to start up. Current status is running
2022/09/06 11:21:27 2022-09-06 11:21:27. (29): Docker container is running. container_id = b'49c956d5a7fc75993d2e00b8c0ab070d5cd9119697e1c8281c26b3c4994124ff', worker_id = worker_19
2022/09/06 11:21:34 2022-09-06 11:21:34. (30): Completed job in 15.555161952972412 seconds with state DONE.
2022/09/06 11:21:34 Job state: DONE
--- PASS: TestJDBCIO_PostgresReadWrite (38.88s)
PASS
ok  	github.com/apache/beam/sdks/v2/go/test/integration/io/xlang/jdbc	98.902s
=== RUN   TestKafkaIO_BasicReadWrite
    integration.go:308: Test TestKafkaIO_BasicReadWrite is currently filtered for runner portable
--- SKIP: TestKafkaIO_BasicReadWrite (0.00s)
PASS
ok  	github.com/apache/beam/sdks/v2/go/test/integration/io/xlang/kafka	6.035s

> Task :sdks:python:test-suites:direct:xlang:validatesCrossLanguageRunnerJavaUsingPython

org.apache.beam.sdk.extensions.python.transforms.RunInferenceTransformTest > testRunInferenceWithKVs FAILED
    java.lang.IllegalStateException at RunInferenceTransformTest.java:108
    java.lang.NullPointerException at Preconditions.java:980

org.apache.beam.sdk.extensions.python.transforms.RunInferenceTransformTest > testRunInference FAILED
    java.lang.IllegalStateException at RunInferenceTransformTest.java:60
    java.lang.NullPointerException at Preconditions.java:980

16 tests completed, 2 failed, 2 skipped

> Task :sdks:python:test-suites:direct:xlang:validatesCrossLanguageRunnerJavaUsingPython FAILED
> Task :sdks:python:test-suites:direct:xlang:validatesCrossLanguageRunnerPythonUsingJava
> Task :sdks:python:test-suites:direct:xlang:validatesCrossLanguageRunnerPythonUsingSql
> Task :sdks:python:test-suites:direct:xlang:validatesCrossLanguageRunnerCleanup
> Task :sdks:python:test-suites:direct:xlang:fnApiJobServerCleanup

FAILURE: Build failed with an exception.

* What went wrong:
Execution failed for task ':sdks:python:test-suites:direct:xlang:validatesCrossLanguageRunnerJavaUsingPython'.
> There were failing tests. See the report at: file://<https://ci-beam.apache.org/job/beam_PostCommit_XVR_Direct/ws/src/sdks/python/test-suites/direct/xlang/build/reports/tests/validatesCrossLanguageRunnerJavaUsingPython/index.html>

* Try:
> Run with --stacktrace option to get the stack trace.
> Run with --info or --debug option to get more log output.
> Run with --scan to get full insights.

* Get more help at https://help.gradle.org

Deprecated Gradle features were used in this build, making it incompatible with Gradle 8.0.

You can use '--warning-mode all' to show the individual deprecation warnings and determine if they come from your own scripts or plugins.

See https://docs.gradle.org/7.4/userguide/command_line_interface.html#sec:command_line_warnings

Execution optimizations have been disabled for 1 invalid unit(s) of work during this build to ensure correctness.
Please consult deprecation warnings for more details.

BUILD FAILED in 24m 55s
247 actionable tasks: 162 executed, 73 from cache, 12 up-to-date

Publishing build scan...
https://gradle.com/s/2ecaf575zygxk

Build step 'Invoke Gradle script' changed build result to FAILURE
Build step 'Invoke Gradle script' marked build as failure

---------------------------------------------------------------------
To unsubscribe, e-mail: builds-unsubscribe@beam.apache.org
For additional commands, e-mail: builds-help@beam.apache.org


Build failed in Jenkins: beam_PostCommit_XVR_Direct #3105

Posted by Apache Jenkins Server <je...@builds.apache.org>.
See <https://ci-beam.apache.org/job/beam_PostCommit_XVR_Direct/3105/display/redirect?page=changes>

Changes:

[noreply] Revert "Remove subprocess.PIPE usage by using a temp file (#22654)"


------------------------------------------
[...truncated 1.42 MB...]
INFO     root:portable_runner.py:577 Default Python SDK image for environment is apache/beam_python3.7_sdk:2.42.0.dev
INFO     root:portable_runner.py:577 ==================== <function annotate_downstream_side_inputs at 0x7f1265272290> ====================
INFO     root:portable_runner.py:577 ==================== <function fix_side_input_pcoll_coders at 0x7f12652723b0> ====================
INFO     root:portable_runner.py:577 ==================== <function pack_combiners at 0x7f12652728c0> ====================
INFO     root:portable_runner.py:577 ==================== <function lift_combiners at 0x7f1265272950> ====================
INFO     root:portable_runner.py:577 ==================== <function expand_sdf at 0x7f1265272b00> ====================
INFO     root:portable_runner.py:577 ==================== <function expand_gbk at 0x7f1265272b90> ====================
INFO     root:portable_runner.py:577 ==================== <function sink_flattens at 0x7f1265272cb0> ====================
INFO     root:portable_runner.py:577 ==================== <function greedily_fuse at 0x7f1265272d40> ====================
INFO     root:portable_runner.py:577 ==================== <function read_to_impulse at 0x7f1265272dd0> ====================
INFO     root:portable_runner.py:577 ==================== <function impulse_to_input at 0x7f1265272e60> ====================
INFO     root:portable_runner.py:577 ==================== <function sort_stages at 0x7f12652730e0> ====================
INFO     root:portable_runner.py:577 ==================== <function add_impulse_to_dangling_transforms at 0x7f1265273200> ====================
INFO     root:portable_runner.py:577 ==================== <function setup_timer_mapping at 0x7f1265273050> ====================
INFO     root:portable_runner.py:577 ==================== <function populate_data_channel_coders at 0x7f1265273170> ====================
INFO     root:portable_runner.py:577 starting control server on port 42251
INFO     root:portable_runner.py:577 starting data server on port 33625
INFO     root:portable_runner.py:577 starting state server on port 42735
INFO     root:portable_runner.py:577 starting logging server on port 43929
INFO     root:portable_runner.py:577 Created Worker handler <apache_beam.runners.portability.fn_api_runner.worker_handlers.DockerSdkWorkerHandler object at 0x7f127c062090> for environment ref_Environment_default_environment_2 (beam:env:docker:v1, b'\n$apache/beam_python3.7_sdk:2.42.0.dev')
INFO     root:portable_runner.py:577 Attempting to pull image apache/beam_python3.7_sdk:2.42.0.dev
INFO     root:portable_runner.py:577 Unable to pull image apache/beam_python3.7_sdk:2.42.0.dev, defaulting to local image if it exists
INFO     root:portable_runner.py:577 Waiting for docker to start up. Current status is running
INFO     root:portable_runner.py:577 Docker container is running. container_id = b'e5183a18550df7698137f765115f43ac1ab1c95a0cc4f9dcae919a0e3352f205', worker_id = worker_79
INFO     root:portable_runner.py:577 Created Worker handler <apache_beam.runners.portability.fn_api_runner.worker_handlers.DockerSdkWorkerHandler object at 0x7f12640f2ad0> for environment external_7beam:env:docker:v1 (beam:env:docker:v1, b'\n apache/beam_java8_sdk:2.42.0.dev')
INFO     root:portable_runner.py:577 Attempting to pull image apache/beam_java8_sdk:2.42.0.dev
INFO     root:portable_runner.py:577 Unable to pull image apache/beam_java8_sdk:2.42.0.dev, defaulting to local image if it exists
INFO     root:portable_runner.py:577 Waiting for docker to start up. Current status is running
INFO     root:portable_runner.py:577 Docker container is running. container_id = b'21129f6c8bd7308ae2a5379157a91c4975397f7f845512b72950a6a80ac270be', worker_id = worker_80
INFO     root:portable_runner.py:577 Completed job in 12.965173482894897 seconds with state DONE.
INFO     apache_beam.runners.portability.portable_runner:portable_runner.py:583 Job state changed to DONE
PASSED                                                                   [ 77%]
apache_beam/transforms/sql_test.py::SqlTransformTest::test_windowing_before_sql 
-------------------------------- live log call ---------------------------------
INFO     apache_beam.utils.subprocess_server:subprocess_server.py:239 Using pre-built snapshot at <https://ci-beam.apache.org/job/beam_PostCommit_XVR_Direct/ws/src/sdks/java/extensions/sql/expansion-service/build/libs/beam-sdks-java-extensions-sql-expansion-service-2.42.0-SNAPSHOT.jar>
INFO     root:external.py:773 Starting a JAR-based expansion service from JAR <https://ci-beam.apache.org/job/beam_PostCommit_XVR_Direct/ws/src/sdks/java/extensions/sql/expansion-service/build/libs/beam-sdks-java-extensions-sql-expansion-service-2.42.0-SNAPSHOT.jar> 
INFO     apache_beam.utils.subprocess_server:subprocess_server.py:116 Starting service with ['java' '-jar' '<https://ci-beam.apache.org/job/beam_PostCommit_XVR_Direct/ws/src/sdks/java/extensions/sql/expansion-service/build/libs/beam-sdks-java-extensions-sql-expansion-service-2.42.0-SNAPSHOT.jar'> '60447' '--filesToStage=<https://ci-beam.apache.org/job/beam_PostCommit_XVR_Direct/ws/src/sdks/java/extensions/sql/expansion-service/build/libs/beam-sdks-java-extensions-sql-expansion-service-2.42.0-SNAPSHOT.jar']>
INFO     apache_beam.utils.subprocess_server:subprocess_server.py:126 Starting expansion service at localhost:60447
INFO     apache_beam.utils.subprocess_server:subprocess_server.py:126 Sep 06, 2022 5:34:19 AM org.apache.beam.sdk.expansion.service.ExpansionService loadRegisteredTransforms
INFO     apache_beam.utils.subprocess_server:subprocess_server.py:126 INFO: Registering external transforms: [beam:external:java:sql:v1, beam:transform:org.apache.beam:pubsub_read:v1, beam:transform:org.apache.beam:pubsub_write:v1, beam:transform:org.apache.beam:pubsublite_write:v1, beam:transform:org.apache.beam:pubsublite_read:v1, beam:transform:org.apache.beam:spanner_insert:v1, beam:transform:org.apache.beam:spanner_update:v1, beam:transform:org.apache.beam:spanner_replace:v1, beam:transform:org.apache.beam:spanner_insert_or_update:v1, beam:transform:org.apache.beam:spanner_delete:v1, beam:transform:org.apache.beam:spanner_read:v1, beam:transform:org.apache.beam:kafka_read_with_metadata:v1, beam:transform:org.apache.beam:kafka_read_without_metadata:v1, beam:transform:org.apache.beam:kafka_write:v1, beam:external:java:generate_sequence:v1]
INFO     apache_beam.utils.subprocess_server:subprocess_server.py:126 	beam:external:java:sql:v1: org.apache.beam.sdk.expansion.service.ExpansionService$ExternalTransformRegistrarLoader$1@47eaca72
INFO     apache_beam.utils.subprocess_server:subprocess_server.py:126 	beam:transform:org.apache.beam:pubsub_read:v1: org.apache.beam.sdk.expansion.service.ExpansionService$ExternalTransformRegistrarLoader$1@55141def
INFO     apache_beam.utils.subprocess_server:subprocess_server.py:126 	beam:transform:org.apache.beam:pubsub_write:v1: org.apache.beam.sdk.expansion.service.ExpansionService$ExternalTransformRegistrarLoader$1@55182842
INFO     apache_beam.utils.subprocess_server:subprocess_server.py:126 	beam:transform:org.apache.beam:pubsublite_write:v1: org.apache.beam.sdk.expansion.service.ExpansionService$ExternalTransformRegistrarLoader$1@3270d194
INFO     apache_beam.utils.subprocess_server:subprocess_server.py:126 	beam:transform:org.apache.beam:pubsublite_read:v1: org.apache.beam.sdk.expansion.service.ExpansionService$ExternalTransformRegistrarLoader$1@235834f2
INFO     apache_beam.utils.subprocess_server:subprocess_server.py:126 	beam:transform:org.apache.beam:spanner_insert:v1: org.apache.beam.sdk.expansion.service.ExpansionService$ExternalTransformRegistrarLoader$1@5656be13
INFO     apache_beam.utils.subprocess_server:subprocess_server.py:126 	beam:transform:org.apache.beam:spanner_update:v1: org.apache.beam.sdk.expansion.service.ExpansionService$ExternalTransformRegistrarLoader$1@4218d6a3
INFO     apache_beam.utils.subprocess_server:subprocess_server.py:126 	beam:transform:org.apache.beam:spanner_replace:v1: org.apache.beam.sdk.expansion.service.ExpansionService$ExternalTransformRegistrarLoader$1@76505305
INFO     apache_beam.utils.subprocess_server:subprocess_server.py:126 	beam:transform:org.apache.beam:spanner_insert_or_update:v1: org.apache.beam.sdk.expansion.service.ExpansionService$ExternalTransformRegistrarLoader$1@14cd1699
INFO     apache_beam.utils.subprocess_server:subprocess_server.py:126 	beam:transform:org.apache.beam:spanner_delete:v1: org.apache.beam.sdk.expansion.service.ExpansionService$ExternalTransformRegistrarLoader$1@77888435
INFO     apache_beam.utils.subprocess_server:subprocess_server.py:126 	beam:transform:org.apache.beam:spanner_read:v1: org.apache.beam.sdk.expansion.service.ExpansionService$ExternalTransformRegistrarLoader$1@73a1e9a9
INFO     apache_beam.utils.subprocess_server:subprocess_server.py:126 	beam:transform:org.apache.beam:kafka_read_with_metadata:v1: org.apache.beam.sdk.expansion.service.ExpansionService$ExternalTransformRegistrarLoader$1@71d44a3
INFO     apache_beam.utils.subprocess_server:subprocess_server.py:126 	beam:transform:org.apache.beam:kafka_read_without_metadata:v1: org.apache.beam.sdk.expansion.service.ExpansionService$ExternalTransformRegistrarLoader$1@7b98f307
INFO     apache_beam.utils.subprocess_server:subprocess_server.py:126 	beam:transform:org.apache.beam:kafka_write:v1: org.apache.beam.sdk.expansion.service.ExpansionService$ExternalTransformRegistrarLoader$1@4802796d
INFO     apache_beam.utils.subprocess_server:subprocess_server.py:126 	beam:external:java:generate_sequence:v1: org.apache.beam.sdk.expansion.service.ExpansionService$ExternalTransformRegistrarLoader$1@34123d65
INFO     apache_beam.utils.subprocess_server:subprocess_server.py:126 Sep 06, 2022 5:34:20 AM org.apache.beam.sdk.expansion.service.ExpansionService expand
INFO     apache_beam.utils.subprocess_server:subprocess_server.py:126 INFO: Expanding 'SqlTransform(beam:external:java:sql:v1)' with URN 'beam:external:java:sql:v1'
INFO     apache_beam.utils.subprocess_server:subprocess_server.py:126 Sep 06, 2022 5:34:20 AM org.apache.beam.sdk.expansion.service.ExpansionService$ExternalTransformRegistrarLoader payloadToConfig
INFO     apache_beam.utils.subprocess_server:subprocess_server.py:126 WARNING: Configuration class 'org.apache.beam.sdk.extensions.sql.expansion.ExternalSqlTransformRegistrar$Configuration' has no schema registered. Attempting to construct with setter approach.
INFO     apache_beam.utils.subprocess_server:subprocess_server.py:126 Sep 06, 2022 5:34:21 AM org.apache.beam.sdk.expansion.service.ExpansionService$ExternalTransformRegistrarLoader payloadToConfig
INFO     apache_beam.utils.subprocess_server:subprocess_server.py:126 WARNING: Configuration class 'org.apache.beam.sdk.extensions.sql.expansion.ExternalSqlTransformRegistrar$Configuration' has no schema registered. Attempting to construct with setter approach.
INFO     apache_beam.utils.subprocess_server:subprocess_server.py:126 Sep 06, 2022 5:34:22 AM org.apache.beam.sdk.extensions.sql.impl.CalciteQueryPlanner convertToBeamRel
INFO     apache_beam.utils.subprocess_server:subprocess_server.py:126 INFO: SQL:
INFO     apache_beam.utils.subprocess_server:subprocess_server.py:126 SELECT COUNT(*) AS `count`
INFO     apache_beam.utils.subprocess_server:subprocess_server.py:126 FROM `beam`.`PCOLLECTION` AS `PCOLLECTION`
INFO     apache_beam.utils.subprocess_server:subprocess_server.py:126 Sep 06, 2022 5:34:23 AM org.apache.beam.sdk.extensions.sql.impl.CalciteQueryPlanner convertToBeamRel
INFO     apache_beam.utils.subprocess_server:subprocess_server.py:126 INFO: SQLPlan>
INFO     apache_beam.utils.subprocess_server:subprocess_server.py:126 LogicalAggregate(group=[{}], count=[COUNT()])
INFO     apache_beam.utils.subprocess_server:subprocess_server.py:126   BeamIOSourceRel(table=[[beam, PCOLLECTION]])
INFO     apache_beam.utils.subprocess_server:subprocess_server.py:126 
INFO     apache_beam.utils.subprocess_server:subprocess_server.py:126 Sep 06, 2022 5:34:23 AM org.apache.beam.sdk.extensions.sql.impl.CalciteQueryPlanner convertToBeamRel
INFO     apache_beam.utils.subprocess_server:subprocess_server.py:126 INFO: BEAMPlan>
INFO     apache_beam.utils.subprocess_server:subprocess_server.py:126 BeamAggregationRel(group=[{}], count=[COUNT()])
INFO     apache_beam.utils.subprocess_server:subprocess_server.py:126   BeamIOSourceRel(table=[[beam, PCOLLECTION]])
INFO     apache_beam.utils.subprocess_server:subprocess_server.py:126 
INFO     root:environments.py:376 Default Python SDK image for environment is apache/beam_python3.7_sdk:2.42.0.dev
INFO     root:environments.py:299 No image given, using default Python SDK image
INFO     root:environments.py:376 Default Python SDK image for environment is apache/beam_python3.7_sdk:2.42.0.dev
INFO     root:environments.py:304 Python SDK container image set to "apache/beam_python3.7_sdk:2.42.0.dev" for Docker environment
INFO     apache_beam.runners.portability.fn_api_runner.translations:translations.py:714 ==================== <function pack_combiners at 0x7f78bff17950> ====================
INFO     apache_beam.runners.portability.fn_api_runner.translations:translations.py:714 ==================== <function lift_combiners at 0x7f78bff179e0> ====================
INFO     apache_beam.runners.portability.fn_api_runner.translations:translations.py:714 ==================== <function sort_stages at 0x7f78bff18170> ====================
INFO     apache_beam.runners.portability.portable_runner:portable_runner.py:583 Job state changed to STOPPED
INFO     apache_beam.runners.portability.portable_runner:portable_runner.py:583 Job state changed to STARTING
INFO     apache_beam.runners.portability.portable_runner:portable_runner.py:583 Job state changed to RUNNING
INFO     root:portable_runner.py:577 Default Python SDK image for environment is apache/beam_python3.7_sdk:2.42.0.dev
INFO     root:portable_runner.py:577 ==================== <function annotate_downstream_side_inputs at 0x7f1265272290> ====================
INFO     root:portable_runner.py:577 ==================== <function fix_side_input_pcoll_coders at 0x7f12652723b0> ====================
INFO     root:portable_runner.py:577 ==================== <function pack_combiners at 0x7f12652728c0> ====================
INFO     root:portable_runner.py:577 ==================== <function lift_combiners at 0x7f1265272950> ====================
INFO     root:portable_runner.py:577 ==================== <function expand_sdf at 0x7f1265272b00> ====================
INFO     root:portable_runner.py:577 ==================== <function expand_gbk at 0x7f1265272b90> ====================
INFO     root:portable_runner.py:577 ==================== <function sink_flattens at 0x7f1265272cb0> ====================
INFO     root:portable_runner.py:577 ==================== <function greedily_fuse at 0x7f1265272d40> ====================
INFO     root:portable_runner.py:577 ==================== <function read_to_impulse at 0x7f1265272dd0> ====================
INFO     root:portable_runner.py:577 ==================== <function impulse_to_input at 0x7f1265272e60> ====================
INFO     root:portable_runner.py:577 ==================== <function sort_stages at 0x7f12652730e0> ====================
INFO     root:portable_runner.py:577 ==================== <function add_impulse_to_dangling_transforms at 0x7f1265273200> ====================
INFO     root:portable_runner.py:577 ==================== <function setup_timer_mapping at 0x7f1265273050> ====================
INFO     root:portable_runner.py:577 ==================== <function populate_data_channel_coders at 0x7f1265273170> ====================
INFO     root:portable_runner.py:577 starting control server on port 40979
INFO     root:portable_runner.py:577 starting data server on port 37427
INFO     root:portable_runner.py:577 starting state server on port 38765
INFO     root:portable_runner.py:577 starting logging server on port 39799
INFO     root:portable_runner.py:577 Created Worker handler <apache_beam.runners.portability.fn_api_runner.worker_handlers.DockerSdkWorkerHandler object at 0x7f1264094a10> for environment ref_Environment_default_environment_2 (beam:env:docker:v1, b'\n$apache/beam_python3.7_sdk:2.42.0.dev')
INFO     root:portable_runner.py:577 Attempting to pull image apache/beam_python3.7_sdk:2.42.0.dev
INFO     root:portable_runner.py:577 Unable to pull image apache/beam_python3.7_sdk:2.42.0.dev, defaulting to local image if it exists
INFO     root:portable_runner.py:577 Waiting for docker to start up. Current status is running
INFO     root:portable_runner.py:577 Docker container is running. container_id = b'98ea329307a4ebd12b81544d7911062d2006e8a37d2e60103c09cd757edfdecf', worker_id = worker_81
INFO     root:portable_runner.py:577 Created Worker handler <apache_beam.runners.portability.fn_api_runner.worker_handlers.DockerSdkWorkerHandler object at 0x7f1265139090> for environment external_8beam:env:docker:v1 (beam:env:docker:v1, b'\n apache/beam_java8_sdk:2.42.0.dev')
INFO     root:portable_runner.py:577 Attempting to pull image apache/beam_java8_sdk:2.42.0.dev
INFO     root:portable_runner.py:577 Unable to pull image apache/beam_java8_sdk:2.42.0.dev, defaulting to local image if it exists
INFO     root:portable_runner.py:577 Waiting for docker to start up. Current status is running
INFO     root:portable_runner.py:577 Docker container is running. container_id = b'cbc2b352ecb3ad925d02d7a4567ea1c65834354ef8fb55c729458bca0d76c2c5', worker_id = worker_82
INFO     root:portable_runner.py:577 Completed job in 11.554276943206787 seconds with state DONE.
INFO     apache_beam.runners.portability.portable_runner:portable_runner.py:583 Job state changed to DONE
PASSED                                                                   [ 88%]
apache_beam/transforms/sql_test.py::SqlTransformTest::test_zetasql_generate_data 
-------------------------------- live log call ---------------------------------
INFO     apache_beam.utils.subprocess_server:subprocess_server.py:239 Using pre-built snapshot at <https://ci-beam.apache.org/job/beam_PostCommit_XVR_Direct/ws/src/sdks/java/extensions/sql/expansion-service/build/libs/beam-sdks-java-extensions-sql-expansion-service-2.42.0-SNAPSHOT.jar>
INFO     root:external.py:773 Starting a JAR-based expansion service from JAR <https://ci-beam.apache.org/job/beam_PostCommit_XVR_Direct/ws/src/sdks/java/extensions/sql/expansion-service/build/libs/beam-sdks-java-extensions-sql-expansion-service-2.42.0-SNAPSHOT.jar> 
INFO     apache_beam.utils.subprocess_server:subprocess_server.py:116 Starting service with ['java' '-jar' '<https://ci-beam.apache.org/job/beam_PostCommit_XVR_Direct/ws/src/sdks/java/extensions/sql/expansion-service/build/libs/beam-sdks-java-extensions-sql-expansion-service-2.42.0-SNAPSHOT.jar'> '56179' '--filesToStage=<https://ci-beam.apache.org/job/beam_PostCommit_XVR_Direct/ws/src/sdks/java/extensions/sql/expansion-service/build/libs/beam-sdks-java-extensions-sql-expansion-service-2.42.0-SNAPSHOT.jar']>
INFO     apache_beam.utils.subprocess_server:subprocess_server.py:126 Starting expansion service at localhost:56179
INFO     apache_beam.utils.subprocess_server:subprocess_server.py:126 Sep 06, 2022 5:34:43 AM org.apache.beam.sdk.expansion.service.ExpansionService loadRegisteredTransforms
INFO     apache_beam.utils.subprocess_server:subprocess_server.py:126 INFO: Registering external transforms: [beam:external:java:sql:v1, beam:transform:org.apache.beam:pubsub_read:v1, beam:transform:org.apache.beam:pubsub_write:v1, beam:transform:org.apache.beam:pubsublite_write:v1, beam:transform:org.apache.beam:pubsublite_read:v1, beam:transform:org.apache.beam:spanner_insert:v1, beam:transform:org.apache.beam:spanner_update:v1, beam:transform:org.apache.beam:spanner_replace:v1, beam:transform:org.apache.beam:spanner_insert_or_update:v1, beam:transform:org.apache.beam:spanner_delete:v1, beam:transform:org.apache.beam:spanner_read:v1, beam:transform:org.apache.beam:kafka_read_with_metadata:v1, beam:transform:org.apache.beam:kafka_read_without_metadata:v1, beam:transform:org.apache.beam:kafka_write:v1, beam:external:java:generate_sequence:v1]
INFO     apache_beam.utils.subprocess_server:subprocess_server.py:126 	beam:external:java:sql:v1: org.apache.beam.sdk.expansion.service.ExpansionService$ExternalTransformRegistrarLoader$1@47eaca72
INFO     apache_beam.utils.subprocess_server:subprocess_server.py:126 	beam:transform:org.apache.beam:pubsub_read:v1: org.apache.beam.sdk.expansion.service.ExpansionService$ExternalTransformRegistrarLoader$1@55141def
INFO     apache_beam.utils.subprocess_server:subprocess_server.py:126 	beam:transform:org.apache.beam:pubsub_write:v1: org.apache.beam.sdk.expansion.service.ExpansionService$ExternalTransformRegistrarLoader$1@55182842
INFO     apache_beam.utils.subprocess_server:subprocess_server.py:126 	beam:transform:org.apache.beam:pubsublite_write:v1: org.apache.beam.sdk.expansion.service.ExpansionService$ExternalTransformRegistrarLoader$1@3270d194
INFO     apache_beam.utils.subprocess_server:subprocess_server.py:126 	beam:transform:org.apache.beam:pubsublite_read:v1: org.apache.beam.sdk.expansion.service.ExpansionService$ExternalTransformRegistrarLoader$1@235834f2
INFO     apache_beam.utils.subprocess_server:subprocess_server.py:126 	beam:transform:org.apache.beam:spanner_insert:v1: org.apache.beam.sdk.expansion.service.ExpansionService$ExternalTransformRegistrarLoader$1@5656be13
INFO     apache_beam.utils.subprocess_server:subprocess_server.py:126 	beam:transform:org.apache.beam:spanner_update:v1: org.apache.beam.sdk.expansion.service.ExpansionService$ExternalTransformRegistrarLoader$1@4218d6a3
INFO     apache_beam.utils.subprocess_server:subprocess_server.py:126 	beam:transform:org.apache.beam:spanner_replace:v1: org.apache.beam.sdk.expansion.service.ExpansionService$ExternalTransformRegistrarLoader$1@76505305
INFO     apache_beam.utils.subprocess_server:subprocess_server.py:126 	beam:transform:org.apache.beam:spanner_insert_or_update:v1: org.apache.beam.sdk.expansion.service.ExpansionService$ExternalTransformRegistrarLoader$1@14cd1699
INFO     apache_beam.utils.subprocess_server:subprocess_server.py:126 	beam:transform:org.apache.beam:spanner_delete:v1: org.apache.beam.sdk.expansion.service.ExpansionService$ExternalTransformRegistrarLoader$1@77888435
INFO     apache_beam.utils.subprocess_server:subprocess_server.py:126 	beam:transform:org.apache.beam:spanner_read:v1: org.apache.beam.sdk.expansion.service.ExpansionService$ExternalTransformRegistrarLoader$1@73a1e9a9
INFO     apache_beam.utils.subprocess_server:subprocess_server.py:126 	beam:transform:org.apache.beam:kafka_read_with_metadata:v1: org.apache.beam.sdk.expansion.service.ExpansionService$ExternalTransformRegistrarLoader$1@71d44a3
INFO     apache_beam.utils.subprocess_server:subprocess_server.py:126 	beam:transform:org.apache.beam:kafka_read_without_metadata:v1: org.apache.beam.sdk.expansion.service.ExpansionService$ExternalTransformRegistrarLoader$1@7b98f307
INFO     apache_beam.utils.subprocess_server:subprocess_server.py:126 	beam:transform:org.apache.beam:kafka_write:v1: org.apache.beam.sdk.expansion.service.ExpansionService$ExternalTransformRegistrarLoader$1@4802796d
INFO     apache_beam.utils.subprocess_server:subprocess_server.py:126 	beam:external:java:generate_sequence:v1: org.apache.beam.sdk.expansion.service.ExpansionService$ExternalTransformRegistrarLoader$1@34123d65
INFO     apache_beam.utils.subprocess_server:subprocess_server.py:126 Sep 06, 2022 5:34:44 AM org.apache.beam.sdk.expansion.service.ExpansionService expand
INFO     apache_beam.utils.subprocess_server:subprocess_server.py:126 INFO: Expanding 'SqlTransform(beam:external:java:sql:v1)' with URN 'beam:external:java:sql:v1'
INFO     apache_beam.utils.subprocess_server:subprocess_server.py:126 Sep 06, 2022 5:34:44 AM org.apache.beam.sdk.expansion.service.ExpansionService$ExternalTransformRegistrarLoader payloadToConfig
INFO     apache_beam.utils.subprocess_server:subprocess_server.py:126 WARNING: Configuration class 'org.apache.beam.sdk.extensions.sql.expansion.ExternalSqlTransformRegistrar$Configuration' has no schema registered. Attempting to construct with setter approach.
INFO     apache_beam.utils.subprocess_server:subprocess_server.py:126 Sep 06, 2022 5:34:45 AM org.apache.beam.sdk.expansion.service.ExpansionService$ExternalTransformRegistrarLoader payloadToConfig
INFO     apache_beam.utils.subprocess_server:subprocess_server.py:126 WARNING: Configuration class 'org.apache.beam.sdk.extensions.sql.expansion.ExternalSqlTransformRegistrar$Configuration' has no schema registered. Attempting to construct with setter approach.
INFO     apache_beam.utils.subprocess_server:subprocess_server.py:126 Sep 06, 2022 5:34:47 AM com.google.zetasql.io.grpc.NameResolverRegistry getDefaultRegistry
INFO     apache_beam.utils.subprocess_server:subprocess_server.py:126 WARNING: No NameResolverProviders found via ServiceLoader, including for DNS. This is probably due to a broken build. If using ProGuard, check your configuration
INFO     apache_beam.utils.subprocess_server:subprocess_server.py:126 Sep 06, 2022 5:34:48 AM org.apache.beam.sdk.extensions.sql.zetasql.ZetaSQLQueryPlanner convertToBeamRelInternal
INFO     apache_beam.utils.subprocess_server:subprocess_server.py:126 INFO: BEAMPlan>
INFO     apache_beam.utils.subprocess_server:subprocess_server.py:126 BeamZetaSqlCalcRel(expr#0=[{inputs}], expr#1=[1:BIGINT], expr#2=['foo':VARCHAR], expr#3=[3.1400000000000001243E0:DOUBLE], int=[$t1], str=[$t2], flt=[$t3])
INFO     apache_beam.utils.subprocess_server:subprocess_server.py:126   BeamValuesRel(tuples=[[{ 0 }]])
INFO     apache_beam.utils.subprocess_server:subprocess_server.py:126 
INFO     root:environments.py:376 Default Python SDK image for environment is apache/beam_python3.7_sdk:2.42.0.dev
INFO     root:environments.py:299 No image given, using default Python SDK image
INFO     root:environments.py:376 Default Python SDK image for environment is apache/beam_python3.7_sdk:2.42.0.dev
INFO     root:environments.py:304 Python SDK container image set to "apache/beam_python3.7_sdk:2.42.0.dev" for Docker environment
INFO     apache_beam.runners.portability.fn_api_runner.translations:translations.py:714 ==================== <function pack_combiners at 0x7f78bff17950> ====================
INFO     apache_beam.runners.portability.fn_api_runner.translations:translations.py:714 ==================== <function lift_combiners at 0x7f78bff179e0> ====================
INFO     apache_beam.runners.portability.fn_api_runner.translations:translations.py:714 ==================== <function sort_stages at 0x7f78bff18170> ====================
INFO     apache_beam.runners.portability.portable_runner:portable_runner.py:583 Job state changed to STOPPED
INFO     apache_beam.runners.portability.portable_runner:portable_runner.py:583 Job state changed to STARTING
INFO     apache_beam.runners.portability.portable_runner:portable_runner.py:583 Job state changed to RUNNING
INFO     root:portable_runner.py:577 Default Python SDK image for environment is apache/beam_python3.7_sdk:2.42.0.dev
INFO     root:portable_runner.py:577 ==================== <function annotate_downstream_side_inputs at 0x7f1265272290> ====================
INFO     root:portable_runner.py:577 ==================== <function fix_side_input_pcoll_coders at 0x7f12652723b0> ====================
INFO     root:portable_runner.py:577 ==================== <function pack_combiners at 0x7f12652728c0> ====================
INFO     root:portable_runner.py:577 ==================== <function lift_combiners at 0x7f1265272950> ====================
INFO     root:portable_runner.py:577 ==================== <function expand_sdf at 0x7f1265272b00> ====================
INFO     root:portable_runner.py:577 ==================== <function expand_gbk at 0x7f1265272b90> ====================
INFO     root:portable_runner.py:577 ==================== <function sink_flattens at 0x7f1265272cb0> ====================
INFO     root:portable_runner.py:577 ==================== <function greedily_fuse at 0x7f1265272d40> ====================
INFO     root:portable_runner.py:577 ==================== <function read_to_impulse at 0x7f1265272dd0> ====================
INFO     root:portable_runner.py:577 ==================== <function impulse_to_input at 0x7f1265272e60> ====================
INFO     root:portable_runner.py:577 ==================== <function sort_stages at 0x7f12652730e0> ====================
INFO     root:portable_runner.py:577 ==================== <function add_impulse_to_dangling_transforms at 0x7f1265273200> ====================
INFO     root:portable_runner.py:577 ==================== <function setup_timer_mapping at 0x7f1265273050> ====================
INFO     root:portable_runner.py:577 ==================== <function populate_data_channel_coders at 0x7f1265273170> ====================
INFO     root:portable_runner.py:577 starting control server on port 46689
INFO     root:portable_runner.py:577 starting data server on port 34515
INFO     root:portable_runner.py:577 starting state server on port 39727
INFO     root:portable_runner.py:577 starting logging server on port 41145
INFO     root:portable_runner.py:577 Created Worker handler <apache_beam.runners.portability.fn_api_runner.worker_handlers.DockerSdkWorkerHandler object at 0x7f1265148590> for environment external_9beam:env:docker:v1 (beam:env:docker:v1, b'\n apache/beam_java8_sdk:2.42.0.dev')
INFO     root:portable_runner.py:577 Attempting to pull image apache/beam_java8_sdk:2.42.0.dev
INFO     root:portable_runner.py:577 Unable to pull image apache/beam_java8_sdk:2.42.0.dev, defaulting to local image if it exists
INFO     root:portable_runner.py:577 Waiting for docker to start up. Current status is running
INFO     root:portable_runner.py:577 Docker container is running. container_id = b'd3ff96e9113297557107891a9bb8e16f20005777318bab7015cdf4dc282e6f7a', worker_id = worker_83
INFO     root:portable_runner.py:577 Created Worker handler <apache_beam.runners.portability.fn_api_runner.worker_handlers.DockerSdkWorkerHandler object at 0x7f124f7b0d90> for environment ref_Environment_default_environment_2 (beam:env:docker:v1, b'\n$apache/beam_python3.7_sdk:2.42.0.dev')
INFO     root:portable_runner.py:577 Attempting to pull image apache/beam_python3.7_sdk:2.42.0.dev
INFO     root:portable_runner.py:577 Unable to pull image apache/beam_python3.7_sdk:2.42.0.dev, defaulting to local image if it exists
INFO     root:portable_runner.py:577 Waiting for docker to start up. Current status is running
INFO     root:portable_runner.py:577 Docker container is running. container_id = b'93c257960191629630c5467175159ce3cdf1abcc3390e8a6a38cab6d0500a16c', worker_id = worker_84
INFO     root:portable_runner.py:577 Completed job in 11.585106611251831 seconds with state DONE.
INFO     apache_beam.runners.portability.portable_runner:portable_runner.py:583 Job state changed to DONE
PASSED                                                                   [100%]

=============================== warnings summary ===============================
../../build/gradleenv/1922375555/lib/python3.7/site-packages/hdfs/config.py:15
  <https://ci-beam.apache.org/job/beam_PostCommit_XVR_Direct/ws/src/build/gradleenv/1922375555/lib/python3.7/site-packages/hdfs/config.py>:15: DeprecationWarning: the imp module is deprecated in favour of importlib; see the module's documentation for alternative uses
    from imp import load_source

../../build/gradleenv/1922375555/lib/python3.7/site-packages/google/api_core/grpc_helpers.py:42
  <https://ci-beam.apache.org/job/beam_PostCommit_XVR_Direct/ws/src/build/gradleenv/1922375555/lib/python3.7/site-packages/google/api_core/grpc_helpers.py>:42: DeprecationWarning: Support for grpcio-gcp is deprecated. This feature will be
              removed from `google-api-core` after January 1, 2024. If you need to
              continue to use this feature, please pin to a specific version of
              `google-api-core`.
    DeprecationWarning,

-- Docs: https://docs.pytest.org/en/stable/how-to/capture-warnings.html
- generated xml file: <https://ci-beam.apache.org/job/beam_PostCommit_XVR_Direct/ws/src/sdks/python/pytest_xlangSqlValidateRunner.xml> -
==== 9 passed, 2 skipped, 6648 deselected, 2 warnings in 234.62s (0:03:54) =====

> Task :sdks:python:test-suites:direct:xlang:validatesCrossLanguageRunnerCleanup
Stopping expansion service pid: 3400622.
Stopping expansion service pid: 3400623.

> Task :sdks:python:test-suites:direct:xlang:fnApiJobServerCleanup
Killing process at 3396366

FAILURE: Build failed with an exception.

* What went wrong:
Execution failed for task ':sdks:python:test-suites:direct:xlang:validatesCrossLanguageRunnerJavaUsingPython'.
> There were failing tests. See the report at: file://<https://ci-beam.apache.org/job/beam_PostCommit_XVR_Direct/ws/src/sdks/python/test-suites/direct/xlang/build/reports/tests/validatesCrossLanguageRunnerJavaUsingPython/index.html>

* Try:
> Run with --stacktrace option to get the stack trace.
> Run with --info or --debug option to get more log output.
> Run with --scan to get full insights.

* Get more help at https://help.gradle.org

Deprecated Gradle features were used in this build, making it incompatible with Gradle 8.0.

You can use '--warning-mode all' to show the individual deprecation warnings and determine if they come from your own scripts or plugins.

See https://docs.gradle.org/7.4/userguide/command_line_interface.html#sec:command_line_warnings

Execution optimizations have been disabled for 1 invalid unit(s) of work during this build to ensure correctness.
Please consult deprecation warnings for more details.

BUILD FAILED in 24m 47s
247 actionable tasks: 162 executed, 73 from cache, 12 up-to-date

Publishing build scan...
https://gradle.com/s/3h3ysleqfy3k2

Build step 'Invoke Gradle script' changed build result to FAILURE
Build step 'Invoke Gradle script' marked build as failure

---------------------------------------------------------------------
To unsubscribe, e-mail: builds-unsubscribe@beam.apache.org
For additional commands, e-mail: builds-help@beam.apache.org


Build failed in Jenkins: beam_PostCommit_XVR_Direct #3104

Posted by Apache Jenkins Server <je...@builds.apache.org>.
See <https://ci-beam.apache.org/job/beam_PostCommit_XVR_Direct/3104/display/redirect>

Changes:


------------------------------------------
[...truncated 848.46 KB...]
      spec: <
        urn: "beam:coder:row:v1"
        payload: "\n\r\n\007role_id\032\002\020\004\022$d81b9e9b-581e-4c67-89c9-cbd6bf3bb62a"
      >
    >
  >
  coders: <
    key: "cGPNvAMPrXSnappyCoder"
    value: <
      spec: <
        urn: "beam:coders:javasdk:0.1"
        payload: "\202SNAPPY\000\000\000\000\001\000\000\000\001\000\000\001.\307\003\360@\254\355\000\005sr\000&org.apache.beam.sdk.coders.SnappyCoder1\033\243\356\177\362\366,\002\000\001L\000\ninner\005\030 t\000\"Lorg/a\005B\000/\001B\020/sdk/\tB\000/\005$\020;xr\000*ng\000 tructured\005/8s\277\022\016\325\3246\021\002\000\000xr\000 j9\000\005/\034C\335\325\211\256\274~\370\001/\020psr\000,j1\000,Serializable\005= \010\364 \216\305ynl\002\001\327\\\004typet\000\021Ljava/lang/Class\001\300n'\001\024Custom\005PPj\260\010\235\013;\035\013\002\000\000xq\000~\000\003vr\000$N\221\000\\io.BoundedSource!`v\023\177\370QA\0019\010r\000\035Z3\000\t,0\020\213\372\020Y\214\347\323\002\000\000xp"
      >
    >
  >
  coders: <
    key: "cGPNvAMPrXTimestampedValueCoder"
    value: <
      spec: <
        urn: "beam:coders:javasdk:0.1"
        payload: "\202SNAPPY\000\000\000\000\001\000\000\000\001\000\000\006]\313\026\270\254\355\000\005sr\000Aorg.apache.beam.sdk.values.TimestampedV\001\022\000$>\021\000HCoder\364\376\202p\274iX-\002\000\001L\000\n\005;\005\030\034t\000\"Lorg/\t]\000/\001]\024/sdk/c\0015\004s/\005$\020;xr\000*N\202\000\t%(.Structured\005/8s\277\022\016\325\3246\021\002\000\000xr\000 j9\000\005/\034C\335\325\211\256\274~\370\001/\020psr\000#j1\000\010Row\0054\034\254\236\213\244M\203\363\250\0014\010r\000'N2\000 schemas.S\005\010\0056|\023\226L\354\244P\260l\002\000\004L\000\017fromRowFunctiont\0005R\t\001Xtransforms/Serializable\0217\014;L\000\006\tk\010t\000$RA\000\t\036\004s/\t\211\024;L\000\rto\035x`q\000~\000\007L\000\016typeDescriptort\000+RM\000%\271\010s/T2-\000!\240\000&N\004\001-\240\024Custom%\003\034j\260\010\235\013;\035\013!9\001z\020\003sr\000=N;\000\031\367\000.N\367\000Ds$Identity\033n\367C9'S\320\001R!\277\000\"NN\000-\004-\215d7\242\227\362z%\204e\002\000\007Z\000\033encodingPosi!\211DsOverriddenI\000\010hash\001\272\010L\000\021B)\000\220t\000\017Ljava/util/Map;L\000\014fieldIndicest\000HL>\335\002 vendor/gu\0019Lv26_0_jre/com/google\001\0134mon/collect/Bi\tZ\000\006\005Z\014st\000\020\035u$List;L\000\007op\005\273\010t\000,R\267\001-\000M\004\004$O\t.\034;L\000\004uuid6S\000<UUID;xp\000\372\237\2577sr\000\021\001\342\000.\001\342\360I.HashMap\005\007\332\301\303\026`\321\003\000\002F\000\nloadFactorI\000\tthresholdxp?@\000\000\000\000\000\014w\010\000\000\000\020\000\000\000\001t\000\007role_id\025Wdlang.Integer\022\342\240\244\367\201\2078\002\000\001I\000\005Ei\014xr\000\020\005\177\005(4Number\206\254\225\035\013\224\340\213%\360\001b\020xsr\000J>\365\001)f\000.%f\000.5f\020.com.)f\001\013\014mon.-f\000.\001\334%j\001S\001\001(\003\000\000xpw\004\000\000\000\001A\251\000\027\001\005\000\032\001l\000\023\005\222%\021\020Array!\203 x\201\322\035\231\307a\235\003\001\274\024\004sizex\001I\000\001\t@\014sr\0002>\241\000\241A-\226\024.AutoV\241;\000_i\244\004_FAD\034\303\343i\345\363l$\364\205.\004\013dm\233\205*\000\022I\002!\026\030/String!\313\014name\001\246\010 L\000Q\020\001\017\014\022L\000\004a\335\010t\000.\216\034\002\005|a\340a\326\000(n\267\000\t\255\t1\034\263\021\225\3324!\217\246%\226\010t\000\000\001y\004\027sZ\267\005\021\370\rA\000OI\216\034\367\031\n\2336X\271\227\305\".\301\000\014\017xps\001P\004\025?IS\004\000wQS%\374\0006n\244\000V[\001\001\33749\304m\364S\243\227P\002\000\010L\000\025M\007$ionElement\001#\001u(!L\000\013logical\001\023\010t\0000\216E\001\000L\0312$;L\000\nmapKey\001@\rS\014\014map%\362\035\024 \010metadata\001$\034\017L\000\010null\241\353\010t\000\023=\3604Boolean;L\000\trow)C\0012\014\010L\000\010!\347\030Namet\000-\216\246\000\001}\001/!\352\000,nF\001\tf)\352\0015\034\013PLl[\357\3103%\356\001\001\014sr\000\036y\027\000C\211\272Lions$EmptyMapY6\024\205Z\334\347\265\247\211WA\302\000.\r\3224\315 r\200\325\234\372\356\002\000\001Z\000\005\211\000\030p\000p~r\000+\212\234\000\001\227\001\314a\273\001\001\000\022\345\375\000\016\005\225\005f\014Enum\001\031\001\001\001\035$pt\000\005INT64xE]\000%\005\006Zc\002\tGe\363\241\036x\274\231\003\367\230m\205/\002\000\002J\000\014leastSigBitsJ\000\013mo\025\016Dxp\235\327\315\333q\241\303\247Dy\2175\322.N\361\005e\014\014sr\000Ro\001\005\364\004s.\001\313\371\212(s$9z\2164\213\005/\271\347!o\010r\000)N\016\001R;\000\034x\237G[\330\210\240{eR \005tokent\000LB\032\002\251,\212\222\006\010ref\305\222\001\241\000T\001N\000;\345r\000Z>\221\000\tQ\212}\005\rQ\005\362\005Q\024$Simple\026\005\020!\255\001\001\t\372\346\346\005Bi\000\0342{#\261\276\3768|%\033\030\013runtim\005w\010t\000\030}m\r8\005\362\030;xpvr\000\036>\355\000\241\311-~(Row\032Q\006\2060\230\247\034\005X4\006schemaq\000~\000\010xp"
      >
    >
  >
  coders: <
    key: "cGPNvAMPrXVarIntCoder"
    value: <
      spec: <
        urn: "beam:coders:javasdk:0.1"
        payload: "\202SNAPPY\000\000\000\000\001\000\000\000\001\000\000\000\210\330\001\350\254\355\000\005sr\000&org.apache.beam.sdk.coders.VarIntCoder\300K2\332\251KVh\002\000\000xrr5\000\024Atomic\0055 \307\354\265\314\205tPF\002\0055\000*jj\000$Structured\0059\034s\277\022\016\325\3246\021\t9\000 j9\000\005/0C\335\325\211\256\274~\370\002\000\000xp"
      >
    >
  >
  coders: <
    key: "cGPNvAMPrXVoidCoder"
    value: <
      spec: <
        urn: "beam:coders:javasdk:0.1"
        payload: "\202SNAPPY\000\000\000\000\001\000\000\000\001\000\000\000\210\326\001\350\254\355\000\005sr\000$org.apache.beam.sdk.coders.VoidCoder\271\277U\233\350\r\257U\002\000\000xr\000&j3\000\024Atomic\0055 \307\354\265\314\205tPF\002\0055\000*j5\000$Structured\0059\034s\277\022\016\325\3246\021\t9\000 j9\000\005/0C\335\325\211\256\274~\370\002\000\000xp"
      >
    >
  >
  environments: <
    key: "cGPNvAMPrXbeam:env:docker:v1"
    value: <
      urn: "beam:env:docker:v1"
      payload: "\n apache/beam_java8_sdk:2.42.0.dev"
      capabilities: "beam:coder:bytes:v1"
      capabilities: "beam:coder:bool:v1"
      capabilities: "beam:coder:varint:v1"
      capabilities: "beam:coder:string_utf8:v1"
      capabilities: "beam:coder:iterable:v1"
      capabilities: "beam:coder:timer:v1"
      capabilities: "beam:coder:kv:v1"
      capabilities: "beam:coder:length_prefix:v1"
      capabilities: "beam:coder:global_window:v1"
      capabilities: "beam:coder:interval_window:v1"
      capabilities: "beam:coder:custom_window:v1"
      capabilities: "beam:coder:windowed_value:v1"
      capabilities: "beam:coder:double:v1"
      capabilities: "beam:coder:row:v1"
      capabilities: "beam:coder:param_windowed_value:v1"
      capabilities: "beam:coder:state_backed_iterable:v1"
      capabilities: "beam:coder:sharded_key:v1"
      capabilities: "beam:coder:nullable:v1"
      capabilities: "beam:protocol:multi_core_bundle_processing:v1"
      capabilities: "beam:protocol:progress_reporting:v1"
      capabilities: "beam:protocol:harness_monitoring_infos:v1"
      capabilities: "beam:protocol:control_request_elements_embedding:v1"
      capabilities: "beam:protocol:state_caching:v1"
      capabilities: "beam:version:sdk_base:apache/beam_java8_sdk:2.42.0.dev"
      capabilities: "beam:transform:sdf_truncate_sized_restrictions:v1"
      capabilities: "beam:transform:to_string:v1"
      dependencies: <
        type_urn: "beam:artifact:type:file:v1"
        type_payload: "\nL/tmp/artifacts/icedtea-sound-CGRxIE9edPHnbxQhM-L5mp8h21H-ySB79uQtSquPV_Q.jar\022@086471204f5e74f1e76f142133e2f99a9f21db51fec9207bf6e42d4aab8f57f4"
        role_urn: "beam:artifact:role:staging_to:v1"
        role_payload: "\n=icedtea-sound-CGRxIE9edPHnbxQhM-L5mp8h21H-ySB79uQtSquPV_Q.jar"
      >
      dependencies: <
        type_urn: "beam:artifact:type:file:v1"
        type_payload: "\nF/tmp/artifacts/jaccess-FBI0Bb27lF3oEBieWAi7SP8X1zBR8k4BJQOVpsoK9a0.jar\022@14123405bdbb945de810189e5808bb48ff17d73051f24e01250395a6ca0af5ad"
        role_urn: "beam:artifact:role:staging_to:v1"
        role_payload: "\n7jaccess-FBI0Bb27lF3oEBieWAi7SP8X1zBR8k4BJQOVpsoK9a0.jar"
      >
      dependencies: <
        type_urn: "beam:artifact:type:file:v1"
        type_payload: "\nI/tmp/artifacts/localedata-kJ2mc8rBH5-IklhfR1XzNotlIQ_mnVMA-pgaXv2r8Ag.jar\022@909da673cac11f9f8892585f4755f3368b65210fe69d5300fa981a5efdabf008"
        role_urn: "beam:artifact:role:staging_to:v1"
        role_payload: "\n:localedata-kJ2mc8rBH5-IklhfR1XzNotlIQ_mnVMA-pgaXv2r8Ag.jar"
      >
      dependencies: <
        type_urn: "beam:artifact:type:file:v1"
        type_payload: "\nF/tmp/artifacts/nashorn-B0CAb3QpJET_6VsT3hcC_89VtvhV616H8N2bHAIaqWo.jar\022@0740806f74292444ffe95b13de1702ffcf55b6f855eb5e87f0dd9b1c021aa96a"
        role_urn: "beam:artifact:role:staging_to:v1"
        role_payload: "\n7nashorn-B0CAb3QpJET_6VsT3hcC_89VtvhV616H8N2bHAIaqWo.jar"
      >
      dependencies: <
        type_urn: "beam:artifact:type:file:v1"
        type_payload: "\nG/tmp/artifacts/cldrdata-gclqV9lOGqQOKesG-a6TAUTGEYlyIDqpyd4M_k7gtWo.jar\022@81c96a57d94e1aa40e29eb06f9ae930144c6118972203aa9c9de0cfe4ee0b56a"
        role_urn: "beam:artifact:role:staging_to:v1"
        role_payload: "\n8cldrdata-gclqV9lOGqQOKesG-a6TAUTGEYlyIDqpyd4M_k7gtWo.jar"
      >
      dependencies: <
        type_urn: "beam:artifact:type:file:v1"
        type_payload: "\nD/tmp/artifacts/dnsns-byzoQxdXengTvA5IlbH9gSIzfhNQElRYltuMJN0vjcc.jar\022@6f2ce84317577a7813bc0e4895b1fd8122337e135012545896db8c24dd2f8dc7"
        role_urn: "beam:artifact:role:staging_to:v1"
        role_payload: "\n5dnsns-byzoQxdXengTvA5IlbH9gSIzfhNQElRYltuMJN0vjcc.jar"
      >
      dependencies: <
        type_urn: "beam:artifact:type:file:v1"
        type_payload: "\n\203\001/tmp/artifacts/beam-sdks-java-extensions-schemaio-expansion-service-2.42.0-SNAPSHOT-_vqtn6fpKNgqW6gb5yCi1yHVRPoFq-9toX5lGnyJ6b0.jar\022@fefaad9fa7e928d82a5ba81be720a2d721d544fa05abef6da17e651a7c89e9bd"
        role_urn: "beam:artifact:role:staging_to:v1"
        role_payload: "\ntbeam-sdks-java-extensions-schemaio-expansion-service-2.42.0-SNAPSHOT-_vqtn6fpKNgqW6gb5yCi1yHVRPoFq-9toX5lGnyJ6b0.jar"
      >
    >
  >
  environments: <
    key: "go"
    value: <
      urn: "beam:env:docker:v1"
      payload: "\n\026apache/beam_go_sdk:dev"
      capabilities: "beam:protocol:progress_reporting:v1"
      capabilities: "beam:protocol:multi_core_bundle_processing:v1"
      capabilities: "beam:transform:sdf_truncate_sized_restrictions:v1"
      capabilities: "beam:protocol:worker_status:v1"
      capabilities: "beam:protocol:monitoring_info_short_ids:v1"
      capabilities: "beam:version:sdk_base:go"
      capabilities: "beam:coder:bytes:v1"
      capabilities: "beam:coder:bool:v1"
      capabilities: "beam:coder:varint:v1"
      capabilities: "beam:coder:double:v1"
      capabilities: "beam:coder:string_utf8:v1"
      capabilities: "beam:coder:length_prefix:v1"
      capabilities: "beam:coder:kv:v1"
      capabilities: "beam:coder:iterable:v1"
      capabilities: "beam:coder:state_backed_iterable:v1"
      capabilities: "beam:coder:windowed_value:v1"
      capabilities: "beam:coder:global_window:v1"
      capabilities: "beam:coder:interval_window:v1"
      capabilities: "beam:coder:row:v1"
      capabilities: "beam:coder:nullable:v1"
      dependencies: <
        type_urn: "beam:artifact:type:file:v1"
        role_urn: "beam:artifact:role:go_worker_binary:v1"
      >
    >
  >
>
root_transform_ids: "e2"
root_transform_ids: "s1"
root_transform_ids: "e3"
root_transform_ids: "s3"
requirements: "beam:requirement:pardo:splittable_dofn:v1"
2022/09/05 23:21:12 Cross-compiling <https://ci-beam.apache.org/job/beam_PostCommit_XVR_Direct/ws/src/sdks/go/test/integration/io/xlang/jdbc/jdbc_test.go> as /tmp/worker-4-1662420072599167399
2022/09/05 23:21:14 Prepared job with id: go-testjdbcio_postgresreadwrite-688-d30d86cf-df5c-4a00-80f3-18ed5e9e290b and staging token: go-testjdbcio_postgresreadwrite-688-d30d86cf-df5c-4a00-80f3-18ed5e9e290b
2022/09/05 23:21:15 Staged binary artifact with token: 
2022/09/05 23:21:15 Submitted job: go-testjdbcio_postgresreadwrite-688-d30d86cf-df5c-4a00-80f3-18ed5e9e290b
2022/09/05 23:21:15 2022-09-05 23:21:15. (1): Default Python SDK image for environment is apache/beam_python3.7_sdk:2.42.0.dev
2022/09/05 23:21:15 Job state: STOPPED
2022/09/05 23:21:15 Job state: STARTING
2022/09/05 23:21:15 Job state: RUNNING
2022/09/05 23:21:15 2022-09-05 23:21:15. (2): ==================== <function annotate_downstream_side_inputs at 0x7f2370f8d290> ====================
2022/09/05 23:21:15 2022-09-05 23:21:15. (3): ==================== <function fix_side_input_pcoll_coders at 0x7f2370f8d3b0> ====================
2022/09/05 23:21:15 2022-09-05 23:21:15. (4): ==================== <function pack_combiners at 0x7f2370f8d8c0> ====================
2022/09/05 23:21:15 2022-09-05 23:21:15. (5): ==================== <function lift_combiners at 0x7f2370f8d950> ====================
2022/09/05 23:21:15 2022-09-05 23:21:15. (6): ==================== <function expand_sdf at 0x7f2370f8db00> ====================
2022/09/05 23:21:15 2022-09-05 23:21:15. (7): ==================== <function expand_gbk at 0x7f2370f8db90> ====================
2022/09/05 23:21:15 2022-09-05 23:21:15. (8): ==================== <function sink_flattens at 0x7f2370f8dcb0> ====================
2022/09/05 23:21:15 2022-09-05 23:21:15. (9): ==================== <function greedily_fuse at 0x7f2370f8dd40> ====================
2022/09/05 23:21:15 2022-09-05 23:21:15. (10): ==================== <function read_to_impulse at 0x7f2370f8ddd0> ====================
2022/09/05 23:21:15 2022-09-05 23:21:15. (11): ==================== <function impulse_to_input at 0x7f2370f8de60> ====================
2022/09/05 23:21:15 2022-09-05 23:21:15. (12): ==================== <function sort_stages at 0x7f2370f8f0e0> ====================
2022/09/05 23:21:15 2022-09-05 23:21:15. (13): ==================== <function add_impulse_to_dangling_transforms at 0x7f2370f8f200> ====================
2022/09/05 23:21:15 2022-09-05 23:21:15. (14): ==================== <function setup_timer_mapping at 0x7f2370f8f050> ====================
2022/09/05 23:21:15 2022-09-05 23:21:15. (15): ==================== <function populate_data_channel_coders at 0x7f2370f8f170> ====================
2022/09/05 23:21:15 2022-09-05 23:21:15. (16): starting control server on port 34735
2022/09/05 23:21:15 2022-09-05 23:21:15. (17): starting data server on port 45937
2022/09/05 23:21:15 2022-09-05 23:21:15. (18): starting state server on port 34811
2022/09/05 23:21:15 2022-09-05 23:21:15. (19): starting logging server on port 45263
2022/09/05 23:21:15 2022-09-05 23:21:15. (20): Created Worker handler <apache_beam.runners.portability.fn_api_runner.worker_handlers.DockerSdkWorkerHandler object at 0x7f237051b110> for environment cGPNvAMPrXbeam:env:docker:v1 (beam:env:docker:v1, b'\n apache/beam_java8_sdk:2.42.0.dev')
2022/09/05 23:21:17 2022-09-05 23:21:17. (21): Attempting to pull image apache/beam_java8_sdk:2.42.0.dev
2022/09/05 23:21:17 2022-09-05 23:21:17. (22): Unable to pull image apache/beam_java8_sdk:2.42.0.dev, defaulting to local image if it exists
2022/09/05 23:21:19 2022-09-05 23:21:19. (23): Waiting for docker to start up. Current status is running
2022/09/05 23:21:19 2022-09-05 23:21:19. (24): Docker container is running. container_id = b'20f25bf0541360ff487083d118fb075a0445ca3dd10e517963c926e2f59784e9', worker_id = worker_15
2022/09/05 23:21:20 2022-09-05 23:21:20. (25): Created Worker handler <apache_beam.runners.portability.fn_api_runner.worker_handlers.DockerSdkWorkerHandler object at 0x7f23835b09d0> for environment go (beam:env:docker:v1, b'\n\x16apache/beam_go_sdk:dev')
2022/09/05 23:21:22 2022-09-05 23:21:22. (26): Attempting to pull image apache/beam_go_sdk:dev
2022/09/05 23:21:22 2022-09-05 23:21:22. (27): Unable to pull image apache/beam_go_sdk:dev, defaulting to local image if it exists
2022/09/05 23:21:23 2022-09-05 23:21:23. (28): Waiting for docker to start up. Current status is running
2022/09/05 23:21:23 2022-09-05 23:21:23. (29): Docker container is running. container_id = b'd8f31bce3b50ea197e185675f8d253780d8873b378ba1671ac1671d38bd95e14', worker_id = worker_17
2022/09/05 23:21:27 2022-09-05 23:21:27. (30): Completed job in 12.498399257659912 seconds with state DONE.
2022/09/05 23:21:27 Job state: DONE
--- PASS: TestJDBCIO_PostgresReadWrite (33.58s)
PASS
ok  	github.com/apache/beam/sdks/v2/go/test/integration/io/xlang/jdbc	78.048s
=== RUN   TestKafkaIO_BasicReadWrite
    integration.go:308: Test TestKafkaIO_BasicReadWrite is currently filtered for runner portable
--- SKIP: TestKafkaIO_BasicReadWrite (0.00s)
PASS
ok  	github.com/apache/beam/sdks/v2/go/test/integration/io/xlang/kafka	6.032s

> Task :sdks:python:test-suites:direct:xlang:validatesCrossLanguageRunnerJavaUsingPython

org.apache.beam.sdk.extensions.python.transforms.RunInferenceTransformTest > testRunInferenceWithKVs FAILED
    java.lang.IllegalStateException at RunInferenceTransformTest.java:108
    java.lang.NullPointerException at Preconditions.java:980

org.apache.beam.sdk.extensions.python.transforms.RunInferenceTransformTest > testRunInference FAILED
    java.lang.IllegalStateException at RunInferenceTransformTest.java:60
    java.lang.NullPointerException at Preconditions.java:980

16 tests completed, 2 failed, 2 skipped

> Task :sdks:python:test-suites:direct:xlang:validatesCrossLanguageRunnerJavaUsingPython FAILED
> Task :sdks:python:test-suites:direct:xlang:validatesCrossLanguageRunnerPythonUsingJava
> Task :sdks:python:test-suites:direct:xlang:validatesCrossLanguageRunnerPythonUsingSql
> Task :sdks:python:test-suites:direct:xlang:validatesCrossLanguageRunnerCleanup
> Task :sdks:python:test-suites:direct:xlang:fnApiJobServerCleanup

FAILURE: Build failed with an exception.

* What went wrong:
Execution failed for task ':sdks:python:test-suites:direct:xlang:validatesCrossLanguageRunnerJavaUsingPython'.
> There were failing tests. See the report at: file://<https://ci-beam.apache.org/job/beam_PostCommit_XVR_Direct/ws/src/sdks/python/test-suites/direct/xlang/build/reports/tests/validatesCrossLanguageRunnerJavaUsingPython/index.html>

* Try:
> Run with --stacktrace option to get the stack trace.
> Run with --info or --debug option to get more log output.
> Run with --scan to get full insights.

* Get more help at https://help.gradle.org

Deprecated Gradle features were used in this build, making it incompatible with Gradle 8.0.

You can use '--warning-mode all' to show the individual deprecation warnings and determine if they come from your own scripts or plugins.

See https://docs.gradle.org/7.4/userguide/command_line_interface.html#sec:command_line_warnings

Execution optimizations have been disabled for 1 invalid unit(s) of work during this build to ensure correctness.
Please consult deprecation warnings for more details.

BUILD FAILED in 25m 13s
247 actionable tasks: 162 executed, 73 from cache, 12 up-to-date

Publishing build scan...
https://gradle.com/s/s76ur4qw3bgs2

Build step 'Invoke Gradle script' changed build result to FAILURE
Build step 'Invoke Gradle script' marked build as failure

---------------------------------------------------------------------
To unsubscribe, e-mail: builds-unsubscribe@beam.apache.org
For additional commands, e-mail: builds-help@beam.apache.org


Build failed in Jenkins: beam_PostCommit_XVR_Direct #3103

Posted by Apache Jenkins Server <je...@builds.apache.org>.
See <https://ci-beam.apache.org/job/beam_PostCommit_XVR_Direct/3103/display/redirect>

Changes:


------------------------------------------
[...truncated 1.43 MB...]
INFO     root:portable_runner.py:577 Default Python SDK image for environment is apache/beam_python3.7_sdk:2.42.0.dev
INFO     root:portable_runner.py:577 ==================== <function annotate_downstream_side_inputs at 0x7f52393b3290> ====================
INFO     root:portable_runner.py:577 ==================== <function fix_side_input_pcoll_coders at 0x7f52393b33b0> ====================
INFO     root:portable_runner.py:577 ==================== <function pack_combiners at 0x7f52393b38c0> ====================
INFO     root:portable_runner.py:577 ==================== <function lift_combiners at 0x7f52393b3950> ====================
INFO     root:portable_runner.py:577 ==================== <function expand_sdf at 0x7f52393b3b00> ====================
INFO     root:portable_runner.py:577 ==================== <function expand_gbk at 0x7f52393b3b90> ====================
INFO     root:portable_runner.py:577 ==================== <function sink_flattens at 0x7f52393b3cb0> ====================
INFO     root:portable_runner.py:577 ==================== <function greedily_fuse at 0x7f52393b3d40> ====================
INFO     root:portable_runner.py:577 ==================== <function read_to_impulse at 0x7f52393b3dd0> ====================
INFO     root:portable_runner.py:577 ==================== <function impulse_to_input at 0x7f52393b3e60> ====================
INFO     root:portable_runner.py:577 ==================== <function sort_stages at 0x7f52393b40e0> ====================
INFO     root:portable_runner.py:577 ==================== <function add_impulse_to_dangling_transforms at 0x7f52393b4200> ====================
INFO     root:portable_runner.py:577 ==================== <function setup_timer_mapping at 0x7f52393b4050> ====================
INFO     root:portable_runner.py:577 ==================== <function populate_data_channel_coders at 0x7f52393b4170> ====================
INFO     root:portable_runner.py:577 starting control server on port 42845
INFO     root:portable_runner.py:577 starting data server on port 33027
INFO     root:portable_runner.py:577 starting state server on port 33091
INFO     root:portable_runner.py:577 starting logging server on port 38427
INFO     root:portable_runner.py:577 Created Worker handler <apache_beam.runners.portability.fn_api_runner.worker_handlers.DockerSdkWorkerHandler object at 0x7f524da05690> for environment ref_Environment_default_environment_2 (beam:env:docker:v1, b'\n$apache/beam_python3.7_sdk:2.42.0.dev')
INFO     root:portable_runner.py:577 Attempting to pull image apache/beam_python3.7_sdk:2.42.0.dev
INFO     root:portable_runner.py:577 Unable to pull image apache/beam_python3.7_sdk:2.42.0.dev, defaulting to local image if it exists
INFO     root:portable_runner.py:577 Waiting for docker to start up. Current status is running
INFO     root:portable_runner.py:577 Docker container is running. container_id = b'1d0530171a2b1d0072e48a50ca8bc973d86634d1d0a0e59393cceb3eb7a7b492', worker_id = worker_79
INFO     root:portable_runner.py:577 Created Worker handler <apache_beam.runners.portability.fn_api_runner.worker_handlers.DockerSdkWorkerHandler object at 0x7f5250144350> for environment external_7beam:env:docker:v1 (beam:env:docker:v1, b'\n apache/beam_java8_sdk:2.42.0.dev')
INFO     root:portable_runner.py:577 Attempting to pull image apache/beam_java8_sdk:2.42.0.dev
INFO     root:portable_runner.py:577 Unable to pull image apache/beam_java8_sdk:2.42.0.dev, defaulting to local image if it exists
INFO     root:portable_runner.py:577 Waiting for docker to start up. Current status is running
INFO     root:portable_runner.py:577 Docker container is running. container_id = b'ca457575bddccf69f2fcf64154015a9e19d432be37aa0158919bc5a5306c2971', worker_id = worker_80
INFO     root:portable_runner.py:577 Completed job in 12.167587041854858 seconds with state DONE.
INFO     apache_beam.runners.portability.portable_runner:portable_runner.py:583 Job state changed to DONE
PASSED                                                                   [ 77%]
apache_beam/transforms/sql_test.py::SqlTransformTest::test_windowing_before_sql 
-------------------------------- live log call ---------------------------------
INFO     apache_beam.utils.subprocess_server:subprocess_server.py:254 Using pre-built snapshot at <https://ci-beam.apache.org/job/beam_PostCommit_XVR_Direct/ws/src/sdks/java/extensions/sql/expansion-service/build/libs/beam-sdks-java-extensions-sql-expansion-service-2.42.0-SNAPSHOT.jar>
INFO     root:external.py:773 Starting a JAR-based expansion service from JAR <https://ci-beam.apache.org/job/beam_PostCommit_XVR_Direct/ws/src/sdks/java/extensions/sql/expansion-service/build/libs/beam-sdks-java-extensions-sql-expansion-service-2.42.0-SNAPSHOT.jar> 
INFO     apache_beam.utils.subprocess_server:subprocess_server.py:116 Starting service with ['java' '-jar' '<https://ci-beam.apache.org/job/beam_PostCommit_XVR_Direct/ws/src/sdks/java/extensions/sql/expansion-service/build/libs/beam-sdks-java-extensions-sql-expansion-service-2.42.0-SNAPSHOT.jar'> '57271' '--filesToStage=<https://ci-beam.apache.org/job/beam_PostCommit_XVR_Direct/ws/src/sdks/java/extensions/sql/expansion-service/build/libs/beam-sdks-java-extensions-sql-expansion-service-2.42.0-SNAPSHOT.jar']>
INFO     apache_beam.utils.subprocess_server:subprocess_server.py:132 Starting expansion service at localhost:57271
INFO     apache_beam.utils.subprocess_server:subprocess_server.py:132 Sep 05, 2022 5:34:29 PM org.apache.beam.sdk.expansion.service.ExpansionService loadRegisteredTransforms
INFO     apache_beam.utils.subprocess_server:subprocess_server.py:132 INFO: Registering external transforms: [beam:external:java:sql:v1, beam:transform:org.apache.beam:pubsub_read:v1, beam:transform:org.apache.beam:pubsub_write:v1, beam:transform:org.apache.beam:pubsublite_write:v1, beam:transform:org.apache.beam:pubsublite_read:v1, beam:transform:org.apache.beam:spanner_insert:v1, beam:transform:org.apache.beam:spanner_update:v1, beam:transform:org.apache.beam:spanner_replace:v1, beam:transform:org.apache.beam:spanner_insert_or_update:v1, beam:transform:org.apache.beam:spanner_delete:v1, beam:transform:org.apache.beam:spanner_read:v1, beam:transform:org.apache.beam:kafka_read_with_metadata:v1, beam:transform:org.apache.beam:kafka_read_without_metadata:v1, beam:transform:org.apache.beam:kafka_write:v1, beam:external:java:generate_sequence:v1]
INFO     apache_beam.utils.subprocess_server:subprocess_server.py:132 	beam:external:java:sql:v1: org.apache.beam.sdk.expansion.service.ExpansionService$ExternalTransformRegistrarLoader$1@47eaca72
INFO     apache_beam.utils.subprocess_server:subprocess_server.py:132 	beam:transform:org.apache.beam:pubsub_read:v1: org.apache.beam.sdk.expansion.service.ExpansionService$ExternalTransformRegistrarLoader$1@55141def
INFO     apache_beam.utils.subprocess_server:subprocess_server.py:132 	beam:transform:org.apache.beam:pubsub_write:v1: org.apache.beam.sdk.expansion.service.ExpansionService$ExternalTransformRegistrarLoader$1@55182842
INFO     apache_beam.utils.subprocess_server:subprocess_server.py:132 	beam:transform:org.apache.beam:pubsublite_write:v1: org.apache.beam.sdk.expansion.service.ExpansionService$ExternalTransformRegistrarLoader$1@3270d194
INFO     apache_beam.utils.subprocess_server:subprocess_server.py:132 	beam:transform:org.apache.beam:pubsublite_read:v1: org.apache.beam.sdk.expansion.service.ExpansionService$ExternalTransformRegistrarLoader$1@235834f2
INFO     apache_beam.utils.subprocess_server:subprocess_server.py:132 	beam:transform:org.apache.beam:spanner_insert:v1: org.apache.beam.sdk.expansion.service.ExpansionService$ExternalTransformRegistrarLoader$1@5656be13
INFO     apache_beam.utils.subprocess_server:subprocess_server.py:132 	beam:transform:org.apache.beam:spanner_update:v1: org.apache.beam.sdk.expansion.service.ExpansionService$ExternalTransformRegistrarLoader$1@4218d6a3
INFO     apache_beam.utils.subprocess_server:subprocess_server.py:132 	beam:transform:org.apache.beam:spanner_replace:v1: org.apache.beam.sdk.expansion.service.ExpansionService$ExternalTransformRegistrarLoader$1@76505305
INFO     apache_beam.utils.subprocess_server:subprocess_server.py:132 	beam:transform:org.apache.beam:spanner_insert_or_update:v1: org.apache.beam.sdk.expansion.service.ExpansionService$ExternalTransformRegistrarLoader$1@14cd1699
INFO     apache_beam.utils.subprocess_server:subprocess_server.py:132 	beam:transform:org.apache.beam:spanner_delete:v1: org.apache.beam.sdk.expansion.service.ExpansionService$ExternalTransformRegistrarLoader$1@77888435
INFO     apache_beam.utils.subprocess_server:subprocess_server.py:132 	beam:transform:org.apache.beam:spanner_read:v1: org.apache.beam.sdk.expansion.service.ExpansionService$ExternalTransformRegistrarLoader$1@73a1e9a9
INFO     apache_beam.utils.subprocess_server:subprocess_server.py:132 	beam:transform:org.apache.beam:kafka_read_with_metadata:v1: org.apache.beam.sdk.expansion.service.ExpansionService$ExternalTransformRegistrarLoader$1@71d44a3
INFO     apache_beam.utils.subprocess_server:subprocess_server.py:132 	beam:transform:org.apache.beam:kafka_read_without_metadata:v1: org.apache.beam.sdk.expansion.service.ExpansionService$ExternalTransformRegistrarLoader$1@7b98f307
INFO     apache_beam.utils.subprocess_server:subprocess_server.py:132 	beam:transform:org.apache.beam:kafka_write:v1: org.apache.beam.sdk.expansion.service.ExpansionService$ExternalTransformRegistrarLoader$1@4802796d
INFO     apache_beam.utils.subprocess_server:subprocess_server.py:132 	beam:external:java:generate_sequence:v1: org.apache.beam.sdk.expansion.service.ExpansionService$ExternalTransformRegistrarLoader$1@34123d65
INFO     apache_beam.utils.subprocess_server:subprocess_server.py:132 Sep 05, 2022 5:34:30 PM org.apache.beam.sdk.expansion.service.ExpansionService expand
INFO     apache_beam.utils.subprocess_server:subprocess_server.py:132 INFO: Expanding 'SqlTransform(beam:external:java:sql:v1)' with URN 'beam:external:java:sql:v1'
INFO     apache_beam.utils.subprocess_server:subprocess_server.py:132 Sep 05, 2022 5:34:31 PM org.apache.beam.sdk.expansion.service.ExpansionService$ExternalTransformRegistrarLoader payloadToConfig
INFO     apache_beam.utils.subprocess_server:subprocess_server.py:132 WARNING: Configuration class 'org.apache.beam.sdk.extensions.sql.expansion.ExternalSqlTransformRegistrar$Configuration' has no schema registered. Attempting to construct with setter approach.
INFO     apache_beam.utils.subprocess_server:subprocess_server.py:132 Sep 05, 2022 5:34:31 PM org.apache.beam.sdk.expansion.service.ExpansionService$ExternalTransformRegistrarLoader payloadToConfig
INFO     apache_beam.utils.subprocess_server:subprocess_server.py:132 WARNING: Configuration class 'org.apache.beam.sdk.extensions.sql.expansion.ExternalSqlTransformRegistrar$Configuration' has no schema registered. Attempting to construct with setter approach.
INFO     apache_beam.utils.subprocess_server:subprocess_server.py:132 Sep 05, 2022 5:34:32 PM org.apache.beam.sdk.extensions.sql.impl.CalciteQueryPlanner convertToBeamRel
INFO     apache_beam.utils.subprocess_server:subprocess_server.py:132 INFO: SQL:
INFO     apache_beam.utils.subprocess_server:subprocess_server.py:132 SELECT COUNT(*) AS `count`
INFO     apache_beam.utils.subprocess_server:subprocess_server.py:132 FROM `beam`.`PCOLLECTION` AS `PCOLLECTION`
INFO     apache_beam.utils.subprocess_server:subprocess_server.py:132 Sep 05, 2022 5:34:33 PM org.apache.beam.sdk.extensions.sql.impl.CalciteQueryPlanner convertToBeamRel
INFO     apache_beam.utils.subprocess_server:subprocess_server.py:132 INFO: SQLPlan>
INFO     apache_beam.utils.subprocess_server:subprocess_server.py:132 LogicalAggregate(group=[{}], count=[COUNT()])
INFO     apache_beam.utils.subprocess_server:subprocess_server.py:132   BeamIOSourceRel(table=[[beam, PCOLLECTION]])
INFO     apache_beam.utils.subprocess_server:subprocess_server.py:132 
INFO     apache_beam.utils.subprocess_server:subprocess_server.py:132 Sep 05, 2022 5:34:33 PM org.apache.beam.sdk.extensions.sql.impl.CalciteQueryPlanner convertToBeamRel
INFO     apache_beam.utils.subprocess_server:subprocess_server.py:132 INFO: BEAMPlan>
INFO     apache_beam.utils.subprocess_server:subprocess_server.py:132 BeamAggregationRel(group=[{}], count=[COUNT()])
INFO     apache_beam.utils.subprocess_server:subprocess_server.py:132   BeamIOSourceRel(table=[[beam, PCOLLECTION]])
INFO     apache_beam.utils.subprocess_server:subprocess_server.py:132 
INFO     root:environments.py:376 Default Python SDK image for environment is apache/beam_python3.7_sdk:2.42.0.dev
INFO     root:environments.py:299 No image given, using default Python SDK image
INFO     root:environments.py:376 Default Python SDK image for environment is apache/beam_python3.7_sdk:2.42.0.dev
INFO     root:environments.py:304 Python SDK container image set to "apache/beam_python3.7_sdk:2.42.0.dev" for Docker environment
INFO     apache_beam.runners.portability.fn_api_runner.translations:translations.py:714 ==================== <function pack_combiners at 0x7f3149163950> ====================
INFO     apache_beam.runners.portability.fn_api_runner.translations:translations.py:714 ==================== <function lift_combiners at 0x7f31491639e0> ====================
INFO     apache_beam.runners.portability.fn_api_runner.translations:translations.py:714 ==================== <function sort_stages at 0x7f3149164170> ====================
INFO     apache_beam.runners.portability.portable_runner:portable_runner.py:583 Job state changed to STOPPED
INFO     apache_beam.runners.portability.portable_runner:portable_runner.py:583 Job state changed to STARTING
INFO     apache_beam.runners.portability.portable_runner:portable_runner.py:583 Job state changed to RUNNING
INFO     root:portable_runner.py:577 Default Python SDK image for environment is apache/beam_python3.7_sdk:2.42.0.dev
INFO     root:portable_runner.py:577 ==================== <function annotate_downstream_side_inputs at 0x7f52393b3290> ====================
INFO     root:portable_runner.py:577 ==================== <function fix_side_input_pcoll_coders at 0x7f52393b33b0> ====================
INFO     root:portable_runner.py:577 ==================== <function pack_combiners at 0x7f52393b38c0> ====================
INFO     root:portable_runner.py:577 ==================== <function lift_combiners at 0x7f52393b3950> ====================
INFO     root:portable_runner.py:577 ==================== <function expand_sdf at 0x7f52393b3b00> ====================
INFO     root:portable_runner.py:577 ==================== <function expand_gbk at 0x7f52393b3b90> ====================
INFO     root:portable_runner.py:577 ==================== <function sink_flattens at 0x7f52393b3cb0> ====================
INFO     root:portable_runner.py:577 ==================== <function greedily_fuse at 0x7f52393b3d40> ====================
INFO     root:portable_runner.py:577 ==================== <function read_to_impulse at 0x7f52393b3dd0> ====================
INFO     root:portable_runner.py:577 ==================== <function impulse_to_input at 0x7f52393b3e60> ====================
INFO     root:portable_runner.py:577 ==================== <function sort_stages at 0x7f52393b40e0> ====================
INFO     root:portable_runner.py:577 ==================== <function add_impulse_to_dangling_transforms at 0x7f52393b4200> ====================
INFO     root:portable_runner.py:577 ==================== <function setup_timer_mapping at 0x7f52393b4050> ====================
INFO     root:portable_runner.py:577 ==================== <function populate_data_channel_coders at 0x7f52393b4170> ====================
INFO     root:portable_runner.py:577 starting control server on port 46395
INFO     root:portable_runner.py:577 starting data server on port 35731
INFO     root:portable_runner.py:577 starting state server on port 44305
INFO     root:portable_runner.py:577 starting logging server on port 39451
INFO     root:portable_runner.py:577 Created Worker handler <apache_beam.runners.portability.fn_api_runner.worker_handlers.DockerSdkWorkerHandler object at 0x7f5250105d90> for environment ref_Environment_default_environment_2 (beam:env:docker:v1, b'\n$apache/beam_python3.7_sdk:2.42.0.dev')
INFO     root:portable_runner.py:577 Attempting to pull image apache/beam_python3.7_sdk:2.42.0.dev
INFO     root:portable_runner.py:577 Unable to pull image apache/beam_python3.7_sdk:2.42.0.dev, defaulting to local image if it exists
INFO     root:portable_runner.py:577 Waiting for docker to start up. Current status is running
INFO     root:portable_runner.py:577 Docker container is running. container_id = b'4ebcbb1fb5a52a51cd8b480e7f5002f274549b92c960eac1284c64bef89983ca', worker_id = worker_81
INFO     root:portable_runner.py:577 Created Worker handler <apache_beam.runners.portability.fn_api_runner.worker_handlers.DockerSdkWorkerHandler object at 0x7f5250144610> for environment external_8beam:env:docker:v1 (beam:env:docker:v1, b'\n apache/beam_java8_sdk:2.42.0.dev')
INFO     root:portable_runner.py:577 Attempting to pull image apache/beam_java8_sdk:2.42.0.dev
INFO     root:portable_runner.py:577 Unable to pull image apache/beam_java8_sdk:2.42.0.dev, defaulting to local image if it exists
INFO     root:portable_runner.py:577 Waiting for docker to start up. Current status is running
INFO     root:portable_runner.py:577 Docker container is running. container_id = b'eeb6a89e7cd5ab20d888265d7087e67c0d013d258921a1d729a68dd4d46626ff', worker_id = worker_82
INFO     root:portable_runner.py:577 Completed job in 11.942071914672852 seconds with state DONE.
INFO     apache_beam.runners.portability.portable_runner:portable_runner.py:583 Job state changed to DONE
PASSED                                                                   [ 88%]
apache_beam/transforms/sql_test.py::SqlTransformTest::test_zetasql_generate_data 
-------------------------------- live log call ---------------------------------
INFO     apache_beam.utils.subprocess_server:subprocess_server.py:254 Using pre-built snapshot at <https://ci-beam.apache.org/job/beam_PostCommit_XVR_Direct/ws/src/sdks/java/extensions/sql/expansion-service/build/libs/beam-sdks-java-extensions-sql-expansion-service-2.42.0-SNAPSHOT.jar>
INFO     root:external.py:773 Starting a JAR-based expansion service from JAR <https://ci-beam.apache.org/job/beam_PostCommit_XVR_Direct/ws/src/sdks/java/extensions/sql/expansion-service/build/libs/beam-sdks-java-extensions-sql-expansion-service-2.42.0-SNAPSHOT.jar> 
INFO     apache_beam.utils.subprocess_server:subprocess_server.py:116 Starting service with ['java' '-jar' '<https://ci-beam.apache.org/job/beam_PostCommit_XVR_Direct/ws/src/sdks/java/extensions/sql/expansion-service/build/libs/beam-sdks-java-extensions-sql-expansion-service-2.42.0-SNAPSHOT.jar'> '43643' '--filesToStage=<https://ci-beam.apache.org/job/beam_PostCommit_XVR_Direct/ws/src/sdks/java/extensions/sql/expansion-service/build/libs/beam-sdks-java-extensions-sql-expansion-service-2.42.0-SNAPSHOT.jar']>
INFO     apache_beam.utils.subprocess_server:subprocess_server.py:132 Starting expansion service at localhost:43643
INFO     apache_beam.utils.subprocess_server:subprocess_server.py:132 Sep 05, 2022 5:34:54 PM org.apache.beam.sdk.expansion.service.ExpansionService loadRegisteredTransforms
INFO     apache_beam.utils.subprocess_server:subprocess_server.py:132 INFO: Registering external transforms: [beam:external:java:sql:v1, beam:transform:org.apache.beam:pubsub_read:v1, beam:transform:org.apache.beam:pubsub_write:v1, beam:transform:org.apache.beam:pubsublite_write:v1, beam:transform:org.apache.beam:pubsublite_read:v1, beam:transform:org.apache.beam:spanner_insert:v1, beam:transform:org.apache.beam:spanner_update:v1, beam:transform:org.apache.beam:spanner_replace:v1, beam:transform:org.apache.beam:spanner_insert_or_update:v1, beam:transform:org.apache.beam:spanner_delete:v1, beam:transform:org.apache.beam:spanner_read:v1, beam:transform:org.apache.beam:kafka_read_with_metadata:v1, beam:transform:org.apache.beam:kafka_read_without_metadata:v1, beam:transform:org.apache.beam:kafka_write:v1, beam:external:java:generate_sequence:v1]
INFO     apache_beam.utils.subprocess_server:subprocess_server.py:132 	beam:external:java:sql:v1: org.apache.beam.sdk.expansion.service.ExpansionService$ExternalTransformRegistrarLoader$1@47eaca72
INFO     apache_beam.utils.subprocess_server:subprocess_server.py:132 	beam:transform:org.apache.beam:pubsub_read:v1: org.apache.beam.sdk.expansion.service.ExpansionService$ExternalTransformRegistrarLoader$1@55141def
INFO     apache_beam.utils.subprocess_server:subprocess_server.py:132 	beam:transform:org.apache.beam:pubsub_write:v1: org.apache.beam.sdk.expansion.service.ExpansionService$ExternalTransformRegistrarLoader$1@55182842
INFO     apache_beam.utils.subprocess_server:subprocess_server.py:132 	beam:transform:org.apache.beam:pubsublite_write:v1: org.apache.beam.sdk.expansion.service.ExpansionService$ExternalTransformRegistrarLoader$1@3270d194
INFO     apache_beam.utils.subprocess_server:subprocess_server.py:132 	beam:transform:org.apache.beam:pubsublite_read:v1: org.apache.beam.sdk.expansion.service.ExpansionService$ExternalTransformRegistrarLoader$1@235834f2
INFO     apache_beam.utils.subprocess_server:subprocess_server.py:132 	beam:transform:org.apache.beam:spanner_insert:v1: org.apache.beam.sdk.expansion.service.ExpansionService$ExternalTransformRegistrarLoader$1@5656be13
INFO     apache_beam.utils.subprocess_server:subprocess_server.py:132 	beam:transform:org.apache.beam:spanner_update:v1: org.apache.beam.sdk.expansion.service.ExpansionService$ExternalTransformRegistrarLoader$1@4218d6a3
INFO     apache_beam.utils.subprocess_server:subprocess_server.py:132 	beam:transform:org.apache.beam:spanner_replace:v1: org.apache.beam.sdk.expansion.service.ExpansionService$ExternalTransformRegistrarLoader$1@76505305
INFO     apache_beam.utils.subprocess_server:subprocess_server.py:132 	beam:transform:org.apache.beam:spanner_insert_or_update:v1: org.apache.beam.sdk.expansion.service.ExpansionService$ExternalTransformRegistrarLoader$1@14cd1699
INFO     apache_beam.utils.subprocess_server:subprocess_server.py:132 	beam:transform:org.apache.beam:spanner_delete:v1: org.apache.beam.sdk.expansion.service.ExpansionService$ExternalTransformRegistrarLoader$1@77888435
INFO     apache_beam.utils.subprocess_server:subprocess_server.py:132 	beam:transform:org.apache.beam:spanner_read:v1: org.apache.beam.sdk.expansion.service.ExpansionService$ExternalTransformRegistrarLoader$1@73a1e9a9
INFO     apache_beam.utils.subprocess_server:subprocess_server.py:132 	beam:transform:org.apache.beam:kafka_read_with_metadata:v1: org.apache.beam.sdk.expansion.service.ExpansionService$ExternalTransformRegistrarLoader$1@71d44a3
INFO     apache_beam.utils.subprocess_server:subprocess_server.py:132 	beam:transform:org.apache.beam:kafka_read_without_metadata:v1: org.apache.beam.sdk.expansion.service.ExpansionService$ExternalTransformRegistrarLoader$1@7b98f307
INFO     apache_beam.utils.subprocess_server:subprocess_server.py:132 	beam:transform:org.apache.beam:kafka_write:v1: org.apache.beam.sdk.expansion.service.ExpansionService$ExternalTransformRegistrarLoader$1@4802796d
INFO     apache_beam.utils.subprocess_server:subprocess_server.py:132 	beam:external:java:generate_sequence:v1: org.apache.beam.sdk.expansion.service.ExpansionService$ExternalTransformRegistrarLoader$1@34123d65
INFO     apache_beam.utils.subprocess_server:subprocess_server.py:132 Sep 05, 2022 5:34:55 PM org.apache.beam.sdk.expansion.service.ExpansionService expand
INFO     apache_beam.utils.subprocess_server:subprocess_server.py:132 INFO: Expanding 'SqlTransform(beam:external:java:sql:v1)' with URN 'beam:external:java:sql:v1'
INFO     apache_beam.utils.subprocess_server:subprocess_server.py:132 Sep 05, 2022 5:34:56 PM org.apache.beam.sdk.expansion.service.ExpansionService$ExternalTransformRegistrarLoader payloadToConfig
INFO     apache_beam.utils.subprocess_server:subprocess_server.py:132 WARNING: Configuration class 'org.apache.beam.sdk.extensions.sql.expansion.ExternalSqlTransformRegistrar$Configuration' has no schema registered. Attempting to construct with setter approach.
INFO     apache_beam.utils.subprocess_server:subprocess_server.py:132 Sep 05, 2022 5:34:56 PM org.apache.beam.sdk.expansion.service.ExpansionService$ExternalTransformRegistrarLoader payloadToConfig
INFO     apache_beam.utils.subprocess_server:subprocess_server.py:132 WARNING: Configuration class 'org.apache.beam.sdk.extensions.sql.expansion.ExternalSqlTransformRegistrar$Configuration' has no schema registered. Attempting to construct with setter approach.
INFO     apache_beam.utils.subprocess_server:subprocess_server.py:132 Sep 05, 2022 5:34:58 PM com.google.zetasql.io.grpc.NameResolverRegistry getDefaultRegistry
INFO     apache_beam.utils.subprocess_server:subprocess_server.py:132 WARNING: No NameResolverProviders found via ServiceLoader, including for DNS. This is probably due to a broken build. If using ProGuard, check your configuration
INFO     apache_beam.utils.subprocess_server:subprocess_server.py:132 Sep 05, 2022 5:34:59 PM org.apache.beam.sdk.extensions.sql.zetasql.ZetaSQLQueryPlanner convertToBeamRelInternal
INFO     apache_beam.utils.subprocess_server:subprocess_server.py:132 INFO: BEAMPlan>
INFO     apache_beam.utils.subprocess_server:subprocess_server.py:132 BeamZetaSqlCalcRel(expr#0=[{inputs}], expr#1=[1:BIGINT], expr#2=['foo':VARCHAR], expr#3=[3.1400000000000001243E0:DOUBLE], int=[$t1], str=[$t2], flt=[$t3])
INFO     apache_beam.utils.subprocess_server:subprocess_server.py:132   BeamValuesRel(tuples=[[{ 0 }]])
INFO     apache_beam.utils.subprocess_server:subprocess_server.py:132 
INFO     root:environments.py:376 Default Python SDK image for environment is apache/beam_python3.7_sdk:2.42.0.dev
INFO     root:environments.py:299 No image given, using default Python SDK image
INFO     root:environments.py:376 Default Python SDK image for environment is apache/beam_python3.7_sdk:2.42.0.dev
INFO     root:environments.py:304 Python SDK container image set to "apache/beam_python3.7_sdk:2.42.0.dev" for Docker environment
INFO     apache_beam.runners.portability.fn_api_runner.translations:translations.py:714 ==================== <function pack_combiners at 0x7f3149163950> ====================
INFO     apache_beam.runners.portability.fn_api_runner.translations:translations.py:714 ==================== <function lift_combiners at 0x7f31491639e0> ====================
INFO     apache_beam.runners.portability.fn_api_runner.translations:translations.py:714 ==================== <function sort_stages at 0x7f3149164170> ====================
INFO     apache_beam.runners.portability.portable_runner:portable_runner.py:583 Job state changed to STOPPED
INFO     apache_beam.runners.portability.portable_runner:portable_runner.py:583 Job state changed to STARTING
INFO     apache_beam.runners.portability.portable_runner:portable_runner.py:583 Job state changed to RUNNING
INFO     root:portable_runner.py:577 Default Python SDK image for environment is apache/beam_python3.7_sdk:2.42.0.dev
INFO     root:portable_runner.py:577 ==================== <function annotate_downstream_side_inputs at 0x7f52393b3290> ====================
INFO     root:portable_runner.py:577 ==================== <function fix_side_input_pcoll_coders at 0x7f52393b33b0> ====================
INFO     root:portable_runner.py:577 ==================== <function pack_combiners at 0x7f52393b38c0> ====================
INFO     root:portable_runner.py:577 ==================== <function lift_combiners at 0x7f52393b3950> ====================
INFO     root:portable_runner.py:577 ==================== <function expand_sdf at 0x7f52393b3b00> ====================
INFO     root:portable_runner.py:577 ==================== <function expand_gbk at 0x7f52393b3b90> ====================
INFO     root:portable_runner.py:577 ==================== <function sink_flattens at 0x7f52393b3cb0> ====================
INFO     root:portable_runner.py:577 ==================== <function greedily_fuse at 0x7f52393b3d40> ====================
INFO     root:portable_runner.py:577 ==================== <function read_to_impulse at 0x7f52393b3dd0> ====================
INFO     root:portable_runner.py:577 ==================== <function impulse_to_input at 0x7f52393b3e60> ====================
INFO     root:portable_runner.py:577 ==================== <function sort_stages at 0x7f52393b40e0> ====================
INFO     root:portable_runner.py:577 ==================== <function add_impulse_to_dangling_transforms at 0x7f52393b4200> ====================
INFO     root:portable_runner.py:577 ==================== <function setup_timer_mapping at 0x7f52393b4050> ====================
INFO     root:portable_runner.py:577 ==================== <function populate_data_channel_coders at 0x7f52393b4170> ====================
INFO     root:portable_runner.py:577 starting control server on port 39177
INFO     root:portable_runner.py:577 starting data server on port 39905
INFO     root:portable_runner.py:577 starting state server on port 35021
INFO     root:portable_runner.py:577 starting logging server on port 40381
INFO     root:portable_runner.py:577 Created Worker handler <apache_beam.runners.portability.fn_api_runner.worker_handlers.DockerSdkWorkerHandler object at 0x7f525011c690> for environment external_9beam:env:docker:v1 (beam:env:docker:v1, b'\n apache/beam_java8_sdk:2.42.0.dev')
INFO     root:portable_runner.py:577 Attempting to pull image apache/beam_java8_sdk:2.42.0.dev
INFO     root:portable_runner.py:577 Unable to pull image apache/beam_java8_sdk:2.42.0.dev, defaulting to local image if it exists
INFO     root:portable_runner.py:577 Waiting for docker to start up. Current status is running
INFO     root:portable_runner.py:577 Docker container is running. container_id = b'6021d19f2f213b8c5829cafd53db6104b5b7b56c7b3c04652a4b50a5bb5b1db3', worker_id = worker_83
INFO     root:portable_runner.py:577 Created Worker handler <apache_beam.runners.portability.fn_api_runner.worker_handlers.DockerSdkWorkerHandler object at 0x7f5250114a10> for environment ref_Environment_default_environment_2 (beam:env:docker:v1, b'\n$apache/beam_python3.7_sdk:2.42.0.dev')
INFO     root:portable_runner.py:577 Attempting to pull image apache/beam_python3.7_sdk:2.42.0.dev
INFO     root:portable_runner.py:577 Unable to pull image apache/beam_python3.7_sdk:2.42.0.dev, defaulting to local image if it exists
INFO     root:portable_runner.py:577 Waiting for docker to start up. Current status is running
INFO     root:portable_runner.py:577 Docker container is running. container_id = b'51b9b78acf1c64fcc9b9a0fdf95b6552d2dc6938c651533043321182f6ebe918', worker_id = worker_84
INFO     root:portable_runner.py:577 Completed job in 12.42428207397461 seconds with state DONE.
INFO     apache_beam.runners.portability.portable_runner:portable_runner.py:583 Job state changed to DONE
PASSED                                                                   [100%]

=============================== warnings summary ===============================
../../build/gradleenv/1922375555/lib/python3.7/site-packages/hdfs/config.py:15
  <https://ci-beam.apache.org/job/beam_PostCommit_XVR_Direct/ws/src/build/gradleenv/1922375555/lib/python3.7/site-packages/hdfs/config.py>:15: DeprecationWarning: the imp module is deprecated in favour of importlib; see the module's documentation for alternative uses
    from imp import load_source

../../build/gradleenv/1922375555/lib/python3.7/site-packages/google/api_core/grpc_helpers.py:42
  <https://ci-beam.apache.org/job/beam_PostCommit_XVR_Direct/ws/src/build/gradleenv/1922375555/lib/python3.7/site-packages/google/api_core/grpc_helpers.py>:42: DeprecationWarning: Support for grpcio-gcp is deprecated. This feature will be
              removed from `google-api-core` after January 1, 2024. If you need to
              continue to use this feature, please pin to a specific version of
              `google-api-core`.
    DeprecationWarning,

-- Docs: https://docs.pytest.org/en/stable/how-to/capture-warnings.html
- generated xml file: <https://ci-beam.apache.org/job/beam_PostCommit_XVR_Direct/ws/src/sdks/python/pytest_xlangSqlValidateRunner.xml> -
==== 9 passed, 2 skipped, 6648 deselected, 2 warnings in 229.67s (0:03:49) =====

> Task :sdks:python:test-suites:direct:xlang:validatesCrossLanguageRunnerCleanup
Stopping expansion service pid: 2758097.
Stopping expansion service pid: 2758098.

> Task :sdks:python:test-suites:direct:xlang:fnApiJobServerCleanup
Killing process at 2750130

FAILURE: Build failed with an exception.

* What went wrong:
Execution failed for task ':sdks:python:test-suites:direct:xlang:validatesCrossLanguageRunnerJavaUsingPython'.
> There were failing tests. See the report at: file://<https://ci-beam.apache.org/job/beam_PostCommit_XVR_Direct/ws/src/sdks/python/test-suites/direct/xlang/build/reports/tests/validatesCrossLanguageRunnerJavaUsingPython/index.html>

* Try:
> Run with --stacktrace option to get the stack trace.
> Run with --info or --debug option to get more log output.
> Run with --scan to get full insights.

* Get more help at https://help.gradle.org

Deprecated Gradle features were used in this build, making it incompatible with Gradle 8.0.

You can use '--warning-mode all' to show the individual deprecation warnings and determine if they come from your own scripts or plugins.

See https://docs.gradle.org/7.4/userguide/command_line_interface.html#sec:command_line_warnings

Execution optimizations have been disabled for 1 invalid unit(s) of work during this build to ensure correctness.
Please consult deprecation warnings for more details.

BUILD FAILED in 24m 59s
247 actionable tasks: 162 executed, 73 from cache, 12 up-to-date

Publishing build scan...
https://gradle.com/s/zxqfyi3izdmas

Build step 'Invoke Gradle script' changed build result to FAILURE
Build step 'Invoke Gradle script' marked build as failure

---------------------------------------------------------------------
To unsubscribe, e-mail: builds-unsubscribe@beam.apache.org
For additional commands, e-mail: builds-help@beam.apache.org