You are viewing a plain text version of this content. The canonical link for it is here.
Posted to builds@mesos.apache.org by Apache Jenkins Server <je...@builds.apache.org> on 2017/01/17 14:21:57 UTC
Build failed in Jenkins: Mesos-Buildbot » cmake,clang,--verbose,GLOG_v=1 MESOS_VERBOSE=1,ubuntu:14.04,(docker||Hadoop)&&(!ubuntu-us1)&&(!ubuntu-6)&&(!ubuntu-eu2) #3118
See <https://builds.apache.org/job/Mesos-Buildbot/BUILDTOOL=cmake,COMPILER=clang,CONFIGURATION=--verbose,ENVIRONMENT=GLOG_v=1%20MESOS_VERBOSE=1,OS=ubuntu%3A14.04,label_exp=(docker%7C%7CHadoop)&&(!ubuntu-us1)&&(!ubuntu-6)&&(!ubuntu-eu2)/3118/changes>
Changes:
[yujie.jay] Fixed a few compiler warnings in libprocess.
------------------------------------------
[...truncated 151729 lines...]
I0117 14:21:12.653532 24793 status_update_manager.cpp:285] Closing status update streams for framework 9defe89e-b6fb-476f-8c6c-f88333675116-0000
I0117 14:21:12.653551 24793 status_update_manager.cpp:531] Cleaning up status update stream for task 58bf8d1d-e59c-4486-bac9-aac21b475c8b of framework 9defe89e-b6fb-476f-8c6c-f88333675116-0000
I0117 14:21:12.653594 24791 gc.cpp:55] Scheduling '/tmp/ContentType_SchedulerTest_ReconcileTask_1_PA3kfu/slaves/9defe89e-b6fb-476f-8c6c-f88333675116-S0/frameworks/9defe89e-b6fb-476f-8c6c-f88333675116-0000/executors/default' for gc 6.99999243804444days in the future
I0117 14:21:12.653663 24794 slave.cpp:796] Agent terminating
I0117 14:21:12.653761 24795 master.cpp:1261] Agent 9defe89e-b6fb-476f-8c6c-f88333675116-S0 at slave(625)@172.17.0.3:42916 (fba458e490c4) disconnected
I0117 14:21:12.653774 24791 gc.cpp:55] Scheduling '/tmp/ContentType_SchedulerTest_ReconcileTask_1_PA3kfu/slaves/9defe89e-b6fb-476f-8c6c-f88333675116-S0/frameworks/9defe89e-b6fb-476f-8c6c-f88333675116-0000' for gc 6.99999243609778days in the future
I0117 14:21:12.653789 24795 master.cpp:3051] Disconnecting agent 9defe89e-b6fb-476f-8c6c-f88333675116-S0 at slave(625)@172.17.0.3:42916 (fba458e490c4)
I0117 14:21:12.654042 24795 master.cpp:3070] Deactivating agent 9defe89e-b6fb-476f-8c6c-f88333675116-S0 at slave(625)@172.17.0.3:42916 (fba458e490c4)
I0117 14:21:12.654244 24795 hierarchical.cpp:577] Agent 9defe89e-b6fb-476f-8c6c-f88333675116-S0 deactivated
I0117 14:21:12.655704 24787 master.cpp:1100] Master terminating
I0117 14:21:12.655968 24788 hierarchical.cpp:510] Removed agent 9defe89e-b6fb-476f-8c6c-f88333675116-S0
[ OK ] ContentType/SchedulerTest.ReconcileTask/1 (95 ms)
[ RUN ] ContentType/SchedulerTest.KillTask/0
I0117 14:21:12.660527 24787 cluster.cpp:160] Creating default 'local' authorizer
I0117 14:21:12.661711 24793 master.cpp:383] Master ec785856-b481-4e87-9444-2019c9ad3c61 (fba458e490c4) started on 172.17.0.3:42916
I0117 14:21:12.661743 24793 master.cpp:385] Flags at startup: --acls="" --agent_ping_timeout="15secs" --agent_reregister_timeout="10mins" --allocation_interval="1secs" --allocator="HierarchicalDRF" --authenticate_agents="true" --authenticate_frameworks="true" --authenticate_http_frameworks="true" --authenticate_http_readonly="true" --authenticate_http_readwrite="true" --authenticators="crammd5" --authorizers="local" --credentials="/tmp/L7hTso/credentials" --framework_sorter="drf" --help="false" --hostname_lookup="true" --http_authenticators="basic" --http_framework_authenticators="basic" --initialize_driver_logging="true" --log_auto_initialize="true" --logbufsecs="0" --logging_level="INFO" --max_agent_ping_timeouts="5" --max_completed_frameworks="50" --max_completed_tasks_per_framework="1000" --quiet="false" --recovery_agent_removal_limit="100%" --registry="in_memory" --registry_fetch_timeout="1mins" --registry_gc_interval="15mins" --registry_max_agent_age="2weeks" --registry_max_agent_count="102400" --registry_store_timeout="100secs" --registry_strict="false" --root_submissions="true" --user_sorter="drf" --version="false" --webui_dir="/usr/local/share/mesos/webui" --work_dir="/tmp/L7hTso/master" --zk_session_timeout="10secs"
I0117 14:21:12.661960 24793 master.cpp:435] Master only allowing authenticated frameworks to register
I0117 14:21:12.661969 24793 master.cpp:449] Master only allowing authenticated agents to register
I0117 14:21:12.661976 24793 master.cpp:462] Master only allowing authenticated HTTP frameworks to register
I0117 14:21:12.661984 24793 credentials.hpp:37] Loading credentials for authentication from '/tmp/L7hTso/credentials'
I0117 14:21:12.662111 24793 master.cpp:507] Using default 'crammd5' authenticator
I0117 14:21:12.662164 24793 http.cpp:922] Using default 'basic' HTTP authenticator for realm 'mesos-master-readonly'
I0117 14:21:12.662220 24793 http.cpp:922] Using default 'basic' HTTP authenticator for realm 'mesos-master-readwrite'
I0117 14:21:12.662343 24793 http.cpp:922] Using default 'basic' HTTP authenticator for realm 'mesos-master-scheduler'
I0117 14:21:12.662415 24793 master.cpp:587] Authorization enabled
I0117 14:21:12.662523 24801 whitelist_watcher.cpp:77] No whitelist given
I0117 14:21:12.663436 24790 master.cpp:2119] Elected as the leading master!
I0117 14:21:12.663450 24798 hierarchical.cpp:151] Initialized hierarchical allocator process
I0117 14:21:12.663457 24790 master.cpp:1641] Recovering from registrar
I0117 14:21:12.663635 24796 registrar.cpp:329] Recovering registrar
I0117 14:21:12.663908 24788 registrar.cpp:362] Successfully fetched the registry (0B) in 244736ns
I0117 14:21:12.663956 24788 registrar.cpp:461] Applied 1 operations in 14932ns; attempting to update the registry
I0117 14:21:12.664214 24800 registrar.cpp:506] Successfully updated the registry in 221184ns
I0117 14:21:12.664290 24800 registrar.cpp:392] Successfully recovered registrar
I0117 14:21:12.664590 24795 hierarchical.cpp:178] Skipping recovery of hierarchical allocator: nothing to recover
I0117 14:21:12.664602 24803 master.cpp:1757] Recovered 0 agents from the registry (129B); allowing 10mins for agents to re-register
I0117 14:21:12.666980 24787 cluster.cpp:446] Creating default 'local' authorizer
I0117 14:21:12.667512 24799 slave.cpp:209] Mesos agent started on (626)@172.17.0.3:42916
I0117 14:21:12.667814 24787 scheduler.cpp:184] Version: 1.2.0
I0117 14:21:12.667543 24799 slave.cpp:210] Flags at startup: --acls="" --appc_simple_discovery_uri_prefix="http://" --appc_store_dir="/tmp/mesos/store/appc" --authenticate_http_readonly="true" --authenticate_http_readwrite="true" --authenticatee="crammd5" --authentication_backoff_factor="1secs" --authorizer="local" --cgroups_cpu_enable_pids_and_tids_count="false" --cgroups_enable_cfs="false" --cgroups_hierarchy="/sys/fs/cgroup" --cgroups_limit_swap="false" --cgroups_root="mesos" --container_disk_watch_interval="15secs" --containerizers="mesos" --credential="/tmp/ContentType_SchedulerTest_KillTask_0_NYDTVQ/credential" --default_role="*" --disk_watch_interval="1mins" --docker="docker" --docker_kill_orphans="true" --docker_registry="https://registry-1.docker.io" --docker_remove_delay="6hrs" --docker_socket="/var/run/docker.sock" --docker_stop_timeout="0ns" --docker_store_dir="/tmp/mesos/store/docker" --docker_volume_checkpoint_dir="/var/run/mesos/isolators/docker/volume" --enforce_container_disk_quota="false" --executor_registration_timeout="1mins" --executor_shutdown_grace_period="5secs" --fetcher_cache_dir="/tmp/ContentType_SchedulerTest_KillTask_0_NYDTVQ/fetch" --fetcher_cache_size="2GB" --frameworks_home="" --gc_delay="1weeks" --gc_disk_headroom="0.1" --hadoop_home="" --help="false" --hostname_lookup="true" --http_authenticators="basic" --http_command_executor="false" --http_credentials="/tmp/ContentType_SchedulerTest_KillTask_0_NYDTVQ/http_credentials" --http_heartbeat_interval="30secs" --image_provisioner_backend="copy" --initialize_driver_logging="true" --isolation="posix/cpu,posix/mem" --launcher="posix" --launcher_dir="/mesos/build/src" --logbufsecs="0" --logging_level="INFO" --max_completed_executors_per_framework="150" --oversubscribed_resources_interval="15secs" --perf_duration="10secs" --perf_interval="1mins" --qos_correction_interval_min="0ns" --quiet="false" --recover="reconnect" --recovery_timeout="15mins" --registration_backoff_factor="10ms" --resources="cpus:2;gpus:0;mem:1024;disk:1024;ports:[31000-32000]" --revocable_cpu_low_priority="true" --runtime_dir="/tmp/ContentType_SchedulerTest_KillTask_0_NYDTVQ" --sandbox_directory="/mnt/mesos/sandbox" --strict="true" --switch_user="true" --systemd_enable_support="true" --systemd_runtime_directory="/run/systemd/system" --version="false" --work_dir="/tmp/ContentType_SchedulerTest_KillTask_0_Qr1nH7"
I0117 14:21:12.668072 24799 credentials.hpp:86] Loading credential for authentication from '/tmp/ContentType_SchedulerTest_KillTask_0_NYDTVQ/credential'
I0117 14:21:12.668179 24801 scheduler.cpp:470] New master detected at master@172.17.0.3:42916
I0117 14:21:12.668189 24799 slave.cpp:352] Agent using credential for: test-principal
I0117 14:21:12.668211 24801 scheduler.cpp:479] Waiting for 0ns before initiating a re-(connection) attempt with the master
I0117 14:21:12.668218 24799 credentials.hpp:37] Loading credentials for authentication from '/tmp/ContentType_SchedulerTest_KillTask_0_NYDTVQ/http_credentials'
I0117 14:21:12.668382 24799 http.cpp:922] Using default 'basic' HTTP authenticator for realm 'mesos-agent-readonly'
I0117 14:21:12.668474 24799 http.cpp:922] Using default 'basic' HTTP authenticator for realm 'mesos-agent-readwrite'
I0117 14:21:12.668951 24799 slave.cpp:539] Agent resources: cpus(*):2; mem(*):1024; disk(*):1024; ports(*):[31000-32000]
I0117 14:21:12.668995 24799 slave.cpp:547] Agent attributes: [ ]
I0117 14:21:12.669006 24799 slave.cpp:552] Agent hostname: fba458e490c4
I0117 14:21:12.669523 24796 state.cpp:60] Recovering state from '/tmp/ContentType_SchedulerTest_KillTask_0_Qr1nH7/meta'
I0117 14:21:12.669719 24794 status_update_manager.cpp:203] Recovering status update manager
I0117 14:21:12.670085 24801 slave.cpp:5417] Finished recovery
I0117 14:21:12.670125 24802 scheduler.cpp:361] Connected with the master at http://172.17.0.3:42916/master/api/v1/scheduler
I0117 14:21:12.670570 24801 slave.cpp:5591] Querying resource estimator for oversubscribable resources
I0117 14:21:12.670758 24795 slave.cpp:924] New master detected at master@172.17.0.3:42916
I0117 14:21:12.670859 24795 slave.cpp:959] Detecting new master
I0117 14:21:12.670862 24802 status_update_manager.cpp:177] Pausing sending status updates
I0117 14:21:12.670943 24795 slave.cpp:5605] Received oversubscribable resources {} from the resource estimator
I0117 14:21:12.671092 24803 scheduler.cpp:243] Sending SUBSCRIBE call to http://172.17.0.3:42916/master/api/v1/scheduler
I0117 14:21:12.671551 24797 process.cpp:3676] Handling HTTP event for process 'master' with path: '/master/api/v1/scheduler'
I0117 14:21:12.672075 24796 http.cpp:409] HTTP POST for /master/api/v1/scheduler from 172.17.0.3:55081
I0117 14:21:12.672199 24796 master.cpp:2418] Received subscription request for HTTP framework 'default'
I0117 14:21:12.672217 24796 master.cpp:2155] Authorizing framework principal 'test-principal' to receive offers for role '*'
I0117 14:21:12.672392 24796 master.cpp:2532] Subscribing framework 'default' with checkpointing disabled and capabilities [ ]
I0117 14:21:12.672575 24800 hierarchical.cpp:271] Added framework ec785856-b481-4e87-9444-2019c9ad3c61-0000
I0117 14:21:12.672607 24800 hierarchical.cpp:1677] No allocations performed
I0117 14:21:12.672616 24797 master.hpp:2204] Sending heartbeat to ec785856-b481-4e87-9444-2019c9ad3c61-0000
I0117 14:21:12.672626 24800 hierarchical.cpp:1772] No inverse offers to send out!
I0117 14:21:12.672646 24800 hierarchical.cpp:1279] Performed allocation for 0 agents in 56048ns
I0117 14:21:12.673180 24790 scheduler.cpp:676] Enqueuing event SUBSCRIBED received from http://172.17.0.3:42916/master/api/v1/scheduler
I0117 14:21:12.673496 24790 scheduler.cpp:676] Enqueuing event HEARTBEAT received from http://172.17.0.3:42916/master/api/v1/scheduler
I0117 14:21:12.676139 24790 slave.cpp:986] Authenticating with master master@172.17.0.3:42916
I0117 14:21:12.676167 24790 slave.cpp:997] Using default CRAM-MD5 authenticatee
I0117 14:21:12.676252 24795 authenticatee.cpp:121] Creating new client SASL connection
I0117 14:21:12.676481 24788 master.cpp:6833] Authenticating slave(626)@172.17.0.3:42916
I0117 14:21:12.676535 24795 authenticator.cpp:414] Starting authentication session for crammd5-authenticatee(1168)@172.17.0.3:42916
I0117 14:21:12.676616 24800 authenticator.cpp:98] Creating new server SASL connection
I0117 14:21:12.676764 24789 authenticatee.cpp:213] Received SASL authentication mechanisms: CRAM-MD5
I0117 14:21:12.676793 24789 authenticatee.cpp:239] Attempting to authenticate with mechanism 'CRAM-MD5'
I0117 14:21:12.676836 24789 authenticator.cpp:204] Received SASL authentication start
I0117 14:21:12.676894 24789 authenticator.cpp:326] Authentication requires more steps
I0117 14:21:12.676981 24793 authenticatee.cpp:259] Received SASL authentication step
I0117 14:21:12.677044 24793 authenticator.cpp:232] Received SASL authentication step
I0117 14:21:12.677068 24793 auxprop.cpp:109] Request to lookup properties for user: 'test-principal' realm: 'fba458e490c4' server FQDN: 'fba458e490c4' SASL_AUXPROP_VERIFY_AGAINST_HASH: false SASL_AUXPROP_OVERRIDE: false SASL_AUXPROP_AUTHZID: false
I0117 14:21:12.677078 24793 auxprop.cpp:181] Looking up auxiliary property '*userPassword'
I0117 14:21:12.677088 24793 auxprop.cpp:181] Looking up auxiliary property '*cmusaslsecretCRAM-MD5'
I0117 14:21:12.677101 24793 auxprop.cpp:109] Request to lookup properties for user: 'test-principal' realm: 'fba458e490c4' server FQDN: 'fba458e490c4' SASL_AUXPROP_VERIFY_AGAINST_HASH: false SASL_AUXPROP_OVERRIDE: false SASL_AUXPROP_AUTHZID: true
I0117 14:21:12.677114 24793 auxprop.cpp:131] Skipping auxiliary property '*userPassword' since SASL_AUXPROP_AUTHZID == true
I0117 14:21:12.677124 24793 auxprop.cpp:131] Skipping auxiliary property '*cmusaslsecretCRAM-MD5' since SASL_AUXPROP_AUTHZID == true
I0117 14:21:12.677141 24793 authenticator.cpp:318] Authentication success
I0117 14:21:12.677194 24795 authenticatee.cpp:299] Authentication success
I0117 14:21:12.677209 24793 master.cpp:6863] Successfully authenticated principal 'test-principal' at slave(626)@172.17.0.3:42916
I0117 14:21:12.677224 24800 authenticator.cpp:432] Authentication session cleanup for crammd5-authenticatee(1168)@172.17.0.3:42916
I0117 14:21:12.677372 24794 slave.cpp:1081] Successfully authenticated with master master@172.17.0.3:42916
I0117 14:21:12.677435 24794 slave.cpp:1503] Will retry registration in 2.823712ms if necessary
I0117 14:21:12.677513 24788 master.cpp:5232] Registering agent at slave(626)@172.17.0.3:42916 (fba458e490c4) with id ec785856-b481-4e87-9444-2019c9ad3c61-S0
I0117 14:21:12.677655 24797 registrar.cpp:461] Applied 1 operations in 30784ns; attempting to update the registry
I0117 14:21:12.678023 24797 registrar.cpp:506] Successfully updated the registry in 337152ns
I0117 14:21:12.678259 24797 slave.cpp:4281] Received ping from slave-observer(554)@172.17.0.3:42916
I0117 14:21:12.678326 24797 slave.cpp:1127] Registered with master master@172.17.0.3:42916; given agent ID ec785856-b481-4e87-9444-2019c9ad3c61-S0
I0117 14:21:12.678345 24797 fetcher.cpp:90] Clearing fetcher cache
I0117 14:21:12.678275 24799 master.cpp:5303] Registered agent ec785856-b481-4e87-9444-2019c9ad3c61-S0 at slave(626)@172.17.0.3:42916 (fba458e490c4) with cpus(*):2; mem(*):1024; disk(*):1024; ports(*):[31000-32000]
I0117 14:21:12.678383 24796 hierarchical.cpp:478] Added agent ec785856-b481-4e87-9444-2019c9ad3c61-S0 (fba458e490c4) with cpus(*):2; mem(*):1024; disk(*):1024; ports(*):[31000-32000] (allocated: {})
I0117 14:21:12.678452 24791 status_update_manager.cpp:184] Resuming sending status updates
I0117 14:21:12.678660 24796 hierarchical.cpp:1772] No inverse offers to send out!
I0117 14:21:12.678669 24797 slave.cpp:1155] Checkpointing SlaveInfo to '/tmp/ContentType_SchedulerTest_KillTask_0_Qr1nH7/meta/slaves/ec785856-b481-4e87-9444-2019c9ad3c61-S0/slave.info'
I0117 14:21:12.678743 24796 hierarchical.cpp:1302] Performed allocation for agent ec785856-b481-4e87-9444-2019c9ad3c61-S0 in 283825ns
I0117 14:21:12.678843 24801 master.cpp:6662] Sending 1 offers to framework ec785856-b481-4e87-9444-2019c9ad3c61-0000 (default)
I0117 14:21:12.679090 24797 slave.cpp:1193] Forwarding total oversubscribed resources {}
I0117 14:21:12.679157 24797 master.cpp:5710] Received update of agent ec785856-b481-4e87-9444-2019c9ad3c61-S0 at slave(626)@172.17.0.3:42916 (fba458e490c4) with total oversubscribed resources {}
I0117 14:21:12.679249 24790 hierarchical.cpp:548] Agent ec785856-b481-4e87-9444-2019c9ad3c61-S0 (fba458e490c4) updated with oversubscribed resources {} (total: cpus(*):2; mem(*):1024; disk(*):1024; ports(*):[31000-32000], allocated: cpus(*):2; mem(*):1024; disk(*):1024; ports(*):[31000-32000])
I0117 14:21:12.679297 24790 hierarchical.cpp:1677] No allocations performed
I0117 14:21:12.679311 24790 hierarchical.cpp:1772] No inverse offers to send out!
I0117 14:21:12.679319 24790 hierarchical.cpp:1302] Performed allocation for agent ec785856-b481-4e87-9444-2019c9ad3c61-S0 in 47521ns
I0117 14:21:12.679464 24800 scheduler.cpp:676] Enqueuing event OFFERS received from http://172.17.0.3:42916/master/api/v1/scheduler
I0117 14:21:12.680207 24794 scheduler.cpp:243] Sending ACCEPT call to http://172.17.0.3:42916/master/api/v1/scheduler
I0117 14:21:12.680645 24797 process.cpp:3676] Handling HTTP event for process 'master' with path: '/master/api/v1/scheduler'
I0117 14:21:12.681046 24800 http.cpp:409] HTTP POST for /master/api/v1/scheduler from 172.17.0.3:55082
I0117 14:21:12.681239 24800 master.cpp:3661] Processing ACCEPT call for offers: [ ec785856-b481-4e87-9444-2019c9ad3c61-O0 ] on agent ec785856-b481-4e87-9444-2019c9ad3c61-S0 at slave(626)@172.17.0.3:42916 (fba458e490c4) for framework ec785856-b481-4e87-9444-2019c9ad3c61-0000 (default)
I0117 14:21:12.681275 24800 master.cpp:3249] Authorizing framework principal 'test-principal' to launch task 85d3f34c-eafe-417b-a5af-ce58690238a5
W0117 14:21:12.681751 24800 validation.cpp:1001] Executor 'default' for task '85d3f34c-eafe-417b-a5af-ce58690238a5' uses less CPUs (None) than the minimum required (0.01). Please update your executor, as this will be mandatory in future releases.
W0117 14:21:12.681771 24800 validation.cpp:1013] Executor 'default' for task '85d3f34c-eafe-417b-a5af-ce58690238a5' uses less memory (None) than the minimum required (32MB). Please update your executor, as this will be mandatory in future releases.
I0117 14:21:12.681867 24800 master.cpp:8575] Adding task 85d3f34c-eafe-417b-a5af-ce58690238a5 with resources cpus(*):2; mem(*):1024; disk(*):1024; ports(*):[31000-32000] on agent ec785856-b481-4e87-9444-2019c9ad3c61-S0 at slave(626)@172.17.0.3:42916 (fba458e490c4)
I0117 14:21:12.681949 24800 master.cpp:4311] Launching task 85d3f34c-eafe-417b-a5af-ce58690238a5 of framework ec785856-b481-4e87-9444-2019c9ad3c61-0000 (default) with resources cpus(*):2; mem(*):1024; disk(*):1024; ports(*):[31000-32000] on agent ec785856-b481-4e87-9444-2019c9ad3c61-S0 at slave(626)@172.17.0.3:42916 (fba458e490c4)
I0117 14:21:12.682097 24791 slave.cpp:1571] Got assigned task '85d3f34c-eafe-417b-a5af-ce58690238a5' for framework ec785856-b481-4e87-9444-2019c9ad3c61-0000
I0117 14:21:12.682355 24791 slave.cpp:1731] Launching task '85d3f34c-eafe-417b-a5af-ce58690238a5' for framework ec785856-b481-4e87-9444-2019c9ad3c61-0000
I0117 14:21:12.682843 24791 paths.cpp:530] Trying to chown '/tmp/ContentType_SchedulerTest_KillTask_0_Qr1nH7/slaves/ec785856-b481-4e87-9444-2019c9ad3c61-S0/frameworks/ec785856-b481-4e87-9444-2019c9ad3c61-0000/executors/default/runs/18ebe2c1-698b-49a3-a855-8bb51035c2a2' to user 'mesos'
I0117 14:21:12.689662 24791 slave.cpp:6345] Launching executor 'default' of framework ec785856-b481-4e87-9444-2019c9ad3c61-0000 with resources {} in work directory '/tmp/ContentType_SchedulerTest_KillTask_0_Qr1nH7/slaves/ec785856-b481-4e87-9444-2019c9ad3c61-S0/frameworks/ec785856-b481-4e87-9444-2019c9ad3c61-0000/executors/default/runs/18ebe2c1-698b-49a3-a855-8bb51035c2a2'
I0117 14:21:12.689981 24791 slave.cpp:2053] Queued task '85d3f34c-eafe-417b-a5af-ce58690238a5' for executor 'default' of framework ec785856-b481-4e87-9444-2019c9ad3c61-0000
I0117 14:21:12.690038 24791 slave.cpp:877] Successfully attached file '/tmp/ContentType_SchedulerTest_KillTask_0_Qr1nH7/slaves/ec785856-b481-4e87-9444-2019c9ad3c61-S0/frameworks/ec785856-b481-4e87-9444-2019c9ad3c61-0000/executors/default/runs/18ebe2c1-698b-49a3-a855-8bb51035c2a2'
I0117 14:21:12.690734 24796 executor.cpp:191] Version: 1.2.0
I0117 14:21:12.691578 24790 executor.cpp:400] Connected with the agent
I0117 14:21:12.691936 24792 executor.cpp:301] Sending SUBSCRIBE call to http://172.17.0.3:42916/slave(626)/api/v1/executor
I0117 14:21:12.692397 24803 process.cpp:3676] Handling HTTP event for process 'slave(626)' with path: '/slave(626)/api/v1/executor'
I0117 14:21:12.692756 24794 http.cpp:303] HTTP POST for /slave(626)/api/v1/executor from 172.17.0.3:55083
I0117 14:21:12.692836 24794 slave.cpp:3104] Received Subscribe request for HTTP executor 'default' of framework ec785856-b481-4e87-9444-2019c9ad3c61-0000
I0117 14:21:12.693284 24794 slave.cpp:2266] Sending queued task '85d3f34c-eafe-417b-a5af-ce58690238a5' to executor 'default' of framework ec785856-b481-4e87-9444-2019c9ad3c61-0000 (via HTTP)
I0117 14:21:12.693919 24789 executor.cpp:715] Enqueuing event SUBSCRIBED received from http://172.17.0.3:42916/slave(626)/api/v1/executor
I0117 14:21:12.694533 24789 executor.cpp:715] Enqueuing event LAUNCH received from http://172.17.0.3:42916/slave(626)/api/v1/executor
I0117 14:21:12.694891 24799 executor.cpp:301] Sending UPDATE call to http://172.17.0.3:42916/slave(626)/api/v1/executor
I0117 14:21:12.695284 24799 process.cpp:3676] Handling HTTP event for process 'slave(626)' with path: '/slave(626)/api/v1/executor'
I0117 14:21:12.695627 24795 http.cpp:303] HTTP POST for /slave(626)/api/v1/executor from 172.17.0.3:55084
I0117 14:21:12.695701 24795 slave.cpp:3751] Handling status update TASK_RUNNING (UUID: e0b75f15-ed96-44d5-b108-ae123bb8fa5c) for task 85d3f34c-eafe-417b-a5af-ce58690238a5 of framework ec785856-b481-4e87-9444-2019c9ad3c61-0000
I0117 14:21:12.696022 24803 status_update_manager.cpp:323] Received status update TASK_RUNNING (UUID: e0b75f15-ed96-44d5-b108-ae123bb8fa5c) for task 85d3f34c-eafe-417b-a5af-ce58690238a5 of framework ec785856-b481-4e87-9444-2019c9ad3c61-0000
I0117 14:21:12.696049 24803 status_update_manager.cpp:500] Creating StatusUpdate stream for task 85d3f34c-eafe-417b-a5af-ce58690238a5 of framework ec785856-b481-4e87-9444-2019c9ad3c61-0000
I0117 14:21:12.696349 24803 status_update_manager.cpp:377] Forwarding update TASK_RUNNING (UUID: e0b75f15-ed96-44d5-b108-ae123bb8fa5c) for task 85d3f34c-eafe-417b-a5af-ce58690238a5 of framework ec785856-b481-4e87-9444-2019c9ad3c61-0000 to the agent
I0117 14:21:12.696502 24792 slave.cpp:4191] Forwarding the update TASK_RUNNING (UUID: e0b75f15-ed96-44d5-b108-ae123bb8fa5c) for task 85d3f34c-eafe-417b-a5af-ce58690238a5 of framework ec785856-b481-4e87-9444-2019c9ad3c61-0000 to master@172.17.0.3:42916
I0117 14:21:12.696624 24792 slave.cpp:4085] Status update manager successfully handled status update TASK_RUNNING (UUID: e0b75f15-ed96-44d5-b108-ae123bb8fa5c) for task 85d3f34c-eafe-417b-a5af-ce58690238a5 of framework ec785856-b481-4e87-9444-2019c9ad3c61-0000
I0117 14:21:12.696709 24798 master.cpp:5846] Status update TASK_RUNNING (UUID: e0b75f15-ed96-44d5-b108-ae123bb8fa5c) for task 85d3f34c-eafe-417b-a5af-ce58690238a5 of framework ec785856-b481-4e87-9444-2019c9ad3c61-0000 from agent ec785856-b481-4e87-9444-2019c9ad3c61-S0 at slave(626)@172.17.0.3:42916 (fba458e490c4)
I0117 14:21:12.696748 24798 master.cpp:5908] Forwarding status update TASK_RUNNING (UUID: e0b75f15-ed96-44d5-b108-ae123bb8fa5c) for task 85d3f34c-eafe-417b-a5af-ce58690238a5 of framework ec785856-b481-4e87-9444-2019c9ad3c61-0000
I0117 14:21:12.697046 24798 master.cpp:7947] Updating the state of task 85d3f34c-eafe-417b-a5af-ce58690238a5 of framework ec785856-b481-4e87-9444-2019c9ad3c61-0000 (latest state: TASK_RUNNING, status update state: TASK_RUNNING)
I0117 14:21:12.697127 24798 executor.cpp:715] Enqueuing event ACKNOWLEDGED received from http://172.17.0.3:42916/slave(626)/api/v1/executor
I0117 14:21:12.697576 24788 scheduler.cpp:676] Enqueuing event UPDATE received from http://172.17.0.3:42916/master/api/v1/scheduler
I0117 14:21:12.698173 24803 scheduler.cpp:243] Sending ACKNOWLEDGE call to http://172.17.0.3:42916/master/api/v1/scheduler
I0117 14:21:12.698312 24803 scheduler.cpp:243] Sending KILL call to http://172.17.0.3:42916/master/api/v1/scheduler
I0117 14:21:12.698539 24791 process.cpp:3676] Handling HTTP event for process 'master' with path: '/master/api/v1/scheduler'
I0117 14:21:12.735260 24801 process.cpp:3676] Handling HTTP event for process 'master' with path: '/master/api/v1/scheduler'
I0117 14:21:12.735661 24801 http.cpp:409] HTTP POST for /master/api/v1/scheduler from 172.17.0.3:55082
I0117 14:21:12.735743 24801 master.cpp:4948] Processing ACKNOWLEDGE call e0b75f15-ed96-44d5-b108-ae123bb8fa5c for task 85d3f34c-eafe-417b-a5af-ce58690238a5 of framework ec785856-b481-4e87-9444-2019c9ad3c61-0000 (default) on agent ec785856-b481-4e87-9444-2019c9ad3c61-S0
I0117 14:21:12.736098 24803 status_update_manager.cpp:395] Received status update acknowledgement (UUID: e0b75f15-ed96-44d5-b108-ae123bb8fa5c) for task 85d3f34c-eafe-417b-a5af-ce58690238a5 of framework ec785856-b481-4e87-9444-2019c9ad3c61-0000
I0117 14:21:12.736086 24796 http.cpp:409] HTTP POST for /master/api/v1/scheduler from 172.17.0.3:55082
I0117 14:21:12.736198 24796 master.cpp:4767] Processing KILL call for task '85d3f34c-eafe-417b-a5af-ce58690238a5' of framework ec785856-b481-4e87-9444-2019c9ad3c61-0000 (default)
I0117 14:21:12.736223 24803 slave.cpp:3040] Status update manager successfully handled status update acknowledgement (UUID: e0b75f15-ed96-44d5-b108-ae123bb8fa5c) for task 85d3f34c-eafe-417b-a5af-ce58690238a5 of framework ec785856-b481-4e87-9444-2019c9ad3c61-0000
I0117 14:21:12.736225 24796 master.cpp:4840] Telling agent ec785856-b481-4e87-9444-2019c9ad3c61-S0 at slave(626)@172.17.0.3:42916 (fba458e490c4) to kill task 85d3f34c-eafe-417b-a5af-ce58690238a5 of framework ec785856-b481-4e87-9444-2019c9ad3c61-0000 (default)
I0117 14:21:12.736414 24795 slave.cpp:2363] Asked to kill task 85d3f34c-eafe-417b-a5af-ce58690238a5 of framework ec785856-b481-4e87-9444-2019c9ad3c61-0000
I0117 14:21:12.736909 24791 executor.cpp:715] Enqueuing event KILL received from http://172.17.0.3:42916/slave(626)/api/v1/executor
I0117 14:21:12.737295 24792 executor.cpp:301] Sending UPDATE call to http://172.17.0.3:42916/slave(626)/api/v1/executor
I0117 14:21:12.737678 24802 process.cpp:3676] Handling HTTP event for process 'slave(626)' with path: '/slave(626)/api/v1/executor'
I0117 14:21:12.775290 24794 http.cpp:303] HTTP POST for /slave(626)/api/v1/executor from 172.17.0.3:55084
I0117 14:21:12.775398 24794 slave.cpp:3751] Handling status update TASK_KILLED (UUID: b5b59938-3059-4803-a7df-9cef1605f5ee) for task 85d3f34c-eafe-417b-a5af-ce58690238a5 of framework ec785856-b481-4e87-9444-2019c9ad3c61-0000
I0117 14:21:12.776113 24792 status_update_manager.cpp:323] Received status update TASK_KILLED (UUID: b5b59938-3059-4803-a7df-9cef1605f5ee) for task 85d3f34c-eafe-417b-a5af-ce58690238a5 of framework ec785856-b481-4e87-9444-2019c9ad3c61-0000
I0117 14:21:12.776183 24792 status_update_manager.cpp:377] Forwarding update TASK_KILLED (UUID: b5b59938-3059-4803-a7df-9cef1605f5ee) for task 85d3f34c-eafe-417b-a5af-ce58690238a5 of framework ec785856-b481-4e87-9444-2019c9ad3c61-0000 to the agent
I0117 14:21:12.776309 24799 slave.cpp:4191] Forwarding the update TASK_KILLED (UUID: b5b59938-3059-4803-a7df-9cef1605f5ee) for task 85d3f34c-eafe-417b-a5af-ce58690238a5 of framework ec785856-b481-4e87-9444-2019c9ad3c61-0000 to master@172.17.0.3:42916
I0117 14:21:12.776458 24799 slave.cpp:4085] Status update manager successfully handled status update TASK_KILLED (UUID: b5b59938-3059-4803-a7df-9cef1605f5ee) for task 85d3f34c-eafe-417b-a5af-ce58690238a5 of framework ec785856-b481-4e87-9444-2019c9ad3c61-0000
I0117 14:21:12.776491 24788 master.cpp:5846] Status update TASK_KILLED (UUID: b5b59938-3059-4803-a7df-9cef1605f5ee) for task 85d3f34c-eafe-417b-a5af-ce58690238a5 of framework ec785856-b481-4e87-9444-2019c9ad3c61-0000 from agent ec785856-b481-4e87-9444-2019c9ad3c61-S0 at slave(626)@172.17.0.3:42916 (fba458e490c4)
I0117 14:21:12.776535 24788 master.cpp:5908] Forwarding status update TASK_KILLED (UUID: b5b59938-3059-4803-a7df-9cef1605f5ee) for task 85d3f34c-eafe-417b-a5af-ce58690238a5 of framework ec785856-b481-4e87-9444-2019c9ad3c61-0000
I0117 14:21:12.776687 24788 master.cpp:7947] Updating the state of task 85d3f34c-eafe-417b-a5af-ce58690238a5 of framework ec785856-b481-4e87-9444-2019c9ad3c61-0000 (latest state: TASK_KILLED, status update state: TASK_KILLED)
I0117 14:21:12.776916 24788 executor.cpp:715] Enqueuing event ACKNOWLEDGED received from http://172.17.0.3:42916/slave(626)/api/v1/executor
I0117 14:21:12.777070 24790 hierarchical.cpp:1011] Recovered cpus(*):2; mem(*):1024; disk(*):1024; ports(*):[31000-32000] (total: cpus(*):2; mem(*):1024; disk(*):1024; ports(*):[31000-32000], allocated: {}) on agent ec785856-b481-4e87-9444-2019c9ad3c61-S0 from framework ec785856-b481-4e87-9444-2019c9ad3c61-0000
I0117 14:21:12.777137 24792 scheduler.cpp:676] Enqueuing event UPDATE received from http://172.17.0.3:42916/master/api/v1/scheduler
I0117 14:21:12.778604 24794 master.cpp:1378] Framework ec785856-b481-4e87-9444-2019c9ad3c61-0000 (default) disconnected
I0117 14:21:12.778627 24794 master.cpp:2992] Disconnecting framework ec785856-b481-4e87-9444-2019c9ad3c61-0000 (default)
I0117 14:21:12.778643 24794 master.cpp:3016] Deactivating framework ec785856-b481-4e87-9444-2019c9ad3c61-0000 (default)
I0117 14:21:12.778682 24794 master.cpp:1391] Giving framework ec785856-b481-4e87-9444-2019c9ad3c61-0000 (default) 0ns to failover
I0117 14:21:12.778724 24801 hierarchical.cpp:386] Deactivated framework ec785856-b481-4e87-9444-2019c9ad3c61-0000
I0117 14:21:12.779999 24796 master.cpp:6514] Framework failover timeout, removing framework ec785856-b481-4e87-9444-2019c9ad3c61-0000 (default)
I0117 14:21:12.780020 24796 master.cpp:7383] Removing framework ec785856-b481-4e87-9444-2019c9ad3c61-0000 (default)
I0117 14:21:12.780081 24796 master.cpp:7947] Updating the state of task 85d3f34c-eafe-417b-a5af-ce58690238a5 of framework ec785856-b481-4e87-9444-2019c9ad3c61-0000 (latest state: TASK_KILLED, status update state: TASK_KILLED)
I0117 14:21:12.780099 24801 slave.cpp:2593] Asked to shut down framework ec785856-b481-4e87-9444-2019c9ad3c61-0000 by master@172.17.0.3:42916
I0117 14:21:12.780153 24796 master.cpp:8043] Removing task 85d3f34c-eafe-417b-a5af-ce58690238a5 with resources cpus(*):2; mem(*):1024; disk(*):1024; ports(*):[31000-32000] of framework ec785856-b481-4e87-9444-2019c9ad3c61-0000 on agent ec785856-b481-4e87-9444-2019c9ad3c61-S0 at slave(626)@172.17.0.3:42916 (fba458e490c4)
I0117 14:21:12.780196 24801 slave.cpp:2618] Shutting down framework ec785856-b481-4e87-9444-2019c9ad3c61-0000
I0117 14:21:12.780242 24801 slave.cpp:5000] Shutting down executor 'default' of framework ec785856-b481-4e87-9444-2019c9ad3c61-0000 (via HTTP)
I0117 14:21:12.780274 24796 master.cpp:8072] Removing executor 'default' with resources {} of framework ec785856-b481-4e87-9444-2019c9ad3c61-0000 on agent ec785856-b481-4e87-9444-2019c9ad3c61-S0 at slave(626)@172.17.0.3:42916 (fba458e490c4)
I0117 14:21:12.780423 24796 hierarchical.cpp:337] Removed framework ec785856-b481-4e87-9444-2019c9ad3c61-0000
I0117 14:21:12.780839 24798 executor.cpp:715] Enqueuing event SHUTDOWN received from http://172.17.0.3:42916/slave(626)/api/v1/executor
I0117 14:21:12.781354 24801 slave.cpp:4686] Executor 'default' of framework ec785856-b481-4e87-9444-2019c9ad3c61-0000 exited with status 0
I0117 14:21:12.781517 24801 slave.cpp:4786] Cleaning up executor 'default' of framework ec785856-b481-4e87-9444-2019c9ad3c61-0000 (via HTTP)
W0117 14:21:12.781543 24793 master.cpp:5964] Ignoring unknown exited executor 'default' of framework ec785856-b481-4e87-9444-2019c9ad3c61-0000 on agent ec785856-b481-4e87-9444-2019c9ad3c61-S0 at slave(626)@172.17.0.3:42916 (fba458e490c4)
I0117 14:21:12.781769 24801 slave.cpp:4874] Cleaning up framework ec785856-b481-4e87-9444-2019c9ad3c61-0000
*** Aborted at 1484662872 (unix time) try "date -d @1484662872" if you are using GNU date ***
PC: @ 0x2788071 testing::internal::UntypedFunctionMockerBase::SetOwnerAndName()
*** SIGSEGV (@0x2b66519725c8) received by PID 24787 (TID 0x2b665c695700) from PID 1368860104; stack trace: ***
@ 0x2b66546a3330 (unknown)
@ 0x2788071 testing::internal::UntypedFunctionMockerBase::SetOwnerAndName()
@ 0xbdd72f mesos::internal::tests::executor::MockHTTPExecutor<>::event()
@ 0xbdcc61 mesos::internal::tests::executor::TestMesos<>::events()
@ 0xbdce1a std::_Function_handler<>::_M_invoke()
@ 0x2b665063b77a process::AsyncExecutorProcess::execute<>()
@ 0x2b665063c4e3 _ZZN7process8dispatchI7NothingNS_20AsyncExecutorProcessERKSt8functionIFvRKSt5queueIN5mesos2v18executor5EventESt5dequeIS8_SaIS8_EEEEESC_PvSG_SC_SJ_EENS_6FutureIT_EERKNS_3PIDIT0_EEMSO_FSL_T1_T2_T3_ET4_T5_T6_ENKUlPNS_11ProcessBaseEE_clES11_
@ 0x2b6651938b97 process::ProcessManager::resume()
@ 0x2b665194d33f std::thread::_Impl<>::_M_run()
@ 0x2b6654962a60 (unknown)
@ 0x2b665469b184 start_thread
@ 0x2b66551cb37d (unknown)
make[3]: *** [CMakeFiles/check] Segmentation fault
make[3]: Leaving directory `/mesos/build'
make[2]: Leaving directory `/mesos/build'
make[2]: *** [CMakeFiles/check.dir/all] Error 2
make[1]: *** [CMakeFiles/check.dir/rule] Error 2
make[1]: Leaving directory `/mesos/build'
make: *** [check] Error 2
+ docker rmi mesos-1484660780-28030
Untagged: mesos-1484660780-28030:latest
Deleted: sha256:40f922c54d227cb58b1d22107a5d0c1374321ea2a5ae91595c2c376c5849b350
Deleted: sha256:e2b2a11fb602267d9b491b604d5bb657c84c275958655b2005850425aa6fd3c8
Deleted: sha256:92791a63fea23a09987a202fff19eff0fc4d7cc666291b78b5551dbcaf8f1cc1
Deleted: sha256:065ab87a755735a91a42126d7970499422eaa70f0853c1968116f72707b411fd
Deleted: sha256:5ad6cf5a716108e367ec7180363c00de7815de6392f4bb87de0b84ea9c61b21e
Deleted: sha256:be373ede1025d0b7c448ca5384be770682c35d566a47b5caeed0b9573b827c5e
Deleted: sha256:fcecd9922912a493f922bc6fe2fcdecb471db70502e4fc6f1036d621218df9db
Deleted: sha256:628b7b562da39298b64e4da602e35aab7d8bc34ad2c508c0069985897507e9ed
Deleted: sha256:5a8a37f7c8e1d4c28421d60928deec9a550ed3174e3130a68cefc5117bdf666c
Deleted: sha256:6c0b7ad1931ed7bb9c581957d85fee57b89491206ac4fa53e9338ac8e1108e7d
Deleted: sha256:78679f5992dd7d3bbd25feed8c074327dd166c930ea7594bf9b3549a0674f684
Deleted: sha256:ee71820593ebfdfa42dd238317e3e5558b8b725cd75ffdd7898f7e726a6c65fb
Deleted: sha256:cd4a8f55ba1052ddd3bad44f986e6f2be91171beb3752cc2a181e265b975ce90
Deleted: sha256:d12f6025d0ae206dc6449e1a9bd9f722abde2f4c7c92c79d42ea7c51daec83e5
Deleted: sha256:22c2e5145c9bfdd1c70124cc439c993a96b80a2670f64f412b223d436c20b9f6
Deleted: sha256:88e268d9c4a61bf21cde8861ec3460bac771535aa779f017e371a1b6679be952
Deleted: sha256:8c31c5c6013bb3c794c58d6ee00a532a51ae17cd2db8de4edd1632685c0d3217
Deleted: sha256:ed9a28af1d84fda21249797921ea493c9c503125900e79db4d2ba7371ac5bcbf
Deleted: sha256:0ef5c72e04cf071ac1da28499a2a067f7d22477f7ec1ebf979cc19a178456191
Deleted: sha256:66dea2cd2db14d9b4685345b399adcf12bfd793d23ecc7cd5e62cc36469879cb
Deleted: sha256:8b77c81f86e75800f6c968fd0fc067cb6c77a784567d73f83a8791ca0814e757
Deleted: sha256:0b8303420c8e9074a9b05c5a83d4fd6ddc836816015896fa38d72de56c423ba8
Deleted: sha256:277975dd0510ef6c34df125260c466160642bd7e51d330e6c6fccf89b6a600f2
Deleted: sha256:49a6b93c08d7d5025a8704ebdaed8def8a50d0736483b36b2e52840f2477b037
Build step 'Execute shell' marked build as failure
Jenkins build is back to normal : Mesos-Buildbot » cmake,clang,--verbose,GLOG_v=1 MESOS_VERBOSE=1,ubuntu:14.04,(docker||Hadoop)&&(!ubuntu-us1)&&(!ubuntu-6)&&(!ubuntu-eu2) #3121
Posted by Apache Jenkins Server <je...@builds.apache.org>.
See <https://builds.apache.org/job/Mesos-Buildbot/BUILDTOOL=cmake,COMPILER=clang,CONFIGURATION=--verbose,ENVIRONMENT=GLOG_v=1%20MESOS_VERBOSE=1,OS=ubuntu%3A14.04,label_exp=(docker%7C%7CHadoop)&&(!ubuntu-us1)&&(!ubuntu-6)&&(!ubuntu-eu2)/3121/changes>
Build failed in Jenkins: Mesos-Buildbot » cmake,clang,--verbose,GLOG_v=1 MESOS_VERBOSE=1,ubuntu:14.04,(docker||Hadoop)&&(!ubuntu-us1)&&(!ubuntu-6)&&(!ubuntu-eu2) #3120
Posted by Apache Jenkins Server <je...@builds.apache.org>.
See <https://builds.apache.org/job/Mesos-Buildbot/BUILDTOOL=cmake,COMPILER=clang,CONFIGURATION=--verbose,ENVIRONMENT=GLOG_v=1%20MESOS_VERBOSE=1,OS=ubuntu%3A14.04,label_exp=(docker%7C%7CHadoop)&&(!ubuntu-us1)&&(!ubuntu-6)&&(!ubuntu-eu2)/3120/changes>
Changes:
[vinodkone] Fix segfault when the executor sets a UUID that is not a valid v4 UUID.
[vinodkone] Added MESOS-6917 to CHANGELOG for 1.0.3.
------------------------------------------
Started by upstream project "Mesos-Buildbot" build number 3120
originally caused by:
Started by an SCM change
[EnvInject] - Loading node environment variables.
Building remotely on H6 (Hadoop) in workspace <https://builds.apache.org/job/Mesos-Buildbot/BUILDTOOL=cmake,COMPILER=clang,CONFIGURATION=--verbose,ENVIRONMENT=GLOG_v=1%20MESOS_VERBOSE=1,OS=ubuntu%3A14.04,label_exp=(docker%7C%7CHadoop)&&(!ubuntu-us1)&&(!ubuntu-6)&&(!ubuntu-eu2)/ws/>
> git rev-parse --is-inside-work-tree # timeout=10
Fetching changes from the remote Git repository
> git config remote.origin.url https://git-wip-us.apache.org/repos/asf/mesos.git # timeout=10
Fetching upstream changes from https://git-wip-us.apache.org/repos/asf/mesos.git
> git --version # timeout=10
> git -c core.askpass=true fetch --tags --progress https://git-wip-us.apache.org/repos/asf/mesos.git +refs/heads/*:refs/remotes/origin/*
Checking out Revision 8083dfe82a3b9135ca7493d29a5033eb10ee07da (origin/1.0.x)
> git config core.sparsecheckout # timeout=10
> git checkout -f 8083dfe82a3b9135ca7493d29a5033eb10ee07da
> git rev-list 64b7a192f101ee6bb81a58222c10aeda2250aae7 # timeout=10
[(docker||Hadoop)&&(!ubuntu-us1)&&(!ubuntu-6)&&(!ubuntu-eu2)] $ /bin/bash -xe /tmp/hudson2418902152523070696.sh
+ ./support/docker-build.sh
/tmp/hudson2418902152523070696.sh: line 2: ./support/docker-build.sh: No such file or directory
Build step 'Execute shell' marked build as failure
Build failed in Jenkins: Mesos-Buildbot » cmake,clang,--verbose,GLOG_v=1 MESOS_VERBOSE=1,ubuntu:14.04,(docker||Hadoop)&&(!ubuntu-us1)&&(!ubuntu-6)&&(!ubuntu-eu2) #3119
Posted by Apache Jenkins Server <je...@builds.apache.org>.
See <https://builds.apache.org/job/Mesos-Buildbot/BUILDTOOL=cmake,COMPILER=clang,CONFIGURATION=--verbose,ENVIRONMENT=GLOG_v=1%20MESOS_VERBOSE=1,OS=ubuntu%3A14.04,label_exp=(docker%7C%7CHadoop)&&(!ubuntu-us1)&&(!ubuntu-6)&&(!ubuntu-eu2)/3119/changes>
Changes:
[vinodkone] Fix segfault when the executor sets a UUID that is not a valid v4 UUID.
[vinodkone] Added MESOS-6917 to CHANGELOG for 1.1.1.
------------------------------------------
Started by upstream project "Mesos-Buildbot" build number 3119
originally caused by:
Started by an SCM change
Started by an SCM change
[EnvInject] - Loading node environment variables.
Building remotely on H6 (Hadoop) in workspace <https://builds.apache.org/job/Mesos-Buildbot/BUILDTOOL=cmake,COMPILER=clang,CONFIGURATION=--verbose,ENVIRONMENT=GLOG_v=1%20MESOS_VERBOSE=1,OS=ubuntu%3A14.04,label_exp=(docker%7C%7CHadoop)&&(!ubuntu-us1)&&(!ubuntu-6)&&(!ubuntu-eu2)/ws/>
> git rev-parse --is-inside-work-tree # timeout=10
Fetching changes from the remote Git repository
> git config remote.origin.url https://git-wip-us.apache.org/repos/asf/mesos.git # timeout=10
Fetching upstream changes from https://git-wip-us.apache.org/repos/asf/mesos.git
> git --version # timeout=10
> git -c core.askpass=true fetch --tags --progress https://git-wip-us.apache.org/repos/asf/mesos.git +refs/heads/*:refs/remotes/origin/*
Checking out Revision 4ac6038a39fe7c4bb3f3cca16761f45f29d4e197 (origin/1.1.x)
> git config core.sparsecheckout # timeout=10
> git checkout -f 4ac6038a39fe7c4bb3f3cca16761f45f29d4e197
> git rev-list 1279c3b08d62899ef93614e427c5164daa4cf41d # timeout=10
[(docker||Hadoop)&&(!ubuntu-us1)&&(!ubuntu-6)&&(!ubuntu-eu2)] $ /bin/bash -xe /tmp/hudson5302850774234535378.sh
+ ./support/docker-build.sh
/tmp/hudson5302850774234535378.sh: line 2: ./support/docker-build.sh: No such file or directory
Build step 'Execute shell' marked build as failure