You are viewing a plain text version of this content. The canonical link for it is here.
Posted to dev@openmeetings.apache.org by Apache Jenkins Server <je...@builds.apache.org> on 2020/03/10 15:40:49 UTC

Build failed in Jenkins: openmeetings #3032

See <https://builds.apache.org/job/openmeetings/3032/display/redirect?page=changes>

Changes:

[github] Update Application_ru.properties.xml (#40)

[github] Bump reflow maven plugin to 2.3.0 (#45)


------------------------------------------
[...truncated 3.46 MB...]
[INFO] --- maven-remote-resources-plugin:1.6.0:process (process-resource-bundles) @ openmeetings-screenshare ---
[INFO] Preparing remote bundle org.apache:apache-jar-resource-bundle:1.4
[INFO] Copying 3 resources from 1 bundle.
[INFO] 
[INFO] --- maven-site-plugin:3.8.2:site (generate-site) @ openmeetings-screenshare ---
[INFO] configuring report plugin org.apache.maven.plugins:maven-project-info-reports-plugin:3.0.0
[INFO] 14 reports configured for maven-project-info-reports-plugin:3.0.0: index, ci-management, dependencies, dependency-convergence, dependency-management, distribution-management, issue-management, licenses, mailing-lists, plugin-management, plugins, team, scm, summary
[INFO] configuring report plugin org.apache.maven.plugins:maven-surefire-report-plugin:3.0.0-M4
[INFO] 1 report configured for maven-surefire-report-plugin:3.0.0-M4: report-only
[INFO] configuring report plugin org.apache.rat:apache-rat-plugin:0.13
[INFO] 1 report configured for apache-rat-plugin:0.13: rat
[INFO] Rendering site with default locale English (en)
[INFO] Relativizing decoration links with respect to localized project URL: https://openmeetings.apache.org/openmeetings-screenshare
[INFO] Rendering content with io.github.devacfr.maven.skins:reflow-maven-skin:jar:2.3.0 skin.
[INFO] Generating "About" report                --- maven-project-info-reports-plugin:3.0.0:index
[INFO] Generating "CI Management" report        --- maven-project-info-reports-plugin:3.0.0:ci-management
[INFO] Generating "Dependencies" report         --- maven-project-info-reports-plugin:3.0.0:dependencies
[INFO] Generating "Dependency Convergence" report --- maven-project-info-reports-plugin:3.0.0:dependency-convergence
[INFO] Generating "Dependency Management" report --- maven-project-info-reports-plugin:3.0.0:dependency-management
[INFO] Generating "Distribution Management" report --- maven-project-info-reports-plugin:3.0.0:distribution-management
[INFO] Generating "Issue Management" report     --- maven-project-info-reports-plugin:3.0.0:issue-management
[INFO] Generating "Licenses" report             --- maven-project-info-reports-plugin:3.0.0:licenses
[INFO] Generating "Mailing Lists" report        --- maven-project-info-reports-plugin:3.0.0:mailing-lists
[INFO] Generating "Plugin Management" report    --- maven-project-info-reports-plugin:3.0.0:plugin-management
[INFO] Generating "Plugins" report              --- maven-project-info-reports-plugin:3.0.0:plugins
[INFO] Generating "Team" report                 --- maven-project-info-reports-plugin:3.0.0:team
[INFO] Generating "Source Code Management" report --- maven-project-info-reports-plugin:3.0.0:scm
[INFO] Generating "Summary" report              --- maven-project-info-reports-plugin:3.0.0:summary
[INFO] Generating "Surefire Report" report      --- maven-surefire-report-plugin:3.0.0-M4:report-only
[WARNING] Unable to locate Test Source XRef to link to - DISABLED
[INFO] Generating "Rat Report" report           --- apache-rat-plugin:0.13:rat
[INFO] Added 1 additional default licenses.
[INFO] Enabled default license matchers.
[INFO] Added 1 custom approved licenses.
[INFO] Will parse SCM ignores for exclusions...
[INFO] Finished adding exclusions from SCM ignore files.
[INFO] 62 implicit excludes (use -debug for more details).
[INFO] 2 explicit excludes (use -debug for more details).
[INFO] 46 resources included (use -debug for more details)
[JENKINS] Archiving site from <https://builds.apache.org/job/openmeetings/ws/openmeetings-screenshare/target/site> to /x1/jenkins/jenkins-home/jobs/openmeetings/site/openmeetings-screenshare
[INFO] 
[INFO] --- maven-resources-plugin:3.1.0:copy-resources (create-template) @ openmeetings-screenshare ---
[INFO] Using 'UTF-8' encoding to copy filtered resources.
[INFO] Copying 1 resource
[INFO] 
[INFO] --- maven-resources-plugin:3.1.0:copy-resources (copy-icons) @ openmeetings-screenshare ---
[INFO] Using 'UTF-8' encoding to copy filtered resources.
[INFO] Copying 2 resources
[INFO] 
[INFO] --- maven-antrun-plugin:1.8:run (default) @ openmeetings-screenshare ---
[INFO] Executing tasks

main:
     [copy] Copying 1 file to <https://builds.apache.org/job/openmeetings/ws/openmeetings-screenshare/target/jnlp>
[INFO] Executed tasks
[INFO] 
[INFO] --- keytool-maven-plugin:1.5:generateKeyPair (default) @ openmeetings-screenshare ---
[INFO] 
[INFO] --- maven-resources-plugin:3.1.0:resources (default-resources) @ openmeetings-screenshare ---
[INFO] Using 'UTF-8' encoding to copy filtered resources.
[INFO] Copying 8 resources
[INFO] Copying 3 resources
[INFO] 
[INFO] --- maven-compiler-plugin:3.8.1:compile (default-compile) @ openmeetings-screenshare ---
[INFO] Changes detected - recompiling the module!
[INFO] Compiling 30 source files to <https://builds.apache.org/job/openmeetings/ws/openmeetings-screenshare/target/classes>
[INFO] 
[INFO] --- maven-resources-plugin:3.1.0:testResources (default-testResources) @ openmeetings-screenshare ---
[INFO] Using 'UTF-8' encoding to copy filtered resources.
[INFO] skip non existing resourceDirectory <https://builds.apache.org/job/openmeetings/ws/openmeetings-screenshare/src/test/resources>
[INFO] Copying 3 resources
[INFO] 
[INFO] --- maven-compiler-plugin:3.8.1:testCompile (default-testCompile) @ openmeetings-screenshare ---
[INFO] No sources to compile
[INFO] 
[INFO] --- maven-surefire-plugin:3.0.0-M4:test (default-test) @ openmeetings-screenshare ---
[JENKINS] Recording test results[INFO] 

[INFO] --- maven-dependency-plugin:3.1.1:copy-dependencies (copy-bcprov) @ openmeetings-screenshare ---
[INFO] Copying bcprov-jdk15on-1.64.jar to <https://builds.apache.org/job/openmeetings/ws/openmeetings-screenshare/target/jnlp/bcprov-jdk15on-1.64.jar>
[INFO] 
[INFO] --- maven-jar-plugin:3.2.0:jar (default-jar) @ openmeetings-screenshare ---
[INFO] Building jar: <https://builds.apache.org/job/openmeetings/ws/openmeetings-screenshare/target/openmeetings-screenshare-5.0.0-M4-SNAPSHOT.jar>
[INFO] 
[INFO] --- maven-site-plugin:3.8.2:attach-descriptor (attach-descriptor) @ openmeetings-screenshare ---
[INFO] Skipping because packaging 'jar' is not pom.
[INFO] 
[INFO] --- maven-assembly-plugin:3.2.0:single (make-screen-sharing) @ openmeetings-screenshare ---
[INFO] Reading assembly descriptor: src/main/assembly/assembly.xml
[WARNING] The following patterns were never triggered in this artifact inclusion filter:
o  'net.sf.ehcache:ehcache-core'
o  'org.slf4j:jcl-over-slf4j'

[INFO] Building jar: <https://builds.apache.org/job/openmeetings/ws/openmeetings-screenshare/target/jnlp/openmeetings-screenshare-5.0.0-M4-SNAPSHOT-full.jar>
[INFO] 
[INFO] --- maven-jarsigner-plugin:3.0.0:sign (sign-applet) @ openmeetings-screenshare ---
[INFO] 4 archive(s) processed
[INFO] 
[INFO] --- forbiddenapis:2.7:check (forbiddenapis) @ openmeetings-screenshare ---
[INFO] Scanning for classes to check...
[INFO] Reading bundled API signatures: jdk-deprecated-1.7
[INFO] Reading bundled API signatures: jdk-non-portable
[INFO] Reading inline API signatures...
[INFO] Loading classes to check...
[INFO] Scanning classes for violations...
[INFO] Scanned 41 class file(s) for forbidden API invocations (in 0.11s), 0 error(s).
[INFO] 
[INFO] --- forbiddenapis:2.7:testCheck (forbiddenapis) @ openmeetings-screenshare ---
[INFO] Scanning for classes to check...
[WARNING] No classes found in '<https://builds.apache.org/job/openmeetings/ws/openmeetings-screenshare/target/test-classes'> (includes=[**/*.class], excludes=null), forbiddenapis check skipped.
[INFO] 
[INFO] --- maven-install-plugin:2.5.2:install (default-install) @ openmeetings-screenshare ---
[INFO] Installing <https://builds.apache.org/job/openmeetings/ws/openmeetings-screenshare/target/openmeetings-screenshare-5.0.0-M4-SNAPSHOT.jar> to /home/jenkins/jenkins-slave/maven-repositories/0/org/apache/openmeetings/openmeetings-screenshare/5.0.0-M4-SNAPSHOT/openmeetings-screenshare-5.0.0-M4-SNAPSHOT.jar
[INFO] Installing <https://builds.apache.org/job/openmeetings/ws/openmeetings-screenshare/pom.xml> to /home/jenkins/jenkins-slave/maven-repositories/0/org/apache/openmeetings/openmeetings-screenshare/5.0.0-M4-SNAPSHOT/openmeetings-screenshare-5.0.0-M4-SNAPSHOT.pom
[INFO] Installing <https://builds.apache.org/job/openmeetings/ws/openmeetings-screenshare/target/jnlp/openmeetings-screenshare-5.0.0-M4-SNAPSHOT-full.jar> to /home/jenkins/jenkins-slave/maven-repositories/0/org/apache/openmeetings/openmeetings-screenshare/5.0.0-M4-SNAPSHOT/openmeetings-screenshare-5.0.0-M4-SNAPSHOT-full.jar
[INFO] 
[INFO] ------------< org.apache.openmeetings:openmeetings-server >-------------
[INFO] Building Openmeetings Server 5.0.0-M4-SNAPSHOT                   [10/10]
[INFO] --------------------------------[ jar ]---------------------------------
[INFO] 
[INFO] --- maven-clean-plugin:3.1.0:clean (default-clean) @ openmeetings-server ---
[INFO] 
[INFO] --- buildnumber-maven-plugin:1.4:create (default) @ openmeetings-server ---
[INFO] 
[INFO] --- apache-rat-plugin:0.13:check (default) @ openmeetings-server ---
[INFO] Added 1 additional default licenses.
[INFO] Enabled default license matchers.
[INFO] Added 1 custom approved licenses.
[INFO] Will parse SCM ignores for exclusions...
[INFO] Finished adding exclusions from SCM ignore files.
[INFO] 62 implicit excludes (use -debug for more details).
[INFO] 2 explicit excludes (use -debug for more details).
[INFO] 173 resources included (use -debug for more details)
[INFO] Rat check: Summary over all files. Unapproved: 0, unknown: 0, generated: 0, approved: 91 licenses.
[INFO] 
[INFO] --- maven-enforcer-plugin:3.0.0-M3:enforce (enforce-versions) @ openmeetings-server ---
[INFO] 
[INFO] --- maven-enforcer-plugin:3.0.0-M3:enforce (enforce-maven-version) @ openmeetings-server ---
[INFO] 
[INFO] --- jacoco-maven-plugin:0.8.5:prepare-agent (prepare-agent) @ openmeetings-server ---
[INFO] argLine set to -javaagent:/home/jenkins/jenkins-slave/maven-repositories/0/org/jacoco/org.jacoco.agent/0.8.5/org.jacoco.agent-0.8.5-runtime.jar=destfile=<https://builds.apache.org/job/openmeetings/ws/openmeetings-server/../target/jacoco.exec,append=true>
[INFO] 
[INFO] --- exec-maven-plugin:1.6.0:java (generate-configs-xml-build) @ openmeetings-server ---
[INFO] 
[INFO] --- xml-maven-plugin:1.0.2:transform (generate-doc-build) @ openmeetings-server ---
[INFO] Transforming file: <https://builds.apache.org/job/openmeetings/ws/openmeetings-server/src/site/stylesheets/errorvalues.xml>
[INFO] Transformed 1 file(s).
[INFO] Transforming file: <https://builds.apache.org/job/openmeetings/ws/openmeetings-server/target/generated-sources/GeneralConfiguration.xml>
[INFO] Transformed 1 file(s).
[INFO] 
[INFO] --- maven-dependency-plugin:3.1.1:unpack (unpack-css-js) @ openmeetings-server ---
[INFO] Configured Artifact: io.github.devacfr.maven.skins:reflow-default-webdeps:2.3.0:jar
[INFO] Downloading from central: https://repo.maven.apache.org/maven2/io/github/devacfr/maven/skins/reflow-default-webdeps/2.3.0/reflow-default-webdeps-2.3.0.pom
[INFO] Downloaded from central: https://repo.maven.apache.org/maven2/io/github/devacfr/maven/skins/reflow-default-webdeps/2.3.0/reflow-default-webdeps-2.3.0.pom (22 kB at 33 kB/s)
[WARNING] The POM for io.github.devacfr.maven.skins:reflow-default-webdeps:jar:2.3.0 is invalid, transitive dependencies (if any) will not be available, enable debug logging for more details
[INFO] Downloading from central: https://repo.maven.apache.org/maven2/io/github/devacfr/maven/skins/reflow-default-webdeps/2.3.0/reflow-default-webdeps-2.3.0.jar
[INFO] Downloaded from central: https://repo.maven.apache.org/maven2/io/github/devacfr/maven/skins/reflow-default-webdeps/2.3.0/reflow-default-webdeps-2.3.0.jar (3.1 MB at 3.1 MB/s)
[INFO] Unpacking /home/jenkins/jenkins-slave/maven-repositories/0/io/github/devacfr/maven/skins/reflow-default-webdeps/2.3.0/reflow-default-webdeps-2.3.0.jar to <https://builds.apache.org/job/openmeetings/ws/openmeetings-server/target/site> with includes "**/css/*.css,**/css/themes/cerulean/*.css,**/css/fontawesome/**,**/js/*.js,**/js/styles/github*.css" and excludes ""
[INFO] 
[INFO] --- maven-remote-resources-plugin:1.6.0:process (process-resource-bundles) @ openmeetings-server ---
[INFO] Preparing remote bundle org.apache:apache-jar-resource-bundle:1.4
[INFO] Copying 3 resources from 1 bundle.
[INFO] 
[INFO] --- maven-site-plugin:3.8.2:site (generate-site) @ openmeetings-server ---
[INFO] configuring report plugin org.apache.maven.plugins:maven-project-info-reports-plugin:3.0.0
[INFO] 14 reports configured for maven-project-info-reports-plugin:3.0.0: index, ci-management, dependencies, dependency-convergence, dependency-management, distribution-management, issue-management, licenses, mailing-lists, plugin-management, plugins, team, scm, summary
[INFO] configuring report plugin org.apache.maven.plugins:maven-surefire-report-plugin:3.0.0-M4
[INFO] 1 report configured for maven-surefire-report-plugin:3.0.0-M4: report-only
[INFO] configuring report plugin org.apache.rat:apache-rat-plugin:0.13
[INFO] 1 report configured for apache-rat-plugin:0.13: rat
[INFO] Rendering site with default locale English (en)
[INFO] Relativizing decoration links with respect to localized project URL: https://openmeetings.apache.org
[INFO] Rendering content with io.github.devacfr.maven.skins:reflow-maven-skin:jar:2.3.0 skin.
[INFO] Skipped "About" report (maven-project-info-reports-plugin:3.0.0:index), file "index.html" already exists.
[INFO] Rendering 65 Doxia documents: 5 markdown, 60 xdoc
[JENKINS] Archiving site from <https://builds.apache.org/job/openmeetings/ws/openmeetings-server/target/site> to /x1/jenkins/jenkins-home/jobs/openmeetings/site/openmeetings-server
[INFO] ------------------------------------------------------------------------
[INFO] Reactor Summary for Openmeetings 5.0.0-M4-SNAPSHOT:
[INFO] 
[INFO] Openmeetings ....................................... SUCCESS [01:58 min]
[INFO] Openmeetings Util .................................. SUCCESS [08:39 min]
[INFO] Openmeetings DB .................................... SUCCESS [05:06 min]
[INFO] Openmeetings Core .................................. SUCCESS [01:41 min]
[INFO] Openmeetings Install ............................... SUCCESS [ 33.343 s]
[INFO] Openmeetings Service ............................... SUCCESS [ 30.590 s]
[INFO] Openmeetings Webservices ........................... SUCCESS [02:05 min]
[INFO] Openmeetings Web ................................... SUCCESS [31:43 min]
[INFO] Openmeetings Screen Sharing applet ................. SUCCESS [ 33.237 s]
[INFO] Openmeetings Server ................................ FAILURE [ 11.954 s]
[INFO] ------------------------------------------------------------------------
[INFO] BUILD FAILURE
[INFO] ------------------------------------------------------------------------
[INFO] Total time:  53:51 min
[INFO] Finished at: 2020-03-10T15:40:22Z
[INFO] ------------------------------------------------------------------------
Waiting for Jenkins to finish collecting data
[ERROR] Failed to execute goal org.apache.maven.plugins:maven-site-plugin:3.8.2:site (generate-site) on project openmeetings-server: Error parsing '<https://builds.apache.org/job/openmeetings/ws/openmeetings-server/src/site/markdown/InstallMediaServer.md'>: line [3] Error parsing the model: end tag name </p> must match start tag name <div> from line 3 (position: TEXT seen ...out bd-callout-danger"> It should be run under same user as OM</p>... @3:271) -> [Help 1]
[ERROR] 
[ERROR] To see the full stack trace of the errors, re-run Maven with the -e switch.
[ERROR] Re-run Maven using the -X switch to enable full debug logging.
[ERROR] 
[ERROR] For more information about the errors and possible solutions, please read the following articles:
[ERROR] [Help 1] http://cwiki.apache.org/confluence/display/MAVEN/MojoExecutionException
[ERROR] 
[ERROR] After correcting the problems, you can resume the build with the command
[ERROR]   mvn <goals> -rf :openmeetings-server
[JENKINS] Archiving <https://builds.apache.org/job/openmeetings/ws/openmeetings-server/pom.xml> to org.apache.openmeetings/openmeetings-server/5.0.0-M4-SNAPSHOT/openmeetings-server-5.0.0-M4-SNAPSHOT.pom
[JENKINS] Archiving <https://builds.apache.org/job/openmeetings/ws/openmeetings-screenshare/pom.xml> to org.apache.openmeetings/openmeetings-screenshare/5.0.0-M4-SNAPSHOT/openmeetings-screenshare-5.0.0-M4-SNAPSHOT.pom
[JENKINS] Archiving <https://builds.apache.org/job/openmeetings/ws/openmeetings-screenshare/target/openmeetings-screenshare-5.0.0-M4-SNAPSHOT.jar> to org.apache.openmeetings/openmeetings-screenshare/5.0.0-M4-SNAPSHOT/openmeetings-screenshare-5.0.0-M4-SNAPSHOT.jar
[JENKINS] Archiving <https://builds.apache.org/job/openmeetings/ws/openmeetings-screenshare/target/jnlp/openmeetings-screenshare-5.0.0-M4-SNAPSHOT-full.jar> to org.apache.openmeetings/openmeetings-screenshare/5.0.0-M4-SNAPSHOT/openmeetings-screenshare-5.0.0-M4-SNAPSHOT-full.jar
[Fast Archiver] Compressed 9.52 MB of artifacts by 86.4% relative to #3031
[JENKINS] Archiving <https://builds.apache.org/job/openmeetings/ws/openmeetings-util/pom.xml> to org.apache.openmeetings/openmeetings-util/5.0.0-M4-SNAPSHOT/openmeetings-util-5.0.0-M4-SNAPSHOT.pom
[JENKINS] Archiving <https://builds.apache.org/job/openmeetings/ws/openmeetings-util/target/openmeetings-util-5.0.0-M4-SNAPSHOT.jar> to org.apache.openmeetings/openmeetings-util/5.0.0-M4-SNAPSHOT/openmeetings-util-5.0.0-M4-SNAPSHOT.jar
[JENKINS] Archiving <https://builds.apache.org/job/openmeetings/ws/openmeetings-util/target/openmeetings-util-5.0.0-M4-SNAPSHOT-tests.jar> to org.apache.openmeetings/openmeetings-util/5.0.0-M4-SNAPSHOT/openmeetings-util-5.0.0-M4-SNAPSHOT-tests.jar
[JENKINS] Archiving <https://builds.apache.org/job/openmeetings/ws/openmeetings-install/pom.xml> to org.apache.openmeetings/openmeetings-install/5.0.0-M4-SNAPSHOT/openmeetings-install-5.0.0-M4-SNAPSHOT.pom
[JENKINS] Archiving <https://builds.apache.org/job/openmeetings/ws/openmeetings-install/target/openmeetings-install-5.0.0-M4-SNAPSHOT.jar> to org.apache.openmeetings/openmeetings-install/5.0.0-M4-SNAPSHOT/openmeetings-install-5.0.0-M4-SNAPSHOT.jar
[Fast Archiver] Compressed 107.95 KB of artifacts by 59.3% relative to #3031
[JENKINS] Archiving <https://builds.apache.org/job/openmeetings/ws/openmeetings-service/pom.xml> to org.apache.openmeetings/openmeetings-service/5.0.0-M4-SNAPSHOT/openmeetings-service-5.0.0-M4-SNAPSHOT.pom
[JENKINS] Archiving <https://builds.apache.org/job/openmeetings/ws/openmeetings-service/target/openmeetings-service-5.0.0-M4-SNAPSHOT.jar> to org.apache.openmeetings/openmeetings-service/5.0.0-M4-SNAPSHOT/openmeetings-service-5.0.0-M4-SNAPSHOT.jar
[Fast Archiver] Compressed 102.96 KB of artifacts by 31.1% relative to #3031
[JENKINS] Archiving <https://builds.apache.org/job/openmeetings/ws/pom.xml> to org.apache.openmeetings/openmeetings-parent/5.0.0-M4-SNAPSHOT/openmeetings-parent-5.0.0-M4-SNAPSHOT.pom
[JENKINS] Archiving <https://builds.apache.org/job/openmeetings/ws/target/openmeetings-parent-5.0.0-M4-SNAPSHOT-site.xml> to org.apache.openmeetings/openmeetings-parent/5.0.0-M4-SNAPSHOT/openmeetings-parent-5.0.0-M4-SNAPSHOT-site.xml
[JENKINS] Archiving <https://builds.apache.org/job/openmeetings/ws/openmeetings-db/pom.xml> to org.apache.openmeetings/openmeetings-db/5.0.0-M4-SNAPSHOT/openmeetings-db-5.0.0-M4-SNAPSHOT.pom
[JENKINS] Archiving <https://builds.apache.org/job/openmeetings/ws/openmeetings-db/target/openmeetings-db-5.0.0-M4-SNAPSHOT.jar> to org.apache.openmeetings/openmeetings-db/5.0.0-M4-SNAPSHOT/openmeetings-db-5.0.0-M4-SNAPSHOT.jar
[Fast Archiver] Compressed 434.87 KB of artifacts by 80.9% relative to #3031
[JENKINS] Archiving <https://builds.apache.org/job/openmeetings/ws/openmeetings-web/pom.xml> to org.apache.openmeetings/openmeetings-web/5.0.0-M4-SNAPSHOT/openmeetings-web-5.0.0-M4-SNAPSHOT.pom
[JENKINS] Archiving <https://builds.apache.org/job/openmeetings/ws/openmeetings-web/target/openmeetings-web-5.0.0-M4-SNAPSHOT.war> to org.apache.openmeetings/openmeetings-web/5.0.0-M4-SNAPSHOT/openmeetings-web-5.0.0-M4-SNAPSHOT.war
[Fast Archiver] Compressed 136.26 MB of artifacts by 89.7% relative to #3031
[JENKINS] Archiving <https://builds.apache.org/job/openmeetings/ws/openmeetings-webservice/pom.xml> to org.apache.openmeetings/openmeetings-webservice/5.0.0-M4-SNAPSHOT/openmeetings-webservice-5.0.0-M4-SNAPSHOT.pom
[JENKINS] Archiving <https://builds.apache.org/job/openmeetings/ws/openmeetings-webservice/target/openmeetings-webservice-5.0.0-M4-SNAPSHOT.jar> to org.apache.openmeetings/openmeetings-webservice/5.0.0-M4-SNAPSHOT/openmeetings-webservice-5.0.0-M4-SNAPSHOT.jar
[Fast Archiver] Compressed 72.85 KB of artifacts by 43.9% relative to #3031
[JENKINS] Archiving <https://builds.apache.org/job/openmeetings/ws/openmeetings-core/pom.xml> to org.apache.openmeetings/openmeetings-core/5.0.0-M4-SNAPSHOT/openmeetings-core-5.0.0-M4-SNAPSHOT.pom
[JENKINS] Archiving <https://builds.apache.org/job/openmeetings/ws/openmeetings-core/target/openmeetings-core-5.0.0-M4-SNAPSHOT.jar> to org.apache.openmeetings/openmeetings-core/5.0.0-M4-SNAPSHOT/openmeetings-core-5.0.0-M4-SNAPSHOT.jar
[JENKINS] Archiving <https://builds.apache.org/job/openmeetings/ws/openmeetings-core/target/openmeetings-core-5.0.0-M4-SNAPSHOT-tests.jar> to org.apache.openmeetings/openmeetings-core/5.0.0-M4-SNAPSHOT/openmeetings-core-5.0.0-M4-SNAPSHOT-tests.jar
[Fast Archiver] Compressed 184.35 KB of artifacts by 52.1% relative to #3031
Not sending mail to unregistered user noreply@github.com
Sending e-mails to: dev@openmeetings.apache.org
No mail will be sent out, as 'openmeetings » Openmeetings Screen Sharing applet #3032' does not have a result yet. Please make sure you set a proper result in case of pipeline/build scripts.
No mail will be sent out, as 'openmeetings » Openmeetings Util #3032' does not have a result yet. Please make sure you set a proper result in case of pipeline/build scripts.
No mail will be sent out, as 'openmeetings » Openmeetings Install #3032' does not have a result yet. Please make sure you set a proper result in case of pipeline/build scripts.
No mail will be sent out, as 'openmeetings » Openmeetings Service #3032' does not have a result yet. Please make sure you set a proper result in case of pipeline/build scripts.
No mail will be sent out, as 'openmeetings » Openmeetings #3032' does not have a result yet. Please make sure you set a proper result in case of pipeline/build scripts.
No mail will be sent out, as 'openmeetings » Openmeetings DB #3032' does not have a result yet. Please make sure you set a proper result in case of pipeline/build scripts.
No mail will be sent out, as 'openmeetings » Openmeetings Web #3032' does not have a result yet. Please make sure you set a proper result in case of pipeline/build scripts.
No mail will be sent out, as 'openmeetings » Openmeetings Webservices #3032' does not have a result yet. Please make sure you set a proper result in case of pipeline/build scripts.
No mail will be sent out, as 'openmeetings » Openmeetings Core #3032' does not have a result yet. Please make sure you set a proper result in case of pipeline/build scripts.
channel stopped
Archiving artifacts
Not sending mail to unregistered user noreply@github.com

Jenkins build is back to normal : openmeetings #3038

Posted by Apache Jenkins Server <je...@builds.apache.org>.
See <https://builds.apache.org/job/openmeetings/3038/display/redirect?page=changes>


Build failed in Jenkins: openmeetings #3037

Posted by Apache Jenkins Server <je...@builds.apache.org>.
See <https://builds.apache.org/job/openmeetings/3037/display/redirect?page=changes>

Changes:

[solomax666] no jira: site header improved


------------------------------------------
[...truncated 671.55 KB...]
/*!
^

[WARNING] 0 error(s), 2 warning(s)
[INFO] Uncompressed size: 175811 bytes.
[INFO] Compressed size: 70737 bytes minified (22999 bytes gzipped).
[INFO] 
[INFO] 
[INFO] --- minify-maven-plugin:1.7.6:minify (nettest-js) @ openmeetings-web ---
[INFO] Starting CSS task:
[INFO] Starting JavaScript task:
[INFO] Processing source file [raw-nettest.js].
[INFO] Processing source file [network.js].
[INFO] Creating the merged file [nettest.js].
[INFO] Creating the minified file [nettest.min.js].
[WARNING] nettest.js:209: WARNING - Parse error. illegal use of unknown JSDoc tag "callback"; ignoring it
 * @callback EventDispatcher~eventHandler
   ^

[WARNING] nettest.js:263: WARNING - Misplaced function annotation. This JSDoc is not attached to a function node. Are you missing parentheses?
    }, {
       ^

[WARNING] nettest.js:299: WARNING - Misplaced function annotation. This JSDoc is not attached to a function node. Are you missing parentheses?
    }, {
       ^

[WARNING] nettest.js:648: WARNING - Misplaced function annotation. This JSDoc is not attached to a function node. Are you missing parentheses?
    _createDecoratedClass(BandwidthModule, [{
    ^

[WARNING] nettest.js:696: WARNING - Misplaced function annotation. This JSDoc is not attached to a function node. Are you missing parentheses?
    }, {
       ^

[WARNING] nettest.js:710: WARNING - Misplaced function annotation. This JSDoc is not attached to a function node. Are you missing parentheses?
    }, {
       ^

[WARNING] nettest.js:766: WARNING - Misplaced function annotation. This JSDoc is not attached to a function node. Are you missing parentheses?
    }, {
       ^

[WARNING] nettest.js:779: WARNING - Misplaced function annotation. This JSDoc is not attached to a function node. Are you missing parentheses?
    }, {
       ^

[WARNING] nettest.js:1011: WARNING - Misplaced function annotation. This JSDoc is not attached to a function node. Are you missing parentheses?
    _createDecoratedClass(HttpModule, [{
    ^

[WARNING] nettest.js:1030: WARNING - Misplaced function annotation. This JSDoc is not attached to a function node. Are you missing parentheses?
    }, {
       ^

[WARNING] nettest.js:1043: WARNING - Misplaced function annotation. This JSDoc is not attached to a function node. Are you missing parentheses?
    }, {
       ^

[WARNING] nettest.js:1058: WARNING - Misplaced function annotation. This JSDoc is not attached to a function node. Are you missing parentheses?
    }, {
       ^

[WARNING] nettest.js:1167: WARNING - Misplaced function annotation. This JSDoc is not attached to a function node. Are you missing parentheses?
    }, {
       ^

[WARNING] nettest.js:1187: WARNING - Misplaced function annotation. This JSDoc is not attached to a function node. Are you missing parentheses?
    }, {
       ^

[WARNING] nettest.js:1204: WARNING - Misplaced function annotation. This JSDoc is not attached to a function node. Are you missing parentheses?
    }, {
       ^

[WARNING] nettest.js:1219: WARNING - Parse error. illegal use of unknown JSDoc tag "callback"; ignoring it
                     * @callback HttpModule~timingCallback
                       ^

[WARNING] nettest.js:1222: WARNING - Misplaced function annotation. This JSDoc is not attached to a function node. Are you missing parentheses?
                    callback(entries.length ? entries[0] : null);
                    ^

[WARNING] nettest.js:1236: WARNING - Misplaced function annotation. This JSDoc is not attached to a function node. Are you missing parentheses?
    }, {
       ^

[WARNING] nettest.js:1430: WARNING - Misplaced function annotation. This JSDoc is not attached to a function node. Are you missing parentheses?
    _createDecoratedClass(LatencyModule, [{
    ^

[WARNING] nettest.js:1450: WARNING - Misplaced function annotation. This JSDoc is not attached to a function node. Are you missing parentheses?
    }, {
       ^

[WARNING] nettest.js:1484: WARNING - Misplaced function annotation. This JSDoc is not attached to a function node. Are you missing parentheses?
    }, {
       ^

[WARNING] nettest.js:1523: WARNING - Misplaced function annotation. This JSDoc is not attached to a function node. Are you missing parentheses?
    }, {
       ^

[WARNING] nettest.js:1564: WARNING - Misplaced function annotation. This JSDoc is not attached to a function node. Are you missing parentheses?
    }, {
       ^

[WARNING] nettest.js:1615: WARNING - Misplaced function annotation. This JSDoc is not attached to a function node. Are you missing parentheses?
    }, {
       ^

[WARNING] nettest.js:1842: WARNING - Misplaced function annotation. This JSDoc is not attached to a function node. Are you missing parentheses?
    _createDecoratedClass(Network, [{
    ^

[WARNING] nettest.js:1898: WARNING - Misplaced function annotation. This JSDoc is not attached to a function node. Are you missing parentheses?
    }, {
       ^

[WARNING] nettest.js:1920: WARNING - Misplaced function annotation. This JSDoc is not attached to a function node. Are you missing parentheses?
    }, {
       ^

[WARNING] nettest.js:1926: WARNING - Parse error. illegal use of unknown JSDoc tag "callback"; ignoring it
             * @callback Network~moduleCallback
               ^

[WARNING] nettest.js:1940: WARNING - Misplaced function annotation. This JSDoc is not attached to a function node. Are you missing parentheses?
    }, {
       ^

[WARNING] nettest.js:2076: WARNING - Misplaced function annotation. This JSDoc is not attached to a function node. Are you missing parentheses?
    _createDecoratedClass(Timing, [{
    ^

[WARNING] nettest.js:2104: WARNING - Misplaced function annotation. This JSDoc is not attached to a function node. Are you missing parentheses?
    }, {
       ^

[WARNING] nettest.js:2138: WARNING - Parse error. illegal use of unknown JSDoc tag "callback"; ignoring it
 * @callback propertyDecorator
   ^

[WARNING] 0 error(s), 32 warning(s)
[INFO] Uncompressed size: 91963 bytes.
[INFO] Compressed size: 30381 bytes minified (7684 bytes gzipped).
[INFO] 
[INFO] 
[INFO] --- minify-maven-plugin:1.7.6:minify (chat-js) @ openmeetings-web ---
[INFO] Starting CSS task:
[INFO] Starting JavaScript task:
[INFO] Processing source file [raw-cssemoticons.js].
[INFO] Processing source file [raw-chat.js].
[INFO] Creating the merged file [chat.js].
[INFO] Creating the minified file [chat.min.js].
[INFO] Uncompressed size: 18802 bytes.
[INFO] Compressed size: 10829 bytes minified (4078 bytes gzipped).
[INFO] 
[INFO] 
[INFO] --- maven-compiler-plugin:3.8.1:compile (default-compile) @ openmeetings-web ---
[INFO] Changes detected - recompiling the module!
[INFO] Compiling 234 source files to <https://builds.apache.org/job/openmeetings/ws/openmeetings-web/target/classes>
[INFO] -------------------------------------------------------------
[ERROR] COMPILATION ERROR : 
[INFO] -------------------------------------------------------------
[ERROR] <https://builds.apache.org/job/openmeetings/ws/openmeetings-web/src/main/java/org/apache/openmeetings/web/app/Application.java>:[338,25] cannot find symbol
  symbol:   method getCspSettings()
  location: class org.apache.openmeetings.web.app.Application
[ERROR] <https://builds.apache.org/job/openmeetings/ws/openmeetings-web/src/main/java/org/apache/openmeetings/web/app/Application.java>:[378,24] cannot find symbol
  symbol:   method getCspSettings()
  location: class org.apache.openmeetings.web.app.Application
[INFO] 2 errors 
[INFO] -------------------------------------------------------------
[INFO] ------------------------------------------------------------------------
[INFO] Reactor Summary for Openmeetings 5.0.0-M4-SNAPSHOT:
[INFO] 
[INFO] Openmeetings ....................................... SUCCESS [01:15 min]
[INFO] Openmeetings Util .................................. SUCCESS [08:40 min]
[INFO] Openmeetings DB .................................... SUCCESS [05:03 min]
[INFO] Openmeetings Core .................................. SUCCESS [01:13 min]
[INFO] Openmeetings Install ............................... SUCCESS [ 36.840 s]
[INFO] Openmeetings Service ............................... SUCCESS [ 33.394 s]
[INFO] Openmeetings Webservices ........................... SUCCESS [01:36 min]
[INFO] Openmeetings Web ................................... FAILURE [09:44 min]
[INFO] Openmeetings Screen Sharing applet ................. SKIPPED
[INFO] Openmeetings Server ................................ SKIPPED
[INFO] ------------------------------------------------------------------------
[INFO] BUILD FAILURE
[INFO] ------------------------------------------------------------------------
[INFO] Total time:  29:23 min
[INFO] Finished at: 2020-03-12T09:16:06Z
[INFO] ------------------------------------------------------------------------
Waiting for Jenkins to finish collecting data
[ERROR] Failed to execute goal org.apache.maven.plugins:maven-compiler-plugin:3.8.1:compile (default-compile) on project openmeetings-web: Compilation failure: Compilation failure:
[ERROR] <https://builds.apache.org/job/openmeetings/ws/openmeetings-web/src/main/java/org/apache/openmeetings/web/app/Application.java>:[338,25] cannot find symbol
[ERROR] symbol:   method getCspSettings()
[ERROR] location: class org.apache.openmeetings.web.app.Application
[ERROR] <https://builds.apache.org/job/openmeetings/ws/openmeetings-web/src/main/java/org/apache/openmeetings/web/app/Application.java>:[378,24] cannot find symbol
[ERROR] symbol:   method getCspSettings()
[ERROR] location: class org.apache.openmeetings.web.app.Application
[ERROR] -> [Help 1]
[ERROR] 
[ERROR] To see the full stack trace of the errors, re-run Maven with the -e switch.
[ERROR] Re-run Maven using the -X switch to enable full debug logging.
[ERROR] 
[ERROR] For more information about the errors and possible solutions, please read the following articles:
[ERROR] [Help 1] http://cwiki.apache.org/confluence/display/MAVEN/MojoFailureException
[ERROR] 
[ERROR] After correcting the problems, you can resume the build with the command
[ERROR]   mvn <goals> -rf :openmeetings-web
[JENKINS] Archiving <https://builds.apache.org/job/openmeetings/ws/openmeetings-server/pom.xml> to org.apache.openmeetings/openmeetings-server/5.0.0-M4-SNAPSHOT/openmeetings-server-5.0.0-M4-SNAPSHOT.pom
[JENKINS] Archiving <https://builds.apache.org/job/openmeetings/ws/openmeetings-screenshare/pom.xml> to org.apache.openmeetings/openmeetings-screenshare/5.0.0-M4-SNAPSHOT/openmeetings-screenshare-5.0.0-M4-SNAPSHOT.pom
[JENKINS] Archiving <https://builds.apache.org/job/openmeetings/ws/openmeetings-util/pom.xml> to org.apache.openmeetings/openmeetings-util/5.0.0-M4-SNAPSHOT/openmeetings-util-5.0.0-M4-SNAPSHOT.pom
[JENKINS] Archiving <https://builds.apache.org/job/openmeetings/ws/openmeetings-util/target/openmeetings-util-5.0.0-M4-SNAPSHOT.jar> to org.apache.openmeetings/openmeetings-util/5.0.0-M4-SNAPSHOT/openmeetings-util-5.0.0-M4-SNAPSHOT.jar
[JENKINS] Archiving <https://builds.apache.org/job/openmeetings/ws/openmeetings-util/target/openmeetings-util-5.0.0-M4-SNAPSHOT-tests.jar> to org.apache.openmeetings/openmeetings-util/5.0.0-M4-SNAPSHOT/openmeetings-util-5.0.0-M4-SNAPSHOT-tests.jar
[JENKINS] Archiving <https://builds.apache.org/job/openmeetings/ws/openmeetings-install/pom.xml> to org.apache.openmeetings/openmeetings-install/5.0.0-M4-SNAPSHOT/openmeetings-install-5.0.0-M4-SNAPSHOT.pom
[JENKINS] Archiving <https://builds.apache.org/job/openmeetings/ws/openmeetings-install/target/openmeetings-install-5.0.0-M4-SNAPSHOT.jar> to org.apache.openmeetings/openmeetings-install/5.0.0-M4-SNAPSHOT/openmeetings-install-5.0.0-M4-SNAPSHOT.jar
[Fast Archiver] Compressed 107.95 KB of artifacts by 59.3% relative to #3036
[JENKINS] Archiving <https://builds.apache.org/job/openmeetings/ws/openmeetings-service/pom.xml> to org.apache.openmeetings/openmeetings-service/5.0.0-M4-SNAPSHOT/openmeetings-service-5.0.0-M4-SNAPSHOT.pom
[JENKINS] Archiving <https://builds.apache.org/job/openmeetings/ws/openmeetings-service/target/openmeetings-service-5.0.0-M4-SNAPSHOT.jar> to org.apache.openmeetings/openmeetings-service/5.0.0-M4-SNAPSHOT/openmeetings-service-5.0.0-M4-SNAPSHOT.jar
[Fast Archiver] Compressed 102.96 KB of artifacts by 31.1% relative to #3036
[JENKINS] Archiving <https://builds.apache.org/job/openmeetings/ws/pom.xml> to org.apache.openmeetings/openmeetings-parent/5.0.0-M4-SNAPSHOT/openmeetings-parent-5.0.0-M4-SNAPSHOT.pom
[JENKINS] Archiving <https://builds.apache.org/job/openmeetings/ws/target/openmeetings-parent-5.0.0-M4-SNAPSHOT-site.xml> to org.apache.openmeetings/openmeetings-parent/5.0.0-M4-SNAPSHOT/openmeetings-parent-5.0.0-M4-SNAPSHOT-site.xml
[JENKINS] Archiving <https://builds.apache.org/job/openmeetings/ws/openmeetings-db/pom.xml> to org.apache.openmeetings/openmeetings-db/5.0.0-M4-SNAPSHOT/openmeetings-db-5.0.0-M4-SNAPSHOT.pom
[JENKINS] Archiving <https://builds.apache.org/job/openmeetings/ws/openmeetings-db/target/openmeetings-db-5.0.0-M4-SNAPSHOT.jar> to org.apache.openmeetings/openmeetings-db/5.0.0-M4-SNAPSHOT/openmeetings-db-5.0.0-M4-SNAPSHOT.jar
[Fast Archiver] Compressed 434.87 KB of artifacts by 80.9% relative to #3036
[JENKINS] Archiving <https://builds.apache.org/job/openmeetings/ws/openmeetings-web/pom.xml> to org.apache.openmeetings/openmeetings-web/5.0.0-M4-SNAPSHOT/openmeetings-web-5.0.0-M4-SNAPSHOT.pom
[JENKINS] Archiving <https://builds.apache.org/job/openmeetings/ws/openmeetings-webservice/pom.xml> to org.apache.openmeetings/openmeetings-webservice/5.0.0-M4-SNAPSHOT/openmeetings-webservice-5.0.0-M4-SNAPSHOT.pom
[JENKINS] Archiving <https://builds.apache.org/job/openmeetings/ws/openmeetings-webservice/target/openmeetings-webservice-5.0.0-M4-SNAPSHOT.jar> to org.apache.openmeetings/openmeetings-webservice/5.0.0-M4-SNAPSHOT/openmeetings-webservice-5.0.0-M4-SNAPSHOT.jar
[Fast Archiver] Compressed 72.85 KB of artifacts by 43.9% relative to #3036
[JENKINS] Archiving <https://builds.apache.org/job/openmeetings/ws/openmeetings-core/pom.xml> to org.apache.openmeetings/openmeetings-core/5.0.0-M4-SNAPSHOT/openmeetings-core-5.0.0-M4-SNAPSHOT.pom
[JENKINS] Archiving <https://builds.apache.org/job/openmeetings/ws/openmeetings-core/target/openmeetings-core-5.0.0-M4-SNAPSHOT.jar> to org.apache.openmeetings/openmeetings-core/5.0.0-M4-SNAPSHOT/openmeetings-core-5.0.0-M4-SNAPSHOT.jar
[JENKINS] Archiving <https://builds.apache.org/job/openmeetings/ws/openmeetings-core/target/openmeetings-core-5.0.0-M4-SNAPSHOT-tests.jar> to org.apache.openmeetings/openmeetings-core/5.0.0-M4-SNAPSHOT/openmeetings-core-5.0.0-M4-SNAPSHOT-tests.jar
[Fast Archiver] Compressed 184.35 KB of artifacts by 52.1% relative to #3036
No mail will be sent out, as 'openmeetings » Openmeetings Server #3037' does not have a result yet. Please make sure you set a proper result in case of pipeline/build scripts.
No mail will be sent out, as 'openmeetings » Openmeetings Screen Sharing applet #3037' does not have a result yet. Please make sure you set a proper result in case of pipeline/build scripts.
No mail will be sent out, as 'openmeetings » Openmeetings Util #3037' does not have a result yet. Please make sure you set a proper result in case of pipeline/build scripts.
No mail will be sent out, as 'openmeetings » Openmeetings Install #3037' does not have a result yet. Please make sure you set a proper result in case of pipeline/build scripts.
No mail will be sent out, as 'openmeetings » Openmeetings Service #3037' does not have a result yet. Please make sure you set a proper result in case of pipeline/build scripts.
No mail will be sent out, as 'openmeetings » Openmeetings #3037' does not have a result yet. Please make sure you set a proper result in case of pipeline/build scripts.
No mail will be sent out, as 'openmeetings » Openmeetings DB #3037' does not have a result yet. Please make sure you set a proper result in case of pipeline/build scripts.
Not sending mail to unregistered user solomax666@gmail.com
Sending e-mails to: dev@openmeetings.apache.org
No mail will be sent out, as 'openmeetings » Openmeetings Webservices #3037' does not have a result yet. Please make sure you set a proper result in case of pipeline/build scripts.
No mail will be sent out, as 'openmeetings » Openmeetings Core #3037' does not have a result yet. Please make sure you set a proper result in case of pipeline/build scripts.
channel stopped
Archiving artifacts
Not sending mail to unregistered user noreply@github.com
Not sending mail to unregistered user solomax666@gmail.com

Build failed in Jenkins: openmeetings #3036

Posted by Apache Jenkins Server <je...@builds.apache.org>.
See <https://builds.apache.org/job/openmeetings/3036/display/redirect?page=changes>

Changes:

[solomax666] [OPENMEETINGS-2165] zoom bar


------------------------------------------
[...truncated 799.32 KB...]
^

[WARNING] 0 error(s), 2 warning(s)
[INFO] Uncompressed size: 175811 bytes.
[INFO] Compressed size: 70737 bytes minified (22999 bytes gzipped).
[INFO] 
[INFO] 
[INFO] --- minify-maven-plugin:1.7.6:minify (nettest-js) @ openmeetings-web ---
[INFO] Starting CSS task:
[INFO] Starting JavaScript task:
[INFO] Processing source file [raw-nettest.js].
[INFO] Processing source file [network.js].
[INFO] Creating the merged file [nettest.js].
[INFO] Creating the minified file [nettest.min.js].
[WARNING] nettest.js:209: WARNING - Parse error. illegal use of unknown JSDoc tag "callback"; ignoring it
 * @callback EventDispatcher~eventHandler
   ^

[WARNING] nettest.js:263: WARNING - Misplaced function annotation. This JSDoc is not attached to a function node. Are you missing parentheses?
    }, {
       ^

[WARNING] nettest.js:299: WARNING - Misplaced function annotation. This JSDoc is not attached to a function node. Are you missing parentheses?
    }, {
       ^

[WARNING] nettest.js:648: WARNING - Misplaced function annotation. This JSDoc is not attached to a function node. Are you missing parentheses?
    _createDecoratedClass(BandwidthModule, [{
    ^

[WARNING] nettest.js:696: WARNING - Misplaced function annotation. This JSDoc is not attached to a function node. Are you missing parentheses?
    }, {
       ^

[WARNING] nettest.js:710: WARNING - Misplaced function annotation. This JSDoc is not attached to a function node. Are you missing parentheses?
    }, {
       ^

[WARNING] nettest.js:766: WARNING - Misplaced function annotation. This JSDoc is not attached to a function node. Are you missing parentheses?
    }, {
       ^

[WARNING] nettest.js:779: WARNING - Misplaced function annotation. This JSDoc is not attached to a function node. Are you missing parentheses?
    }, {
       ^

[WARNING] nettest.js:1011: WARNING - Misplaced function annotation. This JSDoc is not attached to a function node. Are you missing parentheses?
    _createDecoratedClass(HttpModule, [{
    ^

[WARNING] nettest.js:1030: WARNING - Misplaced function annotation. This JSDoc is not attached to a function node. Are you missing parentheses?
    }, {
       ^

[WARNING] nettest.js:1043: WARNING - Misplaced function annotation. This JSDoc is not attached to a function node. Are you missing parentheses?
    }, {
       ^

[WARNING] nettest.js:1058: WARNING - Misplaced function annotation. This JSDoc is not attached to a function node. Are you missing parentheses?
    }, {
       ^

[WARNING] nettest.js:1167: WARNING - Misplaced function annotation. This JSDoc is not attached to a function node. Are you missing parentheses?
    }, {
       ^

[WARNING] nettest.js:1187: WARNING - Misplaced function annotation. This JSDoc is not attached to a function node. Are you missing parentheses?
    }, {
       ^

[WARNING] nettest.js:1204: WARNING - Misplaced function annotation. This JSDoc is not attached to a function node. Are you missing parentheses?
    }, {
       ^

[WARNING] nettest.js:1219: WARNING - Parse error. illegal use of unknown JSDoc tag "callback"; ignoring it
                     * @callback HttpModule~timingCallback
                       ^

[WARNING] nettest.js:1222: WARNING - Misplaced function annotation. This JSDoc is not attached to a function node. Are you missing parentheses?
                    callback(entries.length ? entries[0] : null);
                    ^

[WARNING] nettest.js:1236: WARNING - Misplaced function annotation. This JSDoc is not attached to a function node. Are you missing parentheses?
    }, {
       ^

[WARNING] nettest.js:1430: WARNING - Misplaced function annotation. This JSDoc is not attached to a function node. Are you missing parentheses?
    _createDecoratedClass(LatencyModule, [{
    ^

[WARNING] nettest.js:1450: WARNING - Misplaced function annotation. This JSDoc is not attached to a function node. Are you missing parentheses?
    }, {
       ^

[WARNING] nettest.js:1484: WARNING - Misplaced function annotation. This JSDoc is not attached to a function node. Are you missing parentheses?
    }, {
       ^

[WARNING] nettest.js:1523: WARNING - Misplaced function annotation. This JSDoc is not attached to a function node. Are you missing parentheses?
    }, {
       ^

[WARNING] nettest.js:1564: WARNING - Misplaced function annotation. This JSDoc is not attached to a function node. Are you missing parentheses?
    }, {
       ^

[WARNING] nettest.js:1615: WARNING - Misplaced function annotation. This JSDoc is not attached to a function node. Are you missing parentheses?
    }, {
       ^

[WARNING] nettest.js:1842: WARNING - Misplaced function annotation. This JSDoc is not attached to a function node. Are you missing parentheses?
    _createDecoratedClass(Network, [{
    ^

[WARNING] nettest.js:1898: WARNING - Misplaced function annotation. This JSDoc is not attached to a function node. Are you missing parentheses?
    }, {
       ^

[WARNING] nettest.js:1920: WARNING - Misplaced function annotation. This JSDoc is not attached to a function node. Are you missing parentheses?
    }, {
       ^

[WARNING] nettest.js:1926: WARNING - Parse error. illegal use of unknown JSDoc tag "callback"; ignoring it
             * @callback Network~moduleCallback
               ^

[WARNING] nettest.js:1940: WARNING - Misplaced function annotation. This JSDoc is not attached to a function node. Are you missing parentheses?
    }, {
       ^

[WARNING] nettest.js:2076: WARNING - Misplaced function annotation. This JSDoc is not attached to a function node. Are you missing parentheses?
    _createDecoratedClass(Timing, [{
    ^

[WARNING] nettest.js:2104: WARNING - Misplaced function annotation. This JSDoc is not attached to a function node. Are you missing parentheses?
    }, {
       ^

[WARNING] nettest.js:2138: WARNING - Parse error. illegal use of unknown JSDoc tag "callback"; ignoring it
 * @callback propertyDecorator
   ^

[WARNING] 0 error(s), 32 warning(s)
[INFO] Uncompressed size: 91963 bytes.
[INFO] Compressed size: 30381 bytes minified (7684 bytes gzipped).
[INFO] 
[INFO] 
[INFO] --- minify-maven-plugin:1.7.6:minify (chat-js) @ openmeetings-web ---
[INFO] Starting CSS task:
[INFO] Starting JavaScript task:
[INFO] Processing source file [raw-cssemoticons.js].
[INFO] Processing source file [raw-chat.js].
[INFO] Creating the merged file [chat.js].
[INFO] Creating the minified file [chat.min.js].
[INFO] Uncompressed size: 18802 bytes.
[INFO] Compressed size: 10829 bytes minified (4078 bytes gzipped).
[INFO] 
[INFO] 
[INFO] --- maven-compiler-plugin:3.8.1:compile (default-compile) @ openmeetings-web ---
[INFO] Changes detected - recompiling the module!
[INFO] Compiling 234 source files to <https://builds.apache.org/job/openmeetings/ws/openmeetings-web/target/classes>
[INFO] -------------------------------------------------------------
[ERROR] COMPILATION ERROR : 
[INFO] -------------------------------------------------------------
[ERROR] <https://builds.apache.org/job/openmeetings/ws/openmeetings-web/src/main/java/org/apache/openmeetings/web/app/Application.java>:[338,25] cannot find symbol
  symbol:   method getCspSettings()
  location: class org.apache.openmeetings.web.app.Application
[ERROR] <https://builds.apache.org/job/openmeetings/ws/openmeetings-web/src/main/java/org/apache/openmeetings/web/app/Application.java>:[378,24] cannot find symbol
  symbol:   method getCspSettings()
  location: class org.apache.openmeetings.web.app.Application
[INFO] 2 errors 
[INFO] -------------------------------------------------------------
[INFO] ------------------------------------------------------------------------
[INFO] Reactor Summary for Openmeetings 5.0.0-M4-SNAPSHOT:
[INFO] 
[INFO] Openmeetings ....................................... SUCCESS [01:48 min]
[INFO] Openmeetings Util .................................. SUCCESS [08:57 min]
[INFO] Openmeetings DB .................................... SUCCESS [05:09 min]
[INFO] Openmeetings Core .................................. SUCCESS [01:29 min]
[INFO] Openmeetings Install ............................... SUCCESS [ 36.069 s]
[INFO] Openmeetings Service ............................... SUCCESS [ 33.465 s]
[INFO] Openmeetings Webservices ........................... SUCCESS [05:08 min]
[INFO] Openmeetings Web ................................... FAILURE [09:52 min]
[INFO] Openmeetings Screen Sharing applet ................. SKIPPED
[INFO] Openmeetings Server ................................ SKIPPED
[INFO] ------------------------------------------------------------------------
[INFO] BUILD FAILURE
[INFO] ------------------------------------------------------------------------
[INFO] Total time:  34:16 min
[INFO] Finished at: 2020-03-12T06:20:53Z
[INFO] ------------------------------------------------------------------------
Waiting for Jenkins to finish collecting data
[ERROR] Failed to execute goal org.apache.maven.plugins:maven-compiler-plugin:3.8.1:compile (default-compile) on project openmeetings-web: Compilation failure: Compilation failure:
[ERROR] <https://builds.apache.org/job/openmeetings/ws/openmeetings-web/src/main/java/org/apache/openmeetings/web/app/Application.java>:[338,25] cannot find symbol
[ERROR] symbol:   method getCspSettings()
[ERROR] location: class org.apache.openmeetings.web.app.Application
[ERROR] <https://builds.apache.org/job/openmeetings/ws/openmeetings-web/src/main/java/org/apache/openmeetings/web/app/Application.java>:[378,24] cannot find symbol
[ERROR] symbol:   method getCspSettings()
[ERROR] location: class org.apache.openmeetings.web.app.Application
[ERROR] -> [Help 1]
[ERROR] 
[ERROR] To see the full stack trace of the errors, re-run Maven with the -e switch.
[ERROR] Re-run Maven using the -X switch to enable full debug logging.
[ERROR] 
[ERROR] For more information about the errors and possible solutions, please read the following articles:
[ERROR] [Help 1] http://cwiki.apache.org/confluence/display/MAVEN/MojoFailureException
[ERROR] 
[ERROR] After correcting the problems, you can resume the build with the command
[ERROR]   mvn <goals> -rf :openmeetings-web
[JENKINS] Archiving <https://builds.apache.org/job/openmeetings/ws/openmeetings-server/pom.xml> to org.apache.openmeetings/openmeetings-server/5.0.0-M4-SNAPSHOT/openmeetings-server-5.0.0-M4-SNAPSHOT.pom
[JENKINS] Archiving <https://builds.apache.org/job/openmeetings/ws/openmeetings-screenshare/pom.xml> to org.apache.openmeetings/openmeetings-screenshare/5.0.0-M4-SNAPSHOT/openmeetings-screenshare-5.0.0-M4-SNAPSHOT.pom
[JENKINS] Archiving <https://builds.apache.org/job/openmeetings/ws/openmeetings-util/pom.xml> to org.apache.openmeetings/openmeetings-util/5.0.0-M4-SNAPSHOT/openmeetings-util-5.0.0-M4-SNAPSHOT.pom
[JENKINS] Archiving <https://builds.apache.org/job/openmeetings/ws/openmeetings-util/target/openmeetings-util-5.0.0-M4-SNAPSHOT.jar> to org.apache.openmeetings/openmeetings-util/5.0.0-M4-SNAPSHOT/openmeetings-util-5.0.0-M4-SNAPSHOT.jar
[JENKINS] Archiving <https://builds.apache.org/job/openmeetings/ws/openmeetings-util/target/openmeetings-util-5.0.0-M4-SNAPSHOT-tests.jar> to org.apache.openmeetings/openmeetings-util/5.0.0-M4-SNAPSHOT/openmeetings-util-5.0.0-M4-SNAPSHOT-tests.jar
[JENKINS] Archiving <https://builds.apache.org/job/openmeetings/ws/openmeetings-install/pom.xml> to org.apache.openmeetings/openmeetings-install/5.0.0-M4-SNAPSHOT/openmeetings-install-5.0.0-M4-SNAPSHOT.pom
[JENKINS] Archiving <https://builds.apache.org/job/openmeetings/ws/openmeetings-install/target/openmeetings-install-5.0.0-M4-SNAPSHOT.jar> to org.apache.openmeetings/openmeetings-install/5.0.0-M4-SNAPSHOT/openmeetings-install-5.0.0-M4-SNAPSHOT.jar
[Fast Archiver] Compressed 107.95 KB of artifacts by 59.3% relative to #3035
[JENKINS] Archiving <https://builds.apache.org/job/openmeetings/ws/openmeetings-service/pom.xml> to org.apache.openmeetings/openmeetings-service/5.0.0-M4-SNAPSHOT/openmeetings-service-5.0.0-M4-SNAPSHOT.pom
[JENKINS] Archiving <https://builds.apache.org/job/openmeetings/ws/openmeetings-service/target/openmeetings-service-5.0.0-M4-SNAPSHOT.jar> to org.apache.openmeetings/openmeetings-service/5.0.0-M4-SNAPSHOT/openmeetings-service-5.0.0-M4-SNAPSHOT.jar
[Fast Archiver] Compressed 102.96 KB of artifacts by 31.1% relative to #3035
[JENKINS] Archiving <https://builds.apache.org/job/openmeetings/ws/pom.xml> to org.apache.openmeetings/openmeetings-parent/5.0.0-M4-SNAPSHOT/openmeetings-parent-5.0.0-M4-SNAPSHOT.pom
[JENKINS] Archiving <https://builds.apache.org/job/openmeetings/ws/target/openmeetings-parent-5.0.0-M4-SNAPSHOT-site.xml> to org.apache.openmeetings/openmeetings-parent/5.0.0-M4-SNAPSHOT/openmeetings-parent-5.0.0-M4-SNAPSHOT-site.xml
[Fast Archiver] Compressed 51.09 KB of artifacts by 62.6% relative to #3035
[JENKINS] Archiving <https://builds.apache.org/job/openmeetings/ws/openmeetings-db/pom.xml> to org.apache.openmeetings/openmeetings-db/5.0.0-M4-SNAPSHOT/openmeetings-db-5.0.0-M4-SNAPSHOT.pom
[JENKINS] Archiving <https://builds.apache.org/job/openmeetings/ws/openmeetings-db/target/openmeetings-db-5.0.0-M4-SNAPSHOT.jar> to org.apache.openmeetings/openmeetings-db/5.0.0-M4-SNAPSHOT/openmeetings-db-5.0.0-M4-SNAPSHOT.jar
[Fast Archiver] Compressed 434.87 KB of artifacts by 80.9% relative to #3035
[JENKINS] Archiving <https://builds.apache.org/job/openmeetings/ws/openmeetings-web/pom.xml> to org.apache.openmeetings/openmeetings-web/5.0.0-M4-SNAPSHOT/openmeetings-web-5.0.0-M4-SNAPSHOT.pom
[JENKINS] Archiving <https://builds.apache.org/job/openmeetings/ws/openmeetings-webservice/pom.xml> to org.apache.openmeetings/openmeetings-webservice/5.0.0-M4-SNAPSHOT/openmeetings-webservice-5.0.0-M4-SNAPSHOT.pom
[JENKINS] Archiving <https://builds.apache.org/job/openmeetings/ws/openmeetings-webservice/target/openmeetings-webservice-5.0.0-M4-SNAPSHOT.jar> to org.apache.openmeetings/openmeetings-webservice/5.0.0-M4-SNAPSHOT/openmeetings-webservice-5.0.0-M4-SNAPSHOT.jar
[Fast Archiver] Compressed 72.85 KB of artifacts by 43.9% relative to #3035
[JENKINS] Archiving <https://builds.apache.org/job/openmeetings/ws/openmeetings-core/pom.xml> to org.apache.openmeetings/openmeetings-core/5.0.0-M4-SNAPSHOT/openmeetings-core-5.0.0-M4-SNAPSHOT.pom
[JENKINS] Archiving <https://builds.apache.org/job/openmeetings/ws/openmeetings-core/target/openmeetings-core-5.0.0-M4-SNAPSHOT.jar> to org.apache.openmeetings/openmeetings-core/5.0.0-M4-SNAPSHOT/openmeetings-core-5.0.0-M4-SNAPSHOT.jar
[JENKINS] Archiving <https://builds.apache.org/job/openmeetings/ws/openmeetings-core/target/openmeetings-core-5.0.0-M4-SNAPSHOT-tests.jar> to org.apache.openmeetings/openmeetings-core/5.0.0-M4-SNAPSHOT/openmeetings-core-5.0.0-M4-SNAPSHOT-tests.jar
[Fast Archiver] Compressed 184.35 KB of artifacts by 52.1% relative to #3035
No mail will be sent out, as 'openmeetings » Openmeetings Server #3036' does not have a result yet. Please make sure you set a proper result in case of pipeline/build scripts.
No mail will be sent out, as 'openmeetings » Openmeetings Screen Sharing applet #3036' does not have a result yet. Please make sure you set a proper result in case of pipeline/build scripts.
No mail will be sent out, as 'openmeetings » Openmeetings Util #3036' does not have a result yet. Please make sure you set a proper result in case of pipeline/build scripts.
No mail will be sent out, as 'openmeetings » Openmeetings Install #3036' does not have a result yet. Please make sure you set a proper result in case of pipeline/build scripts.
No mail will be sent out, as 'openmeetings » Openmeetings Service #3036' does not have a result yet. Please make sure you set a proper result in case of pipeline/build scripts.
No mail will be sent out, as 'openmeetings » Openmeetings #3036' does not have a result yet. Please make sure you set a proper result in case of pipeline/build scripts.
No mail will be sent out, as 'openmeetings » Openmeetings DB #3036' does not have a result yet. Please make sure you set a proper result in case of pipeline/build scripts.
Not sending mail to unregistered user solomax666@gmail.com
Sending e-mails to: dev@openmeetings.apache.org
No mail will be sent out, as 'openmeetings » Openmeetings Webservices #3036' does not have a result yet. Please make sure you set a proper result in case of pipeline/build scripts.
No mail will be sent out, as 'openmeetings » Openmeetings Core #3036' does not have a result yet. Please make sure you set a proper result in case of pipeline/build scripts.
channel stopped
Archiving artifacts
Not sending mail to unregistered user noreply@github.com
Not sending mail to unregistered user solomax666@gmail.com

Jenkins build is unstable: openmeetings #3035

Posted by Apache Jenkins Server <je...@builds.apache.org>.
See <https://builds.apache.org/job/openmeetings/3035/display/redirect?page=changes>


Build failed in Jenkins: openmeetings #3034

Posted by Apache Jenkins Server <je...@builds.apache.org>.
See <https://builds.apache.org/job/openmeetings/3034/display/redirect?page=changes>

Changes:

[solomax666] no jira: maven-site-plugin version updated, build will fail until 3.9.0


------------------------------------------
[...truncated 3.26 MB...]
[INFO] 
[INFO] --- maven-remote-resources-plugin:1.6.0:process (process-resource-bundles) @ openmeetings-screenshare ---
[INFO] Preparing remote bundle org.apache:apache-jar-resource-bundle:1.4
[INFO] Copying 3 resources from 1 bundle.
[INFO] 
[INFO] --- maven-site-plugin:3.8.2:site (generate-site) @ openmeetings-screenshare ---
[INFO] configuring report plugin org.apache.maven.plugins:maven-project-info-reports-plugin:3.0.0
[INFO] 14 reports configured for maven-project-info-reports-plugin:3.0.0: index, ci-management, dependencies, dependency-convergence, dependency-management, distribution-management, issue-management, licenses, mailing-lists, plugin-management, plugins, team, scm, summary
[INFO] configuring report plugin org.apache.maven.plugins:maven-surefire-report-plugin:3.0.0-M4
[INFO] 1 report configured for maven-surefire-report-plugin:3.0.0-M4: report-only
[INFO] configuring report plugin org.apache.rat:apache-rat-plugin:0.13
[INFO] 1 report configured for apache-rat-plugin:0.13: rat
[INFO] Rendering site with default locale English (en)
[INFO] Relativizing decoration links with respect to localized project URL: https://openmeetings.apache.org/openmeetings-screenshare
[INFO] Rendering content with io.github.devacfr.maven.skins:reflow-maven-skin:jar:2.3.0 skin.
[INFO] Generating "About" report                --- maven-project-info-reports-plugin:3.0.0:index
[INFO] Generating "CI Management" report        --- maven-project-info-reports-plugin:3.0.0:ci-management
[INFO] Generating "Dependencies" report         --- maven-project-info-reports-plugin:3.0.0:dependencies
[INFO] Generating "Dependency Convergence" report --- maven-project-info-reports-plugin:3.0.0:dependency-convergence
[INFO] Generating "Dependency Management" report --- maven-project-info-reports-plugin:3.0.0:dependency-management
[INFO] Generating "Distribution Management" report --- maven-project-info-reports-plugin:3.0.0:distribution-management
[INFO] Generating "Issue Management" report     --- maven-project-info-reports-plugin:3.0.0:issue-management
[INFO] Generating "Licenses" report             --- maven-project-info-reports-plugin:3.0.0:licenses
[INFO] Generating "Mailing Lists" report        --- maven-project-info-reports-plugin:3.0.0:mailing-lists
[INFO] Generating "Plugin Management" report    --- maven-project-info-reports-plugin:3.0.0:plugin-management
[INFO] Generating "Plugins" report              --- maven-project-info-reports-plugin:3.0.0:plugins
[INFO] Generating "Team" report                 --- maven-project-info-reports-plugin:3.0.0:team
[INFO] Generating "Source Code Management" report --- maven-project-info-reports-plugin:3.0.0:scm
[INFO] Generating "Summary" report              --- maven-project-info-reports-plugin:3.0.0:summary
[INFO] Generating "Surefire Report" report      --- maven-surefire-report-plugin:3.0.0-M4:report-only
[WARNING] Unable to locate Test Source XRef to link to - DISABLED
[INFO] Generating "Rat Report" report           --- apache-rat-plugin:0.13:rat
[INFO] Added 1 additional default licenses.
[INFO] Enabled default license matchers.
[INFO] Added 1 custom approved licenses.
[INFO] Will parse SCM ignores for exclusions...
[INFO] Finished adding exclusions from SCM ignore files.
[INFO] 62 implicit excludes (use -debug for more details).
[INFO] 2 explicit excludes (use -debug for more details).
[INFO] 46 resources included (use -debug for more details)
[JENKINS] Archiving site from <https://builds.apache.org/job/openmeetings/ws/openmeetings-screenshare/target/site> to /x1/jenkins/jenkins-home/jobs/openmeetings/site/openmeetings-screenshare
[INFO] 
[INFO] --- maven-resources-plugin:3.1.0:copy-resources (create-template) @ openmeetings-screenshare ---
[INFO] Using 'UTF-8' encoding to copy filtered resources.
[INFO] Copying 1 resource
[INFO] 
[INFO] --- maven-resources-plugin:3.1.0:copy-resources (copy-icons) @ openmeetings-screenshare ---
[INFO] Using 'UTF-8' encoding to copy filtered resources.
[INFO] Copying 2 resources
[INFO] 
[INFO] --- maven-antrun-plugin:1.8:run (default) @ openmeetings-screenshare ---
[INFO] Executing tasks

main:
     [copy] Copying 1 file to <https://builds.apache.org/job/openmeetings/ws/openmeetings-screenshare/target/jnlp>
[INFO] Executed tasks
[INFO] 
[INFO] --- keytool-maven-plugin:1.5:generateKeyPair (default) @ openmeetings-screenshare ---
[INFO] 
[INFO] --- maven-resources-plugin:3.1.0:resources (default-resources) @ openmeetings-screenshare ---
[INFO] Using 'UTF-8' encoding to copy filtered resources.
[INFO] Copying 8 resources
[INFO] Copying 3 resources
[INFO] 
[INFO] --- maven-compiler-plugin:3.8.1:compile (default-compile) @ openmeetings-screenshare ---
[INFO] Changes detected - recompiling the module!
[INFO] Compiling 30 source files to <https://builds.apache.org/job/openmeetings/ws/openmeetings-screenshare/target/classes>
[INFO] 
[INFO] --- maven-resources-plugin:3.1.0:testResources (default-testResources) @ openmeetings-screenshare ---
[INFO] Using 'UTF-8' encoding to copy filtered resources.
[INFO] skip non existing resourceDirectory <https://builds.apache.org/job/openmeetings/ws/openmeetings-screenshare/src/test/resources>
[INFO] Copying 3 resources
[INFO] 
[INFO] --- maven-compiler-plugin:3.8.1:testCompile (default-testCompile) @ openmeetings-screenshare ---
[INFO] No sources to compile
[INFO] 
[INFO] --- maven-surefire-plugin:3.0.0-M4:test (default-test) @ openmeetings-screenshare ---
[JENKINS] Recording test results[INFO] 

[INFO] --- maven-dependency-plugin:3.1.1:copy-dependencies (copy-bcprov) @ openmeetings-screenshare ---
[INFO] Copying bcprov-jdk15on-1.64.jar to <https://builds.apache.org/job/openmeetings/ws/openmeetings-screenshare/target/jnlp/bcprov-jdk15on-1.64.jar>
[INFO] 
[INFO] --- maven-jar-plugin:3.2.0:jar (default-jar) @ openmeetings-screenshare ---
[INFO] Building jar: <https://builds.apache.org/job/openmeetings/ws/openmeetings-screenshare/target/openmeetings-screenshare-5.0.0-M4-SNAPSHOT.jar>
[INFO] 
[INFO] --- maven-site-plugin:3.8.2:attach-descriptor (attach-descriptor) @ openmeetings-screenshare ---
[INFO] Skipping because packaging 'jar' is not pom.
[INFO] 
[INFO] --- maven-assembly-plugin:3.2.0:single (make-screen-sharing) @ openmeetings-screenshare ---
[INFO] Reading assembly descriptor: src/main/assembly/assembly.xml
[WARNING] The following patterns were never triggered in this artifact inclusion filter:
o  'net.sf.ehcache:ehcache-core'
o  'org.slf4j:jcl-over-slf4j'

[INFO] Building jar: <https://builds.apache.org/job/openmeetings/ws/openmeetings-screenshare/target/jnlp/openmeetings-screenshare-5.0.0-M4-SNAPSHOT-full.jar>
[INFO] 
[INFO] --- maven-jarsigner-plugin:3.0.0:sign (sign-applet) @ openmeetings-screenshare ---
[INFO] 4 archive(s) processed
[INFO] 
[INFO] --- forbiddenapis:2.7:check (forbiddenapis) @ openmeetings-screenshare ---
[INFO] Scanning for classes to check...
[INFO] Reading bundled API signatures: jdk-deprecated-1.7
[INFO] Reading bundled API signatures: jdk-non-portable
[INFO] Reading inline API signatures...
[INFO] Loading classes to check...
[INFO] Scanning classes for violations...
[INFO] Scanned 41 class file(s) for forbidden API invocations (in 0.11s), 0 error(s).
[INFO] 
[INFO] --- forbiddenapis:2.7:testCheck (forbiddenapis) @ openmeetings-screenshare ---
[INFO] Scanning for classes to check...
[WARNING] No classes found in '<https://builds.apache.org/job/openmeetings/ws/openmeetings-screenshare/target/test-classes'> (includes=[**/*.class], excludes=null), forbiddenapis check skipped.
[INFO] 
[INFO] --- maven-install-plugin:2.5.2:install (default-install) @ openmeetings-screenshare ---
[INFO] Installing <https://builds.apache.org/job/openmeetings/ws/openmeetings-screenshare/target/openmeetings-screenshare-5.0.0-M4-SNAPSHOT.jar> to /home/jenkins/jenkins-slave/maven-repositories/0/org/apache/openmeetings/openmeetings-screenshare/5.0.0-M4-SNAPSHOT/openmeetings-screenshare-5.0.0-M4-SNAPSHOT.jar
[INFO] Installing <https://builds.apache.org/job/openmeetings/ws/openmeetings-screenshare/pom.xml> to /home/jenkins/jenkins-slave/maven-repositories/0/org/apache/openmeetings/openmeetings-screenshare/5.0.0-M4-SNAPSHOT/openmeetings-screenshare-5.0.0-M4-SNAPSHOT.pom
[INFO] Installing <https://builds.apache.org/job/openmeetings/ws/openmeetings-screenshare/target/jnlp/openmeetings-screenshare-5.0.0-M4-SNAPSHOT-full.jar> to /home/jenkins/jenkins-slave/maven-repositories/0/org/apache/openmeetings/openmeetings-screenshare/5.0.0-M4-SNAPSHOT/openmeetings-screenshare-5.0.0-M4-SNAPSHOT-full.jar
[INFO] 
[INFO] ------------< org.apache.openmeetings:openmeetings-server >-------------
[INFO] Building Openmeetings Server 5.0.0-M4-SNAPSHOT                   [10/10]
[INFO] --------------------------------[ jar ]---------------------------------
[INFO] 
[INFO] --- maven-clean-plugin:3.1.0:clean (default-clean) @ openmeetings-server ---
[INFO] 
[INFO] --- buildnumber-maven-plugin:1.4:create (default) @ openmeetings-server ---
[INFO] 
[INFO] --- apache-rat-plugin:0.13:check (default) @ openmeetings-server ---
[INFO] Added 1 additional default licenses.
[INFO] Enabled default license matchers.
[INFO] Added 1 custom approved licenses.
[INFO] Will parse SCM ignores for exclusions...
[INFO] Finished adding exclusions from SCM ignore files.
[INFO] 62 implicit excludes (use -debug for more details).
[INFO] 2 explicit excludes (use -debug for more details).
[INFO] 173 resources included (use -debug for more details)
[INFO] Rat check: Summary over all files. Unapproved: 0, unknown: 0, generated: 0, approved: 91 licenses.
[INFO] 
[INFO] --- maven-enforcer-plugin:3.0.0-M3:enforce (enforce-versions) @ openmeetings-server ---
[INFO] 
[INFO] --- maven-enforcer-plugin:3.0.0-M3:enforce (enforce-maven-version) @ openmeetings-server ---
[INFO] 
[INFO] --- jacoco-maven-plugin:0.8.5:prepare-agent (prepare-agent) @ openmeetings-server ---
[INFO] argLine set to -javaagent:/home/jenkins/jenkins-slave/maven-repositories/0/org/jacoco/org.jacoco.agent/0.8.5/org.jacoco.agent-0.8.5-runtime.jar=destfile=<https://builds.apache.org/job/openmeetings/ws/openmeetings-server/../target/jacoco.exec,append=true>
[INFO] 
[INFO] --- exec-maven-plugin:1.6.0:java (generate-configs-xml-build) @ openmeetings-server ---
[INFO] 
[INFO] --- xml-maven-plugin:1.0.2:transform (generate-doc-build) @ openmeetings-server ---
[INFO] Transforming file: <https://builds.apache.org/job/openmeetings/ws/openmeetings-server/src/site/stylesheets/errorvalues.xml>
[INFO] Transformed 1 file(s).
[INFO] Transforming file: <https://builds.apache.org/job/openmeetings/ws/openmeetings-server/target/generated-sources/GeneralConfiguration.xml>
[INFO] Transformed 1 file(s).
[INFO] 
[INFO] --- maven-dependency-plugin:3.1.1:unpack (unpack-css-js) @ openmeetings-server ---
[INFO] Configured Artifact: io.github.devacfr.maven.skins:reflow-default-webdeps:2.3.0:jar
[WARNING] The POM for io.github.devacfr.maven.skins:reflow-default-webdeps:jar:2.3.0 is invalid, transitive dependencies (if any) will not be available, enable debug logging for more details
[INFO] Unpacking /home/jenkins/jenkins-slave/maven-repositories/0/io/github/devacfr/maven/skins/reflow-default-webdeps/2.3.0/reflow-default-webdeps-2.3.0.jar to <https://builds.apache.org/job/openmeetings/ws/openmeetings-server/target/site> with includes "**/css/*.css,**/css/themes/cerulean/*.css,**/css/fontawesome/**,**/js/*.js,**/js/styles/github*.css" and excludes ""
[INFO] 
[INFO] --- maven-remote-resources-plugin:1.6.0:process (process-resource-bundles) @ openmeetings-server ---
[INFO] Preparing remote bundle org.apache:apache-jar-resource-bundle:1.4
[INFO] Copying 3 resources from 1 bundle.
[INFO] 
[INFO] --- maven-site-plugin:3.8.2:site (generate-site) @ openmeetings-server ---
[INFO] configuring report plugin org.apache.maven.plugins:maven-project-info-reports-plugin:3.0.0
[INFO] 14 reports configured for maven-project-info-reports-plugin:3.0.0: index, ci-management, dependencies, dependency-convergence, dependency-management, distribution-management, issue-management, licenses, mailing-lists, plugin-management, plugins, team, scm, summary
[INFO] configuring report plugin org.apache.maven.plugins:maven-surefire-report-plugin:3.0.0-M4
[INFO] 1 report configured for maven-surefire-report-plugin:3.0.0-M4: report-only
[INFO] configuring report plugin org.apache.rat:apache-rat-plugin:0.13
[INFO] 1 report configured for apache-rat-plugin:0.13: rat
[INFO] Rendering site with default locale English (en)
[INFO] Relativizing decoration links with respect to localized project URL: https://openmeetings.apache.org
[INFO] Rendering content with io.github.devacfr.maven.skins:reflow-maven-skin:jar:2.3.0 skin.
[INFO] Skipped "About" report (maven-project-info-reports-plugin:3.0.0:index), file "index.html" already exists.
[INFO] Rendering 65 Doxia documents: 5 markdown, 60 xdoc
[JENKINS] Archiving site from <https://builds.apache.org/job/openmeetings/ws/openmeetings-server/target/site> to /x1/jenkins/jenkins-home/jobs/openmeetings/site/openmeetings-server
[INFO] ------------------------------------------------------------------------
[INFO] Reactor Summary for Openmeetings 5.0.0-M4-SNAPSHOT:
[INFO] 
[INFO] Openmeetings ....................................... SUCCESS [01:14 min]
[INFO] Openmeetings Util .................................. SUCCESS [08:32 min]
[INFO] Openmeetings DB .................................... SUCCESS [05:06 min]
[INFO] Openmeetings Core .................................. SUCCESS [01:11 min]
[INFO] Openmeetings Install ............................... SUCCESS [ 33.905 s]
[INFO] Openmeetings Service ............................... SUCCESS [ 29.863 s]
[INFO] Openmeetings Webservices ........................... SUCCESS [01:34 min]
[INFO] Openmeetings Web ................................... SUCCESS [31:44 min]
[INFO] Openmeetings Screen Sharing applet ................. SUCCESS [ 36.582 s]
[INFO] Openmeetings Server ................................ FAILURE [ 10.877 s]
[INFO] ------------------------------------------------------------------------
[INFO] BUILD FAILURE
[INFO] ------------------------------------------------------------------------
[INFO] Total time:  52:03 min
[INFO] Finished at: 2020-03-10T17:38:33Z
[INFO] ------------------------------------------------------------------------
Waiting for Jenkins to finish collecting data
[ERROR] Failed to execute goal org.apache.maven.plugins:maven-site-plugin:3.8.2:site (generate-site) on project openmeetings-server: Error parsing '<https://builds.apache.org/job/openmeetings/ws/openmeetings-server/src/site/markdown/InstallMediaServer.md'>: line [3] Error parsing the model: end tag name </p> must match start tag name <div> from line 3 (position: TEXT seen ...out bd-callout-danger"> It should be run under same user as OM</p>... @3:271) -> [Help 1]
[ERROR] 
[ERROR] To see the full stack trace of the errors, re-run Maven with the -e switch.
[ERROR] Re-run Maven using the -X switch to enable full debug logging.
[ERROR] 
[ERROR] For more information about the errors and possible solutions, please read the following articles:
[ERROR] [Help 1] http://cwiki.apache.org/confluence/display/MAVEN/MojoExecutionException
[ERROR] 
[ERROR] After correcting the problems, you can resume the build with the command
[ERROR]   mvn <goals> -rf :openmeetings-server
[JENKINS] Archiving <https://builds.apache.org/job/openmeetings/ws/openmeetings-server/pom.xml> to org.apache.openmeetings/openmeetings-server/5.0.0-M4-SNAPSHOT/openmeetings-server-5.0.0-M4-SNAPSHOT.pom
[JENKINS] Archiving <https://builds.apache.org/job/openmeetings/ws/openmeetings-screenshare/pom.xml> to org.apache.openmeetings/openmeetings-screenshare/5.0.0-M4-SNAPSHOT/openmeetings-screenshare-5.0.0-M4-SNAPSHOT.pom
[JENKINS] Archiving <https://builds.apache.org/job/openmeetings/ws/openmeetings-screenshare/target/openmeetings-screenshare-5.0.0-M4-SNAPSHOT.jar> to org.apache.openmeetings/openmeetings-screenshare/5.0.0-M4-SNAPSHOT/openmeetings-screenshare-5.0.0-M4-SNAPSHOT.jar
[JENKINS] Archiving <https://builds.apache.org/job/openmeetings/ws/openmeetings-screenshare/target/jnlp/openmeetings-screenshare-5.0.0-M4-SNAPSHOT-full.jar> to org.apache.openmeetings/openmeetings-screenshare/5.0.0-M4-SNAPSHOT/openmeetings-screenshare-5.0.0-M4-SNAPSHOT-full.jar
[Fast Archiver] Compressed 9.52 MB of artifacts by 86.4% relative to #3032
[JENKINS] Archiving <https://builds.apache.org/job/openmeetings/ws/openmeetings-util/pom.xml> to org.apache.openmeetings/openmeetings-util/5.0.0-M4-SNAPSHOT/openmeetings-util-5.0.0-M4-SNAPSHOT.pom
[JENKINS] Archiving <https://builds.apache.org/job/openmeetings/ws/openmeetings-util/target/openmeetings-util-5.0.0-M4-SNAPSHOT.jar> to org.apache.openmeetings/openmeetings-util/5.0.0-M4-SNAPSHOT/openmeetings-util-5.0.0-M4-SNAPSHOT.jar
[JENKINS] Archiving <https://builds.apache.org/job/openmeetings/ws/openmeetings-util/target/openmeetings-util-5.0.0-M4-SNAPSHOT-tests.jar> to org.apache.openmeetings/openmeetings-util/5.0.0-M4-SNAPSHOT/openmeetings-util-5.0.0-M4-SNAPSHOT-tests.jar
[JENKINS] Archiving <https://builds.apache.org/job/openmeetings/ws/openmeetings-install/pom.xml> to org.apache.openmeetings/openmeetings-install/5.0.0-M4-SNAPSHOT/openmeetings-install-5.0.0-M4-SNAPSHOT.pom
[JENKINS] Archiving <https://builds.apache.org/job/openmeetings/ws/openmeetings-install/target/openmeetings-install-5.0.0-M4-SNAPSHOT.jar> to org.apache.openmeetings/openmeetings-install/5.0.0-M4-SNAPSHOT/openmeetings-install-5.0.0-M4-SNAPSHOT.jar
[Fast Archiver] Compressed 107.95 KB of artifacts by 59.3% relative to #3032
[JENKINS] Archiving <https://builds.apache.org/job/openmeetings/ws/openmeetings-service/pom.xml> to org.apache.openmeetings/openmeetings-service/5.0.0-M4-SNAPSHOT/openmeetings-service-5.0.0-M4-SNAPSHOT.pom
[JENKINS] Archiving <https://builds.apache.org/job/openmeetings/ws/openmeetings-service/target/openmeetings-service-5.0.0-M4-SNAPSHOT.jar> to org.apache.openmeetings/openmeetings-service/5.0.0-M4-SNAPSHOT/openmeetings-service-5.0.0-M4-SNAPSHOT.jar
[Fast Archiver] Compressed 102.96 KB of artifacts by 31.1% relative to #3032
[JENKINS] Archiving <https://builds.apache.org/job/openmeetings/ws/pom.xml> to org.apache.openmeetings/openmeetings-parent/5.0.0-M4-SNAPSHOT/openmeetings-parent-5.0.0-M4-SNAPSHOT.pom
[JENKINS] Archiving <https://builds.apache.org/job/openmeetings/ws/target/openmeetings-parent-5.0.0-M4-SNAPSHOT-site.xml> to org.apache.openmeetings/openmeetings-parent/5.0.0-M4-SNAPSHOT/openmeetings-parent-5.0.0-M4-SNAPSHOT-site.xml
[Fast Archiver] Compressed 51.09 KB of artifacts by 62.6% relative to #3032
[JENKINS] Archiving <https://builds.apache.org/job/openmeetings/ws/openmeetings-db/pom.xml> to org.apache.openmeetings/openmeetings-db/5.0.0-M4-SNAPSHOT/openmeetings-db-5.0.0-M4-SNAPSHOT.pom
[JENKINS] Archiving <https://builds.apache.org/job/openmeetings/ws/openmeetings-db/target/openmeetings-db-5.0.0-M4-SNAPSHOT.jar> to org.apache.openmeetings/openmeetings-db/5.0.0-M4-SNAPSHOT/openmeetings-db-5.0.0-M4-SNAPSHOT.jar
[Fast Archiver] Compressed 434.87 KB of artifacts by 80.9% relative to #3032
[JENKINS] Archiving <https://builds.apache.org/job/openmeetings/ws/openmeetings-web/pom.xml> to org.apache.openmeetings/openmeetings-web/5.0.0-M4-SNAPSHOT/openmeetings-web-5.0.0-M4-SNAPSHOT.pom
[JENKINS] Archiving <https://builds.apache.org/job/openmeetings/ws/openmeetings-web/target/openmeetings-web-5.0.0-M4-SNAPSHOT.war> to org.apache.openmeetings/openmeetings-web/5.0.0-M4-SNAPSHOT/openmeetings-web-5.0.0-M4-SNAPSHOT.war
[Fast Archiver] Compressed 136.26 MB of artifacts by 93.2% relative to #3032
[JENKINS] Archiving <https://builds.apache.org/job/openmeetings/ws/openmeetings-webservice/pom.xml> to org.apache.openmeetings/openmeetings-webservice/5.0.0-M4-SNAPSHOT/openmeetings-webservice-5.0.0-M4-SNAPSHOT.pom
[JENKINS] Archiving <https://builds.apache.org/job/openmeetings/ws/openmeetings-webservice/target/openmeetings-webservice-5.0.0-M4-SNAPSHOT.jar> to org.apache.openmeetings/openmeetings-webservice/5.0.0-M4-SNAPSHOT/openmeetings-webservice-5.0.0-M4-SNAPSHOT.jar
[Fast Archiver] Compressed 72.85 KB of artifacts by 43.9% relative to #3032
[JENKINS] Archiving <https://builds.apache.org/job/openmeetings/ws/openmeetings-core/pom.xml> to org.apache.openmeetings/openmeetings-core/5.0.0-M4-SNAPSHOT/openmeetings-core-5.0.0-M4-SNAPSHOT.pom
[JENKINS] Archiving <https://builds.apache.org/job/openmeetings/ws/openmeetings-core/target/openmeetings-core-5.0.0-M4-SNAPSHOT.jar> to org.apache.openmeetings/openmeetings-core/5.0.0-M4-SNAPSHOT/openmeetings-core-5.0.0-M4-SNAPSHOT.jar
[JENKINS] Archiving <https://builds.apache.org/job/openmeetings/ws/openmeetings-core/target/openmeetings-core-5.0.0-M4-SNAPSHOT-tests.jar> to org.apache.openmeetings/openmeetings-core/5.0.0-M4-SNAPSHOT/openmeetings-core-5.0.0-M4-SNAPSHOT-tests.jar
[Fast Archiver] Compressed 184.35 KB of artifacts by 52.1% relative to #3032
Not sending mail to unregistered user noreply@github.com
Sending e-mails to: dev@openmeetings.apache.org
No mail will be sent out, as 'openmeetings » Openmeetings Screen Sharing applet #3034' does not have a result yet. Please make sure you set a proper result in case of pipeline/build scripts.
No mail will be sent out, as 'openmeetings » Openmeetings Util #3034' does not have a result yet. Please make sure you set a proper result in case of pipeline/build scripts.
No mail will be sent out, as 'openmeetings » Openmeetings Install #3034' does not have a result yet. Please make sure you set a proper result in case of pipeline/build scripts.
No mail will be sent out, as 'openmeetings » Openmeetings Service #3034' does not have a result yet. Please make sure you set a proper result in case of pipeline/build scripts.
Not sending mail to unregistered user solomax666@gmail.com
Sending e-mails to: dev@openmeetings.apache.org
No mail will be sent out, as 'openmeetings » Openmeetings DB #3034' does not have a result yet. Please make sure you set a proper result in case of pipeline/build scripts.
No mail will be sent out, as 'openmeetings » Openmeetings Web #3034' does not have a result yet. Please make sure you set a proper result in case of pipeline/build scripts.
No mail will be sent out, as 'openmeetings » Openmeetings Webservices #3034' does not have a result yet. Please make sure you set a proper result in case of pipeline/build scripts.
No mail will be sent out, as 'openmeetings » Openmeetings Core #3034' does not have a result yet. Please make sure you set a proper result in case of pipeline/build scripts.
channel stopped
Archiving artifacts
Not sending mail to unregistered user noreply@github.com
Not sending mail to unregistered user solomax666@gmail.com

Build failed in Jenkins: openmeetings #3033

Posted by Apache Jenkins Server <je...@builds.apache.org>.
See <https://builds.apache.org/job/openmeetings/3033/display/redirect?page=changes>

Changes:

[solomax666] no jira: maven-site-plugin version rolled back due to MSITE-854


------------------------------------------
Started by user solomax
Running as SYSTEM
[EnvInject] - Loading node environment variables.
Building remotely on H22 (ubuntu) in workspace <https://builds.apache.org/job/openmeetings/ws/>
[WS-CLEANUP] Deleting project workspace...
[WS-CLEANUP] Deferred wipeout is used...
[WS-CLEANUP] Done
No credentials specified
Cloning the remote Git repository
Cloning repository https://github.com/apache/openmeetings.git
 > git init <https://builds.apache.org/job/openmeetings/ws/> # timeout=10
Fetching upstream changes from https://github.com/apache/openmeetings.git
 > git --version # timeout=10
 > git fetch --tags --progress -- https://github.com/apache/openmeetings.git +refs/heads/*:refs/remotes/origin/*
 > git config remote.origin.url https://github.com/apache/openmeetings.git # timeout=10
 > git config --add remote.origin.fetch +refs/heads/*:refs/remotes/origin/* # timeout=10
 > git config remote.origin.url https://github.com/apache/openmeetings.git # timeout=10
Fetching upstream changes from https://github.com/apache/openmeetings.git
 > git fetch --tags --progress -- https://github.com/apache/openmeetings.git +refs/heads/*:refs/remotes/origin/*
 > git rev-parse refs/remotes/origin/master^{commit} # timeout=10
 > git rev-parse refs/remotes/origin/origin/master^{commit} # timeout=10
Checking out Revision 410450f91dd63328c59352ffdb4750b67d1e3ef1 (refs/remotes/origin/master)
 > git config core.sparsecheckout # timeout=10
 > git checkout -f 410450f91dd63328c59352ffdb4750b67d1e3ef1
Commit message: "no jira: maven-site-plugin version rolled back due to MSITE-854"
 > git rev-list --no-walk b21e365c501fe869f463517d5c39d1897ce986bd # timeout=10
Parsing POMs
Modules changed, recalculating dependency graph
Established TCP socket on 36017
maven35-agent.jar already up to date
maven35-interceptor.jar already up to date
maven3-interceptor-commons.jar already up to date
[openmeetings] $ /home/jenkins/tools/java/latest11/bin/java -Xmx2g -Xms512m -XX:MaxMetaspaceSize=512m -Djava.security.egd=file:///dev/./urandom -cp /home/jenkins/jenkins-slave/maven35-agent.jar:/home/jenkins/tools/maven/latest3/boot/plexus-classworlds-2.6.0.jar:/home/jenkins/tools/maven/latest3/conf/logging jenkins.maven3.agent.Maven35Main /home/jenkins/tools/maven/latest3/ /home/jenkins/jenkins-slave/remoting.jar /home/jenkins/jenkins-slave/maven35-interceptor.jar /home/jenkins/jenkins-slave/maven3-interceptor-commons.jar 36017
<===[JENKINS REMOTING CAPACITY]===>   channel started
Executing Maven:  -B -f <https://builds.apache.org/job/openmeetings/ws/pom.xml> -Dmaven.repo.local=/home/jenkins/jenkins-slave/maven-repositories/0 clean install -PallModules,Jenkins
[INFO] Scanning for projects...
[INFO] ------------------------------------------------------------------------
[INFO] Reactor Build Order:
[INFO] 
[INFO] Openmeetings                                                       [pom]
[INFO] Openmeetings Util                                                  [jar]
[INFO] Openmeetings DB                                                    [jar]
[INFO] Openmeetings Core                                                  [jar]
[INFO] Openmeetings Install                                               [jar]
[INFO] Openmeetings Service                                               [jar]
[INFO] Openmeetings Webservices                                           [jar]
[INFO] Openmeetings Web                                                   [war]
[INFO] Openmeetings Screen Sharing applet                                 [jar]
[INFO] Openmeetings Server                                                [jar]
[INFO] 
[INFO] ------------< org.apache.openmeetings:openmeetings-parent >-------------
[INFO] Building Openmeetings 5.0.0-M4-SNAPSHOT                           [1/10]
[INFO] --------------------------------[ pom ]---------------------------------
[INFO] 
[INFO] --- maven-clean-plugin:3.1.0:clean (default-clean) @ openmeetings-parent ---
[INFO] 
[INFO] --- buildnumber-maven-plugin:1.4:create (default) @ openmeetings-parent ---
[INFO] ShortRevision tag detected. The value is '7'.
[INFO] Executing: /bin/sh -c cd '<https://builds.apache.org/job/openmeetings/ws/'> && 'git' 'rev-parse' '--verify' '--short=7' 'HEAD'
[INFO] Working directory: <https://builds.apache.org/job/openmeetings/ws/>
[INFO] Storing buildNumber: 410450f at timestamp: 1583855710953
[WARNING] Cannot get the branch information from the git repository: 
Detecting the current branch failed: fatal: ref HEAD is not a symbolic ref

[INFO] ShortRevision tag detected. The value is '7'.
[INFO] Executing: /bin/sh -c cd '<https://builds.apache.org/job/openmeetings/ws/'> && 'git' 'rev-parse' '--verify' '--short=7' 'HEAD'
[INFO] Working directory: <https://builds.apache.org/job/openmeetings/ws/>
[INFO] Storing buildScmBranch: UNKNOWN
[INFO] 
[INFO] --- apache-rat-plugin:0.13:check (default) @ openmeetings-parent ---
[INFO] Added 1 additional default licenses.
[INFO] Enabled default license matchers.
[INFO] Added 1 custom approved licenses.
[INFO] Will parse SCM ignores for exclusions...
[INFO] Parsing exclusions from <https://builds.apache.org/job/openmeetings/ws/.gitignore>
[INFO] Finished adding exclusions from SCM ignore files.
[INFO] 77 implicit excludes (use -debug for more details).
[INFO] 2 explicit excludes (use -debug for more details).
[INFO] 8 resources included (use -debug for more details)
[INFO] Rat check: Summary over all files. Unapproved: 0, unknown: 0, generated: 0, approved: 6 licenses.
[INFO] 
[INFO] --- maven-enforcer-plugin:3.0.0-M3:enforce (enforce-versions) @ openmeetings-parent ---
[INFO] 
[INFO] --- maven-enforcer-plugin:3.0.0-M3:enforce (enforce-maven-version) @ openmeetings-parent ---
[INFO] 
[INFO] --- jacoco-maven-plugin:0.8.5:prepare-agent (prepare-agent) @ openmeetings-parent ---
[INFO] argLine set to -javaagent:/home/jenkins/jenkins-slave/maven-repositories/0/org/jacoco/org.jacoco.agent/0.8.5/org.jacoco.agent-0.8.5-runtime.jar=destfile=<https://builds.apache.org/job/openmeetings/ws/../target/jacoco.exec,append=true>
[INFO] 
[INFO] --- maven-remote-resources-plugin:1.6.0:process (process-resource-bundles) @ openmeetings-parent ---
[INFO] Preparing remote bundle org.apache:apache-jar-resource-bundle:1.4
[INFO] Copying 3 resources from 1 bundle.
[INFO] 
[INFO] --- maven-site-plugin:3.7.1:site (generate-site) @ openmeetings-parent ---
[INFO] configuring report plugin org.apache.maven.plugins:maven-project-info-reports-plugin:3.0.0
[INFO] 14 reports configured for maven-project-info-reports-plugin:3.0.0: index, ci-management, dependencies, dependency-convergence, dependency-management, distribution-management, issue-management, licenses, mailing-lists, plugin-management, plugins, team, scm, summary
[INFO] configuring report plugin org.apache.maven.plugins:maven-surefire-report-plugin:3.0.0-M4
[INFO] 1 report configured for maven-surefire-report-plugin:3.0.0-M4: report-only
[INFO] configuring report plugin org.apache.rat:apache-rat-plugin:0.13
[INFO] 1 report configured for apache-rat-plugin:0.13: rat
[INFO] Rendering site with default locale English (en)
[INFO] Relativizing decoration links with respect to localized project URL: https://openmeetings.apache.org
[INFO] Rendering content with io.github.devacfr.maven.skins:reflow-maven-skin:jar:2.3.0 skin.
[INFO] ------------------------------------------------------------------------
[INFO] Reactor Summary for Openmeetings 5.0.0-M4-SNAPSHOT:
[INFO] 
[INFO] Openmeetings ....................................... FAILURE [  8.352 s]
[INFO] Openmeetings Util .................................. SKIPPED
[INFO] Openmeetings DB .................................... SKIPPED
[INFO] Openmeetings Core .................................. SKIPPED
[INFO] Openmeetings Install ............................... SKIPPED
[INFO] Openmeetings Service ............................... SKIPPED
[INFO] Openmeetings Webservices ........................... SKIPPED
[INFO] Openmeetings Web ................................... SKIPPED
[INFO] Openmeetings Screen Sharing applet ................. SKIPPED
[INFO] Openmeetings Server ................................ SKIPPED
[INFO] ------------------------------------------------------------------------
[INFO] BUILD FAILURE
[INFO] ------------------------------------------------------------------------
[INFO] Total time:  23.566 s
[INFO] Finished at: 2020-03-10T15:55:27Z
[INFO] ------------------------------------------------------------------------
Waiting for Jenkins to finish collecting data
[ERROR] Failed to execute goal org.apache.maven.plugins:maven-site-plugin:3.7.1:site (generate-site) on project openmeetings-parent: RendererException while preparing context for skin: Cannot use skin: has 1.9 Doxia Sitetools prerequisite, but current is 1.8.1 -> [Help 1]
[ERROR] 
[ERROR] To see the full stack trace of the errors, re-run Maven with the -e switch.
[ERROR] Re-run Maven using the -X switch to enable full debug logging.
[ERROR] 
[ERROR] For more information about the errors and possible solutions, please read the following articles:
[ERROR] [Help 1] http://cwiki.apache.org/confluence/display/MAVEN/MojoExecutionException
[JENKINS] Archiving <https://builds.apache.org/job/openmeetings/ws/openmeetings-server/pom.xml> to org.apache.openmeetings/openmeetings-server/5.0.0-M4-SNAPSHOT/openmeetings-server-5.0.0-M4-SNAPSHOT.pom
[JENKINS] Archiving <https://builds.apache.org/job/openmeetings/ws/openmeetings-screenshare/pom.xml> to org.apache.openmeetings/openmeetings-screenshare/5.0.0-M4-SNAPSHOT/openmeetings-screenshare-5.0.0-M4-SNAPSHOT.pom
[JENKINS] Archiving <https://builds.apache.org/job/openmeetings/ws/openmeetings-util/pom.xml> to org.apache.openmeetings/openmeetings-util/5.0.0-M4-SNAPSHOT/openmeetings-util-5.0.0-M4-SNAPSHOT.pom
[JENKINS] Archiving <https://builds.apache.org/job/openmeetings/ws/openmeetings-install/pom.xml> to org.apache.openmeetings/openmeetings-install/5.0.0-M4-SNAPSHOT/openmeetings-install-5.0.0-M4-SNAPSHOT.pom
[JENKINS] Archiving <https://builds.apache.org/job/openmeetings/ws/openmeetings-service/pom.xml> to org.apache.openmeetings/openmeetings-service/5.0.0-M4-SNAPSHOT/openmeetings-service-5.0.0-M4-SNAPSHOT.pom
[JENKINS] Archiving <https://builds.apache.org/job/openmeetings/ws/pom.xml> to org.apache.openmeetings/openmeetings-parent/5.0.0-M4-SNAPSHOT/openmeetings-parent-5.0.0-M4-SNAPSHOT.pom
[JENKINS] Archiving <https://builds.apache.org/job/openmeetings/ws/openmeetings-db/pom.xml> to org.apache.openmeetings/openmeetings-db/5.0.0-M4-SNAPSHOT/openmeetings-db-5.0.0-M4-SNAPSHOT.pom
[JENKINS] Archiving <https://builds.apache.org/job/openmeetings/ws/openmeetings-web/pom.xml> to org.apache.openmeetings/openmeetings-web/5.0.0-M4-SNAPSHOT/openmeetings-web-5.0.0-M4-SNAPSHOT.pom
[JENKINS] Archiving <https://builds.apache.org/job/openmeetings/ws/openmeetings-webservice/pom.xml> to org.apache.openmeetings/openmeetings-webservice/5.0.0-M4-SNAPSHOT/openmeetings-webservice-5.0.0-M4-SNAPSHOT.pom
[JENKINS] Archiving <https://builds.apache.org/job/openmeetings/ws/openmeetings-core/pom.xml> to org.apache.openmeetings/openmeetings-core/5.0.0-M4-SNAPSHOT/openmeetings-core-5.0.0-M4-SNAPSHOT.pom
No mail will be sent out, as 'openmeetings » Openmeetings Server #3033' does not have a result yet. Please make sure you set a proper result in case of pipeline/build scripts.
No mail will be sent out, as 'openmeetings » Openmeetings Screen Sharing applet #3033' does not have a result yet. Please make sure you set a proper result in case of pipeline/build scripts.
No mail will be sent out, as 'openmeetings » Openmeetings Util #3033' does not have a result yet. Please make sure you set a proper result in case of pipeline/build scripts.
No mail will be sent out, as 'openmeetings » Openmeetings Install #3033' does not have a result yet. Please make sure you set a proper result in case of pipeline/build scripts.
No mail will be sent out, as 'openmeetings » Openmeetings Service #3033' does not have a result yet. Please make sure you set a proper result in case of pipeline/build scripts.
Not sending mail to unregistered user solomax666@gmail.com
Sending e-mails to: dev@openmeetings.apache.org
No mail will be sent out, as 'openmeetings » Openmeetings DB #3033' does not have a result yet. Please make sure you set a proper result in case of pipeline/build scripts.
No mail will be sent out, as 'openmeetings » Openmeetings Web #3033' does not have a result yet. Please make sure you set a proper result in case of pipeline/build scripts.
No mail will be sent out, as 'openmeetings » Openmeetings Webservices #3033' does not have a result yet. Please make sure you set a proper result in case of pipeline/build scripts.
No mail will be sent out, as 'openmeetings » Openmeetings Core #3033' does not have a result yet. Please make sure you set a proper result in case of pipeline/build scripts.
channel stopped
Archiving artifacts
Not sending mail to unregistered user noreply@github.com
Not sending mail to unregistered user solomax666@gmail.com