You are viewing a plain text version of this content. The canonical link for it is here.
Posted to notifications@jclouds.apache.org by je...@cloudbees.com on 2014/07/18 19:06:39 UTC

Build failed in Jenkins: jclouds-labs-aws #141

See <https://jclouds.ci.cloudbees.com/job/jclouds-labs-aws/141/>

------------------------------------------
[...truncated 2445 lines...]
[WARNING] <https://jclouds.ci.cloudbees.com/job/jclouds-labs-aws/ws/elb/src/main/java/org/jclouds/elb/ELBApiMetadata.java>:36: warning - Tag @link: reference not found: ApiMetadata
[WARNING] <https://jclouds.ci.cloudbees.com/job/jclouds-labs-aws/ws/iam/src/main/java/org/jclouds/iam/IAMApiMetadata.java>:31: warning - Tag @link: reference not found: ApiMetadata
[WARNING] <https://jclouds.ci.cloudbees.com/job/jclouds-labs-aws/ws/rds/src/main/java/org/jclouds/rds/RDSApiMetadata.java>:34: warning - Tag @link: reference not found: ApiMetadata
[INFO] Building jar: <https://jclouds.ci.cloudbees.com/job/jclouds-labs-aws/ws/target/jclouds-labs-aws-1.8.0-SNAPSHOT-javadoc.jar>
[INFO] 
[INFO] --- maven-javadoc-plugin:2.9:jar (javadoc) @ jclouds-labs-aws ---
[INFO] Not executing Javadoc as the project is not a Java classpath-capable package
[INFO] 
[INFO] --- maven-source-plugin:2.2:jar-no-fork (attach-sources) @ jclouds-labs-aws ---
Downloading: https://repository-jclouds.forge.cloudbees.com/release/org/codehaus/plexus/plexus-utils/1.5.1/plexus-utils-1.5.1.pom
Downloading: http://repo.cloudbees.com/content/repositories/central/org/codehaus/plexus/plexus-utils/1.5.1/plexus-utils-1.5.1.pom
Downloaded: http://repo.cloudbees.com/content/repositories/central/org/codehaus/plexus/plexus-utils/1.5.1/plexus-utils-1.5.1.pom (3 KB at 0.9 KB/sec)
Downloading: https://repository-jclouds.forge.cloudbees.com/release/org/codehaus/plexus/plexus-utils/3.0.1/plexus-utils-3.0.1.pom
Downloading: http://repo.cloudbees.com/content/repositories/central/org/codehaus/plexus/plexus-utils/3.0.1/plexus-utils-3.0.1.pom
Downloaded: http://repo.cloudbees.com/content/repositories/central/org/codehaus/plexus/plexus-utils/3.0.1/plexus-utils-3.0.1.pom (3 KB at 59.8 KB/sec)
Downloading: https://repository-jclouds.forge.cloudbees.com/release/org/codehaus/plexus/plexus-utils/3.0.1/plexus-utils-3.0.1.jar
Downloading: http://repo.cloudbees.com/content/repositories/central/org/codehaus/plexus/plexus-utils/3.0.1/plexus-utils-3.0.1.jar
Downloaded: http://repo.cloudbees.com/content/repositories/central/org/codehaus/plexus/plexus-utils/3.0.1/plexus-utils-3.0.1.jar (222 KB at 2766.0 KB/sec)
[INFO] 
[INFO] --- maven-surefire-plugin:2.17:test (integration) @ jclouds-labs-aws ---
Downloading: https://repository-jclouds.forge.cloudbees.com/release/org/apache/maven/surefire/maven-surefire-common/2.17/maven-surefire-common-2.17.pom
Downloading: http://repo.cloudbees.com/content/repositories/central/org/apache/maven/surefire/maven-surefire-common/2.17/maven-surefire-common-2.17.pom
Downloaded: http://repo.cloudbees.com/content/repositories/central/org/apache/maven/surefire/maven-surefire-common/2.17/maven-surefire-common-2.17.pom (6 KB at 1.0 KB/sec)
Downloading: https://repository-jclouds.forge.cloudbees.com/release/org/apache/maven/plugin-tools/maven-plugin-annotations/3.2/maven-plugin-annotations-3.2.pom
Downloading: http://repo.cloudbees.com/content/repositories/central/org/apache/maven/plugin-tools/maven-plugin-annotations/3.2/maven-plugin-annotations-3.2.pom
Downloaded: http://repo.cloudbees.com/content/repositories/central/org/apache/maven/plugin-tools/maven-plugin-annotations/3.2/maven-plugin-annotations-3.2.pom (2 KB at 15.9 KB/sec)
Downloading: https://repository-jclouds.forge.cloudbees.com/release/org/apache/maven/plugin-tools/maven-plugin-tools/3.2/maven-plugin-tools-3.2.pom
Downloading: http://repo.cloudbees.com/content/repositories/central/org/apache/maven/plugin-tools/maven-plugin-tools/3.2/maven-plugin-tools-3.2.pom
Downloaded: http://repo.cloudbees.com/content/repositories/central/org/apache/maven/plugin-tools/maven-plugin-tools/3.2/maven-plugin-tools-3.2.pom (17 KB at 474.7 KB/sec)
Downloading: https://repository-jclouds.forge.cloudbees.com/release/org/apache/maven/surefire/surefire-api/2.17/surefire-api-2.17.pom
Downloading: http://repo.cloudbees.com/content/repositories/central/org/apache/maven/surefire/surefire-api/2.17/surefire-api-2.17.pom
Downloaded: http://repo.cloudbees.com/content/repositories/central/org/apache/maven/surefire/surefire-api/2.17/surefire-api-2.17.pom (3 KB at 65.8 KB/sec)
Downloading: https://repository-jclouds.forge.cloudbees.com/release/org/apache/maven/surefire/surefire-booter/2.17/surefire-booter-2.17.pom
Downloading: http://repo.cloudbees.com/content/repositories/central/org/apache/maven/surefire/surefire-booter/2.17/surefire-booter-2.17.pom
Downloaded: http://repo.cloudbees.com/content/repositories/central/org/apache/maven/surefire/surefire-booter/2.17/surefire-booter-2.17.pom (3 KB at 56.4 KB/sec)
Downloading: https://repository-jclouds.forge.cloudbees.com/release/org/apache/maven/maven-toolchain/2.0.9/maven-toolchain-2.0.9.pom
Downloading: http://repo.cloudbees.com/content/repositories/central/org/apache/maven/maven-toolchain/2.0.9/maven-toolchain-2.0.9.pom
Downloaded: http://repo.cloudbees.com/content/repositories/central/org/apache/maven/maven-toolchain/2.0.9/maven-toolchain-2.0.9.pom (4 KB at 39.5 KB/sec)
Downloading: https://repository-jclouds.forge.cloudbees.com/release/org/apache/commons/commons-lang3/3.1/commons-lang3-3.1.pom
Downloading: http://repo.cloudbees.com/content/repositories/central/org/apache/commons/commons-lang3/3.1/commons-lang3-3.1.pom
Downloaded: http://repo.cloudbees.com/content/repositories/central/org/apache/commons/commons-lang3/3.1/commons-lang3-3.1.pom (17 KB at 510.0 KB/sec)
Downloading: https://repository-jclouds.forge.cloudbees.com/release/org/apache/commons/commons-parent/22/commons-parent-22.pom
Downloading: http://repo.cloudbees.com/content/repositories/central/org/apache/commons/commons-parent/22/commons-parent-22.pom
Downloaded: http://repo.cloudbees.com/content/repositories/central/org/apache/commons/commons-parent/22/commons-parent-22.pom (41 KB at 2558.5 KB/sec)
Downloading: https://repository-jclouds.forge.cloudbees.com/release/org/apache/maven/surefire/maven-surefire-common/2.17/maven-surefire-common-2.17.jar
Downloading: https://repository-jclouds.forge.cloudbees.com/release/org/apache/maven/surefire/surefire-booter/2.17/surefire-booter-2.17.jar
Downloading: https://repository-jclouds.forge.cloudbees.com/release/org/codehaus/plexus/plexus-utils/1.5.1/plexus-utils-1.5.1.jar
Downloading: https://repository-jclouds.forge.cloudbees.com/release/org/apache/commons/commons-lang3/3.1/commons-lang3-3.1.jar
Downloading: https://repository-jclouds.forge.cloudbees.com/release/org/apache/maven/surefire/surefire-api/2.17/surefire-api-2.17.jar
Downloading: https://repository-jclouds.forge.cloudbees.com/release/org/apache/maven/plugin-tools/maven-plugin-annotations/3.2/maven-plugin-annotations-3.2.jar
Downloading: http://repo.cloudbees.com/content/repositories/central/org/apache/maven/surefire/surefire-booter/2.17/surefire-booter-2.17.jar
Downloading: http://repo.cloudbees.com/content/repositories/central/org/apache/maven/surefire/maven-surefire-common/2.17/maven-surefire-common-2.17.jar
Downloading: http://repo.cloudbees.com/content/repositories/central/org/codehaus/plexus/plexus-utils/1.5.1/plexus-utils-1.5.1.jar
Downloading: http://repo.cloudbees.com/content/repositories/central/org/apache/commons/commons-lang3/3.1/commons-lang3-3.1.jar
Downloading: http://repo.cloudbees.com/content/repositories/central/org/apache/maven/surefire/surefire-api/2.17/surefire-api-2.17.jar
Downloaded: http://repo.cloudbees.com/content/repositories/central/org/apache/maven/surefire/surefire-api/2.17/surefire-api-2.17.jar (144 KB at 20.0 KB/sec)
Downloading: http://repo.cloudbees.com/content/repositories/central/org/apache/maven/plugin-tools/maven-plugin-annotations/3.2/maven-plugin-annotations-3.2.jar
Downloaded: http://repo.cloudbees.com/content/repositories/central/org/codehaus/plexus/plexus-utils/1.5.1/plexus-utils-1.5.1.jar (206 KB at 28.6 KB/sec)
Downloaded: http://repo.cloudbees.com/content/repositories/central/org/apache/maven/surefire/maven-surefire-common/2.17/maven-surefire-common-2.17.jar (260 KB at 36.0 KB/sec)
Downloaded: http://repo.cloudbees.com/content/repositories/central/org/apache/commons/commons-lang3/3.1/commons-lang3-3.1.jar (309 KB at 42.8 KB/sec)
Downloaded: http://repo.cloudbees.com/content/repositories/central/org/apache/maven/plugin-tools/maven-plugin-annotations/3.2/maven-plugin-annotations-3.2.jar (15 KB at 640.2 KB/sec)
Downloaded: http://repo.cloudbees.com/content/repositories/central/org/apache/maven/surefire/surefire-booter/2.17/surefire-booter-2.17.jar (39 KB at 5.3 KB/sec)
[INFO] No tests to run.
[JENKINS] Recording test results[INFO] 
[INFO] --- maven-duplicate-finder-plugin:1.0.5:check (default) @ jclouds-labs-aws ---

Downloading: https://repository-jclouds.forge.cloudbees.com/release/commons-codec/commons-codec/1.5/commons-codec-1.5.pom
Downloading: http://repo.cloudbees.com/content/repositories/central/commons-codec/commons-codec/1.5/commons-codec-1.5.pom
Downloaded: http://repo.cloudbees.com/content/repositories/central/commons-codec/commons-codec/1.5/commons-codec-1.5.pom (10 KB at 1.6 KB/sec)
Downloading: https://repository-jclouds.forge.cloudbees.com/release/org/apache/commons/commons-parent/20/commons-parent-20.pom
Downloading: http://repo.cloudbees.com/content/repositories/central/org/apache/commons/commons-parent/20/commons-parent-20.pom
Downloaded: http://repo.cloudbees.com/content/repositories/central/org/apache/commons/commons-parent/20/commons-parent-20.pom (33 KB at 959.3 KB/sec)
Downloading: https://repository-jclouds.forge.cloudbees.com/release/log4j/log4j/1.2.16/log4j-1.2.16.pom
Downloading: http://repo.cloudbees.com/content/repositories/central/log4j/log4j/1.2.16/log4j-1.2.16.pom
Downloaded: http://repo.cloudbees.com/content/repositories/central/log4j/log4j/1.2.16/log4j-1.2.16.pom (20 KB at 124.1 KB/sec)
Downloading: https://repository-jclouds.forge.cloudbees.com/release/org/slf4j/slf4j-log4j12/1.6.1/slf4j-log4j12-1.6.1.pom
Downloading: http://repo.cloudbees.com/content/repositories/central/org/slf4j/slf4j-log4j12/1.6.1/slf4j-log4j12-1.6.1.pom
Downloaded: http://repo.cloudbees.com/content/repositories/central/org/slf4j/slf4j-log4j12/1.6.1/slf4j-log4j12-1.6.1.pom (2 KB at 115.4 KB/sec)
Downloading: https://repository-jclouds.forge.cloudbees.com/release/com/pyx4j/maven-plugin-log4j/1.0.1/maven-plugin-log4j-1.0.1.pom
Downloading: http://repo.cloudbees.com/content/repositories/central/com/pyx4j/maven-plugin-log4j/1.0.1/maven-plugin-log4j-1.0.1.pom
Downloaded: http://repo.cloudbees.com/content/repositories/central/com/pyx4j/maven-plugin-log4j/1.0.1/maven-plugin-log4j-1.0.1.pom (2 KB at 31.8 KB/sec)
Downloading: https://repository-jclouds.forge.cloudbees.com/release/com/pyx4j/pyx4j-maven-plugins/1.0.1/pyx4j-maven-plugins-1.0.1.pom
Downloading: http://repo.cloudbees.com/content/repositories/central/com/pyx4j/pyx4j-maven-plugins/1.0.1/pyx4j-maven-plugins-1.0.1.pom
Downloaded: http://repo.cloudbees.com/content/repositories/central/com/pyx4j/pyx4j-maven-plugins/1.0.1/pyx4j-maven-plugins-1.0.1.pom (2 KB at 16.7 KB/sec)
Downloading: https://repository-jclouds.forge.cloudbees.com/release/com/pyx4j/pyx4j/1.0.1/pyx4j-1.0.1.pom
Downloading: http://repo.cloudbees.com/content/repositories/central/com/pyx4j/pyx4j/1.0.1/pyx4j-1.0.1.pom
Downloaded: http://repo.cloudbees.com/content/repositories/central/com/pyx4j/pyx4j/1.0.1/pyx4j-1.0.1.pom (14 KB at 264.0 KB/sec)
Downloading: https://repository-jclouds.forge.cloudbees.com/release/commons-codec/commons-codec/1.5/commons-codec-1.5.jar
Downloading: https://repository-jclouds.forge.cloudbees.com/release/log4j/log4j/1.2.16/log4j-1.2.16.jar
Downloading: https://repository-jclouds.forge.cloudbees.com/release/org/slf4j/slf4j-api/1.6.1/slf4j-api-1.6.1.jar
Downloading: https://repository-jclouds.forge.cloudbees.com/release/org/slf4j/slf4j-log4j12/1.6.1/slf4j-log4j12-1.6.1.jar
Downloading: https://repository-jclouds.forge.cloudbees.com/release/com/pyx4j/maven-plugin-log4j/1.0.1/maven-plugin-log4j-1.0.1.jar
Downloading: http://repo.cloudbees.com/content/repositories/central/commons-codec/commons-codec/1.5/commons-codec-1.5.jar
Downloading: http://repo.cloudbees.com/content/repositories/central/log4j/log4j/1.2.16/log4j-1.2.16.jar
Downloading: http://repo.cloudbees.com/content/repositories/central/org/slf4j/slf4j-log4j12/1.6.1/slf4j-log4j12-1.6.1.jar
Downloading: http://repo.cloudbees.com/content/repositories/central/org/slf4j/slf4j-api/1.6.1/slf4j-api-1.6.1.jar
Downloading: http://repo.cloudbees.com/content/repositories/central/com/pyx4j/maven-plugin-log4j/1.0.1/maven-plugin-log4j-1.0.1.jar
Downloaded: http://repo.cloudbees.com/content/repositories/central/commons-codec/commons-codec/1.5/commons-codec-1.5.jar (72 KB at 10.9 KB/sec)
Downloaded: http://repo.cloudbees.com/content/repositories/central/org/slf4j/slf4j-api/1.6.1/slf4j-api-1.6.1.jar (25 KB at 3.8 KB/sec)
Downloaded: http://repo.cloudbees.com/content/repositories/central/log4j/log4j/1.2.16/log4j-1.2.16.jar (471 KB at 70.6 KB/sec)
Downloaded: http://repo.cloudbees.com/content/repositories/central/org/slf4j/slf4j-log4j12/1.6.1/slf4j-log4j12-1.6.1.jar (10 KB at 1.4 KB/sec)
Downloaded: http://repo.cloudbees.com/content/repositories/central/com/pyx4j/maven-plugin-log4j/1.0.1/maven-plugin-log4j-1.0.1.jar (4 KB at 0.5 KB/sec)
[INFO] Checking compile classpath
[INFO] Checking runtime classpath
[INFO] Checking test classpath
[INFO] 
[INFO] --- maven-install-plugin:2.4:install (default-install) @ jclouds-labs-aws ---
Downloading: https://repository-jclouds.forge.cloudbees.com/release/org/codehaus/plexus/plexus-digest/1.0/plexus-digest-1.0.pom
Downloading: http://repo.cloudbees.com/content/repositories/central/org/codehaus/plexus/plexus-digest/1.0/plexus-digest-1.0.pom
Downloaded: http://repo.cloudbees.com/content/repositories/central/org/codehaus/plexus/plexus-digest/1.0/plexus-digest-1.0.pom (2 KB at 0.2 KB/sec)
Downloading: https://repository-jclouds.forge.cloudbees.com/release/org/codehaus/plexus/plexus-components/1.1.7/plexus-components-1.1.7.pom
Downloading: http://repo.cloudbees.com/content/repositories/central/org/codehaus/plexus/plexus-components/1.1.7/plexus-components-1.1.7.pom
Downloaded: http://repo.cloudbees.com/content/repositories/central/org/codehaus/plexus/plexus-components/1.1.7/plexus-components-1.1.7.pom (5 KB at 285.8 KB/sec)
Downloading: https://repository-jclouds.forge.cloudbees.com/release/org/codehaus/plexus/plexus-digest/1.0/plexus-digest-1.0.jar
Downloading: http://repo.cloudbees.com/content/repositories/central/org/codehaus/plexus/plexus-digest/1.0/plexus-digest-1.0.jar
Downloaded: http://repo.cloudbees.com/content/repositories/central/org/codehaus/plexus/plexus-digest/1.0/plexus-digest-1.0.jar (12 KB at 723.8 KB/sec)
[INFO] Installing <https://jclouds.ci.cloudbees.com/job/jclouds-labs-aws/ws/pom.xml> to <https://jclouds.ci.cloudbees.com/job/jclouds-labs-aws/ws/.repository/org/apache/jclouds/labs/jclouds-labs-aws/1.8.0-SNAPSHOT/jclouds-labs-aws-1.8.0-SNAPSHOT.pom>
[INFO] Installing <https://jclouds.ci.cloudbees.com/job/jclouds-labs-aws/ws/target/jclouds-labs-aws-1.8.0-SNAPSHOT-tests.jar> to <https://jclouds.ci.cloudbees.com/job/jclouds-labs-aws/ws/.repository/org/apache/jclouds/labs/jclouds-labs-aws/1.8.0-SNAPSHOT/jclouds-labs-aws-1.8.0-SNAPSHOT-tests.jar>
[INFO] Installing <https://jclouds.ci.cloudbees.com/job/jclouds-labs-aws/ws/target/jclouds-labs-aws-1.8.0-SNAPSHOT-javadoc.jar> to <https://jclouds.ci.cloudbees.com/job/jclouds-labs-aws/ws/.repository/org/apache/jclouds/labs/jclouds-labs-aws/1.8.0-SNAPSHOT/jclouds-labs-aws-1.8.0-SNAPSHOT-javadoc.jar>
[INFO] 
[INFO] --- maven-deploy-plugin:2.7:deploy (default-deploy) @ jclouds-labs-aws ---
Downloading: https://repository-jclouds.forge.cloudbees.com/release/org/codehaus/plexus/plexus-utils/1.5.6/plexus-utils-1.5.6.jar
Downloading: http://repo.cloudbees.com/content/repositories/central/org/codehaus/plexus/plexus-utils/1.5.6/plexus-utils-1.5.6.jar
Downloaded: http://repo.cloudbees.com/content/repositories/central/org/codehaus/plexus/plexus-utils/1.5.6/plexus-utils-1.5.6.jar (245 KB at 7414.4 KB/sec)
Downloading: https://repository.apache.org/content/repositories/snapshots/org/apache/jclouds/labs/jclouds-labs-aws/1.8.0-SNAPSHOT/maven-metadata.xml
Downloaded: https://repository.apache.org/content/repositories/snapshots/org/apache/jclouds/labs/jclouds-labs-aws/1.8.0-SNAPSHOT/maven-metadata.xml (2 KB at 2.1 KB/sec)
Uploading: https://repository.apache.org/content/repositories/snapshots/org/apache/jclouds/labs/jclouds-labs-aws/1.8.0-SNAPSHOT/jclouds-labs-aws-1.8.0-20140718.170557-97.pom
Uploaded: https://repository.apache.org/content/repositories/snapshots/org/apache/jclouds/labs/jclouds-labs-aws/1.8.0-SNAPSHOT/jclouds-labs-aws-1.8.0-20140718.170557-97.pom (9 KB at 11.0 KB/sec)
Downloading: https://repository.apache.org/content/repositories/snapshots/org/apache/jclouds/labs/jclouds-labs-aws/maven-metadata.xml
Downloaded: https://repository.apache.org/content/repositories/snapshots/org/apache/jclouds/labs/jclouds-labs-aws/maven-metadata.xml (359 B at 0.4 KB/sec)
Uploading: https://repository.apache.org/content/repositories/snapshots/org/apache/jclouds/labs/jclouds-labs-aws/1.8.0-SNAPSHOT/maven-metadata.xml
Uploaded: https://repository.apache.org/content/repositories/snapshots/org/apache/jclouds/labs/jclouds-labs-aws/1.8.0-SNAPSHOT/maven-metadata.xml (2 KB at 3.3 KB/sec)
Uploading: https://repository.apache.org/content/repositories/snapshots/org/apache/jclouds/labs/jclouds-labs-aws/maven-metadata.xml
Uploaded: https://repository.apache.org/content/repositories/snapshots/org/apache/jclouds/labs/jclouds-labs-aws/maven-metadata.xml (359 B at 0.6 KB/sec)
Uploading: https://repository.apache.org/content/repositories/snapshots/org/apache/jclouds/labs/jclouds-labs-aws/1.8.0-SNAPSHOT/jclouds-labs-aws-1.8.0-20140718.170557-97-tests.jar
Uploaded: https://repository.apache.org/content/repositories/snapshots/org/apache/jclouds/labs/jclouds-labs-aws/1.8.0-SNAPSHOT/jclouds-labs-aws-1.8.0-20140718.170557-97-tests.jar (4 KB at 10.3 KB/sec)
Uploading: https://repository.apache.org/content/repositories/snapshots/org/apache/jclouds/labs/jclouds-labs-aws/1.8.0-SNAPSHOT/maven-metadata.xml
Uploaded: https://repository.apache.org/content/repositories/snapshots/org/apache/jclouds/labs/jclouds-labs-aws/1.8.0-SNAPSHOT/maven-metadata.xml (2 KB at 3.3 KB/sec)
Uploading: https://repository.apache.org/content/repositories/snapshots/org/apache/jclouds/labs/jclouds-labs-aws/1.8.0-SNAPSHOT/jclouds-labs-aws-1.8.0-20140718.170557-97-javadoc.jar
Uploaded: https://repository.apache.org/content/repositories/snapshots/org/apache/jclouds/labs/jclouds-labs-aws/1.8.0-SNAPSHOT/jclouds-labs-aws-1.8.0-20140718.170557-97-javadoc.jar (1470 KB at 499.2 KB/sec)
Uploading: https://repository.apache.org/content/repositories/snapshots/org/apache/jclouds/labs/jclouds-labs-aws/1.8.0-SNAPSHOT/maven-metadata.xml
Uploaded: https://repository.apache.org/content/repositories/snapshots/org/apache/jclouds/labs/jclouds-labs-aws/1.8.0-SNAPSHOT/maven-metadata.xml (2 KB at 3.2 KB/sec)
[INFO]                                                                         
[INFO] ------------------------------------------------------------------------
[INFO] Building jcloud elb api 1.8.0-SNAPSHOT
[INFO] ------------------------------------------------------------------------
Downloading: https://repository-jclouds.forge.cloudbees.com/release/org/apache/maven/plugins/maven-resources-plugin/2.6/maven-resources-plugin-2.6.pom
Downloading: http://repo.cloudbees.com/content/repositories/central/org/apache/maven/plugins/maven-resources-plugin/2.6/maven-resources-plugin-2.6.pom
[WARNING] The POM for org.apache.maven.plugins:maven-resources-plugin:jar:2.6 is missing, no dependency information available
[INFO] ------------------------------------------------------------------------
[INFO] Reactor Summary:
[INFO] 
[INFO] Apache jclouds labs aws ........................... SUCCESS [6:24.663s]
[INFO] jcloud elb api .................................... FAILURE [0.499s]
[INFO] jcloud iam api .................................... SKIPPED
[INFO] jcloud rds api .................................... SKIPPED
[INFO] jclouds glacier api ............................... SKIPPED
[INFO] jclouds Amazon Elastic Load Balancer provider ..... SKIPPED
[INFO] jclouds Amazon Identity and Access Management (IAM) provider  SKIPPED
[INFO] jclouds Amazon Relational Database Service provider  SKIPPED
[INFO] ------------------------------------------------------------------------
[INFO] BUILD FAILURE
[INFO] ------------------------------------------------------------------------
[INFO] Total time: 7:06.874s
[INFO] Finished at: Fri Jul 18 13:06:32 EDT 2014
[Unloading class GregorSamsa$2]
[Unloading class GregorSamsa$1]
[Unloading class GregorSamsa]
[Unloading class GregorSamsa$0]
[INFO] Final Memory: 22M/72M
[INFO] ------------------------------------------------------------------------
Waiting for Jenkins to finish collecting data
[ERROR] Plugin org.apache.maven.plugins:maven-resources-plugin:2.6 or one of its dependencies could not be resolved: Failed to read artifact descriptor for org.apache.maven.plugins:maven-resources-plugin:jar:2.6: Could not find artifact org.apache.maven.plugins:maven-resources-plugin:pom:2.6 in cloudbees-private-release-repository (https://repository-jclouds.forge.cloudbees.com/release) -> [Help 1]
org.apache.maven.plugin.PluginResolutionException: Plugin org.apache.maven.plugins:maven-resources-plugin:2.6 or one of its dependencies could not be resolved: Failed to read artifact descriptor for org.apache.maven.plugins:maven-resources-plugin:jar:2.6
	at org.apache.maven.plugin.internal.DefaultPluginDependenciesResolver.resolve(DefaultPluginDependenciesResolver.java:129)
	at org.apache.maven.plugin.internal.DefaultMavenPluginManager.getPluginDescriptor(DefaultMavenPluginManager.java:142)
	at org.apache.maven.plugin.internal.DefaultMavenPluginManager.getMojoDescriptor(DefaultMavenPluginManager.java:261)
	at org.apache.maven.plugin.DefaultBuildPluginManager.getMojoDescriptor(DefaultBuildPluginManager.java:185)
	at org.apache.maven.lifecycle.internal.DefaultLifecycleExecutionPlanCalculator.setupMojoExecution(DefaultLifecycleExecutionPlanCalculator.java:152)
	at org.apache.maven.lifecycle.internal.DefaultLifecycleExecutionPlanCalculator.setupMojoExecutions(DefaultLifecycleExecutionPlanCalculator.java:139)
	at org.apache.maven.lifecycle.internal.DefaultLifecycleExecutionPlanCalculator.calculateExecutionPlan(DefaultLifecycleExecutionPlanCalculator.java:116)
	at org.apache.maven.lifecycle.internal.DefaultLifecycleExecutionPlanCalculator.calculateExecutionPlan(DefaultLifecycleExecutionPlanCalculator.java:129)
	at org.apache.maven.lifecycle.internal.BuilderCommon.resolveBuildPlan(BuilderCommon.java:92)
	at org.apache.maven.lifecycle.internal.LifecycleModuleBuilder.buildProject(LifecycleModuleBuilder.java:81)
	at org.apache.maven.lifecycle.internal.LifecycleModuleBuilder.buildProject(LifecycleModuleBuilder.java:59)
	at org.apache.maven.lifecycle.internal.LifecycleStarter.singleThreadedBuild(LifecycleStarter.java:183)
	at org.apache.maven.lifecycle.internal.LifecycleStarter.execute(LifecycleStarter.java:161)
	at org.apache.maven.DefaultMaven.doExecute(DefaultMaven.java:319)
	at org.apache.maven.DefaultMaven.execute(DefaultMaven.java:156)
	at org.jvnet.hudson.maven3.launcher.Maven3Launcher.main(Maven3Launcher.java:117)
	at sun.reflect.NativeMethodAccessorImpl.invoke0(Native Method)
	at sun.reflect.NativeMethodAccessorImpl.invoke(NativeMethodAccessorImpl.java:39)
	at sun.reflect.DelegatingMethodAccessorImpl.invoke(DelegatingMethodAccessorImpl.java:25)
	at java.lang.reflect.Method.invoke(Method.java:597)
	at org.codehaus.plexus.classworlds.launcher.Launcher.launchStandard(Launcher.java:329)
	at org.codehaus.plexus.classworlds.launcher.Launcher.launch(Launcher.java:239)
	at org.jvnet.hudson.maven3.agent.Maven3Main.launch(Maven3Main.java:178)
	at sun.reflect.NativeMethodAccessorImpl.invoke0(Native Method)
	at sun.reflect.NativeMethodAccessorImpl.invoke(NativeMethodAccessorImpl.java:39)
	at sun.reflect.DelegatingMethodAccessorImpl.invoke(DelegatingMethodAccessorImpl.java:25)
	at java.lang.reflect.Method.invoke(Method.java:597)
	at hudson.maven.Maven3Builder.call(Maven3Builder.java:134)
	at hudson.maven.Maven3Builder.call(Maven3Builder.java:69)
	at hudson.remoting.UserRequest.perform(UserRequest.java:118)
	at hudson.remoting.UserRequest.perform(UserRequest.java:48)
	at hudson.remoting.Request$2.run(Request.java:328)
	at hudson.remoting.InterceptingExecutorService$1.call(InterceptingExecutorService.java:72)
	at java.util.concurrent.FutureTask$Sync.innerRun(FutureTask.java:303)
	at java.util.concurrent.FutureTask.run(FutureTask.java:138)
	at java.util.concurrent.ThreadPoolExecutor$Worker.runTask(ThreadPoolExecutor.java:895)
	at java.util.concurrent.ThreadPoolExecutor$Worker.run(ThreadPoolExecutor.java:918)
	at java.lang.Thread.run(Thread.java:662)
Caused by: org.sonatype.aether.resolution.ArtifactDescriptorException: Failed to read artifact descriptor for org.apache.maven.plugins:maven-resources-plugin:jar:2.6
	at org.apache.maven.repository.internal.DefaultArtifactDescriptorReader.loadPom(DefaultArtifactDescriptorReader.java:282)
	at org.apache.maven.repository.internal.DefaultArtifactDescriptorReader.readArtifactDescriptor(DefaultArtifactDescriptorReader.java:172)
	at org.sonatype.aether.impl.internal.DefaultRepositorySystem.readArtifactDescriptor(DefaultRepositorySystem.java:316)
	at org.apache.maven.plugin.internal.DefaultPluginDependenciesResolver.resolve(DefaultPluginDependenciesResolver.java:115)
	... 37 more
Caused by: org.sonatype.aether.resolution.ArtifactResolutionException: Could not find artifact org.apache.maven.plugins:maven-resources-plugin:pom:2.6 in cloudbees-private-release-repository (https://repository-jclouds.forge.cloudbees.com/release)
	at org.sonatype.aether.impl.internal.DefaultArtifactResolver.resolve(DefaultArtifactResolver.java:541)
	at org.sonatype.aether.impl.internal.DefaultArtifactResolver.resolveArtifacts(DefaultArtifactResolver.java:220)
	at org.sonatype.aether.impl.internal.DefaultArtifactResolver.resolveArtifact(DefaultArtifactResolver.java:197)
	at org.apache.maven.repository.internal.DefaultArtifactDescriptorReader.loadPom(DefaultArtifactDescriptorReader.java:267)
	... 40 more
Caused by: org.sonatype.aether.transfer.ArtifactNotFoundException: Could not find artifact org.apache.maven.plugins:maven-resources-plugin:pom:2.6 in cloudbees-private-release-repository (https://repository-jclouds.forge.cloudbees.com/release)
	at org.sonatype.aether.connector.wagon.WagonRepositoryConnector$4.wrap(WagonRepositoryConnector.java:945)
	at org.sonatype.aether.connector.wagon.WagonRepositoryConnector$4.wrap(WagonRepositoryConnector.java:940)
	at org.sonatype.aether.connector.wagon.WagonRepositoryConnector$GetTask.flush(WagonRepositoryConnector.java:695)
	at org.sonatype.aether.connector.wagon.WagonRepositoryConnector$GetTask.flush(WagonRepositoryConnector.java:689)
	at org.sonatype.aether.connector.wagon.WagonRepositoryConnector.get(WagonRepositoryConnector.java:445)
	at org.sonatype.aether.impl.internal.DefaultArtifactResolver.resolve(DefaultArtifactResolver.java:460)
	... 43 more
[ERROR] 
[ERROR] Re-run Maven using the -X switch to enable full debug logging.
[ERROR] 
[JENKINS] Archiving <https://jclouds.ci.cloudbees.com/job/jclouds-labs-aws/ws/aws-elb/pom.xml> to org.apache.jclouds.labs/aws-elb/1.8.0-SNAPSHOT/aws-elb-1.8.0-SNAPSHOT.pom
[ERROR] For more information about the errors and possible solutions, please read the following articles:
[ERROR] [Help 1] http://cwiki.apache.org/confluence/display/MAVEN/PluginResolutionException
[JENKINS] Archiving <https://jclouds.ci.cloudbees.com/job/jclouds-labs-aws/ws/glacier/pom.xml> to org.apache.jclouds.labs/glacier/1.8.0-SNAPSHOT/glacier-1.8.0-SNAPSHOT.pom
[JENKINS] Archiving <https://jclouds.ci.cloudbees.com/job/jclouds-labs-aws/ws/aws-iam/pom.xml> to org.apache.jclouds.labs/aws-iam/1.8.0-SNAPSHOT/aws-iam-1.8.0-SNAPSHOT.pom
[JENKINS] Archiving <https://jclouds.ci.cloudbees.com/job/jclouds-labs-aws/ws/pom.xml> to org.apache.jclouds.labs/jclouds-labs-aws/1.8.0-SNAPSHOT/jclouds-labs-aws-1.8.0-SNAPSHOT.pom
[JENKINS] Archiving <https://jclouds.ci.cloudbees.com/job/jclouds-labs-aws/ws/target/jclouds-labs-aws-1.8.0-SNAPSHOT-tests.jar> to org.apache.jclouds.labs/jclouds-labs-aws/1.8.0-20140718.170557-97/jclouds-labs-aws-1.8.0-20140718.170557-97-tests.jar
[JENKINS] Archiving <https://jclouds.ci.cloudbees.com/job/jclouds-labs-aws/ws/target/jclouds-labs-aws-1.8.0-SNAPSHOT-javadoc.jar> to org.apache.jclouds.labs/jclouds-labs-aws/1.8.0-20140718.170557-97/jclouds-labs-aws-1.8.0-20140718.170557-97-javadoc.jar
[JENKINS] Archiving <https://jclouds.ci.cloudbees.com/job/jclouds-labs-aws/ws/rds/pom.xml> to org.apache.jclouds.labs/rds/1.8.0-SNAPSHOT/rds-1.8.0-SNAPSHOT.pom
[JENKINS] Archiving <https://jclouds.ci.cloudbees.com/job/jclouds-labs-aws/ws/elb/pom.xml> to org.apache.jclouds.labs/elb/1.8.0-SNAPSHOT/elb-1.8.0-SNAPSHOT.pom
[JENKINS] Archiving <https://jclouds.ci.cloudbees.com/job/jclouds-labs-aws/ws/iam/pom.xml> to org.apache.jclouds.labs/iam/1.8.0-SNAPSHOT/iam-1.8.0-SNAPSHOT.pom
[JENKINS] Archiving <https://jclouds.ci.cloudbees.com/job/jclouds-labs-aws/ws/aws-rds/pom.xml> to org.apache.jclouds.labs/aws-rds/1.8.0-SNAPSHOT/aws-rds-1.8.0-SNAPSHOT.pom
Sending e-mails to: notifications@jclouds.apache.org
channel stopped

Jenkins build is back to normal : jclouds-labs-aws #142

Posted by je...@cloudbees.com.
See <https://jclouds.ci.cloudbees.com/job/jclouds-labs-aws/142/changes>