You are viewing a plain text version of this content. The canonical link for it is here.
Posted to builds@beam.apache.org by Apache Jenkins Server <je...@builds.apache.org> on 2023/11/13 10:20:45 UTC

Build failed in Jenkins: beam_PostCommit_Java_PVR_Spark_Batch #2719

See <https://ci-beam.apache.org/job/beam_PostCommit_Java_PVR_Spark_Batch/2719/display/redirect?page=changes>

Changes:

[noreply] Add getters to CheckResult in IT framework (#29411)


------------------------------------------
Started by timer
Running as SYSTEM
[EnvInject] - Loading node environment variables.
Building remotely on apache-beam-jenkins-11 (beam) in workspace <https://ci-beam.apache.org/job/beam_PostCommit_Java_PVR_Spark_Batch/ws/>
The recommended git tool is: NONE
No credentials specified
Wiping out workspace first.
Cloning the remote Git repository
Using shallow clone with depth 1
Avoid fetching tags
Cloning repository https://github.com/apache/beam.git
 > git init <https://ci-beam.apache.org/job/beam_PostCommit_Java_PVR_Spark_Batch/ws/src> # timeout=10
Fetching upstream changes from https://github.com/apache/beam.git
 > git --version # timeout=10
 > git --version # 'git version 2.25.1'
 > git fetch --no-tags --force --progress --depth=1 -- https://github.com/apache/beam.git +refs/heads/*:refs/remotes/origin/* # timeout=10
 > git config remote.origin.url https://github.com/apache/beam.git # timeout=10
 > git config --add remote.origin.fetch +refs/heads/*:refs/remotes/origin/* # timeout=10
 > git config remote.origin.url https://github.com/apache/beam.git # timeout=10
Using shallow fetch with depth 1
Fetching upstream changes from https://github.com/apache/beam.git
 > git fetch --no-tags --force --progress --depth=1 -- https://github.com/apache/beam.git +refs/heads/*:refs/remotes/origin/* +refs/pull/${ghprbPullId}/*:refs/remotes/origin/pr/${ghprbPullId}/* # timeout=10
 > git rev-parse origin/master^{commit} # timeout=10
Checking out Revision 8fa5b19f5468c716e16c688994b538cc2abd3811 (origin/master)
 > git config core.sparsecheckout # timeout=10
 > git checkout -f 8fa5b19f5468c716e16c688994b538cc2abd3811 # timeout=10
Commit message: "Add getters to CheckResult in IT framework (#29411)"
 > git rev-list --no-walk 2ad459113134dfffd3caeeb15e821bb644e08663 # timeout=10
No emails were triggered.
[EnvInject] - Executing scripts and injecting environment variables after the SCM step.
[EnvInject] - Injecting as environment variables the properties content 
SETUPTOOLS_USE_DISTUTILS=stdlib
SPARK_LOCAL_IP=127.0.0.1

[EnvInject] - Variables injected successfully.
[Gradle] - Launching build.
[src] $ <https://ci-beam.apache.org/job/beam_PostCommit_Java_PVR_Spark_Batch/ws/src/gradlew> --continue --max-workers=8 -Dorg.gradle.jvmargs=-Xms2g -Dorg.gradle.jvmargs=-Xmx6g -Dorg.gradle.vfs.watch=false -Pdocker-pull-licenses :runners:spark:3:job-server:validatesPortableRunnerBatch :runners:spark:3:job-server:validatesPortableRunnerDocker
To honour the JVM settings for this build a single-use Daemon process will be forked. For more on this, please refer to https://docs.gradle.org/8.4/userguide/gradle_daemon.html#sec:disabling_the_daemon in the Gradle documentation.
Daemon will be stopped at the end of the build 
Configuration on demand is an incubating feature.
Gradle Enterprise plugins resolution: https://plugins.gradle.org/m2
Enforcing Gradle Enterprise: https://ge.apache.org, allowUntrustedServer: false
> Task :buildSrc:compileJava NO-SOURCE
> Task :buildSrc:compileGroovy FROM-CACHE
> Task :buildSrc:pluginDescriptors
> Task :buildSrc:processResources
> Task :buildSrc:classes
> Task :buildSrc:jar

> Configure project :sdks:java:container:java8
docker-pull-licenses set, creating go-licenses
System Go installation: /snap/bin/go is go version go1.16.15 linux/amd64; Preparing to use /home/jenkins/go/bin/go1.21.4
/home/jenkins/go/pkg/mod/golang.org/dl@v0.0.0-20231107201224-8165dcd93058/go1.21.4/main.go:20:8: //go:build comment without // +build comment

FAILURE: Build failed with an exception.

* What went wrong:
Could not determine the dependencies of task ':sdks:java:container:goBuild'.
> Could not create task ':sdks:java:container:goPrepare'.
   > Process 'command 'sh'' finished with non-zero exit value 1

* Try:
> Run with --stacktrace option to get the stack trace.
> Run with --info or --debug option to get more log output.
> Get more help at https://help.gradle.org.

Deprecated Gradle features were used in this build, making it incompatible with Gradle 9.0.

You can use '--warning-mode all' to show the individual deprecation warnings and determine if they come from your own scripts or plugins.

For more on this, please refer to https://docs.gradle.org/8.4/userguide/command_line_interface.html#sec:command_line_warnings in the Gradle documentation.

BUILD FAILED in 20s
4 actionable tasks: 3 executed, 1 from cache

Publishing build scan...
https://ge.apache.org/s/vhetiaivwssms

Build step 'Invoke Gradle script' changed build result to FAILURE
Build step 'Invoke Gradle script' marked build as failure

---------------------------------------------------------------------
To unsubscribe, e-mail: builds-unsubscribe@beam.apache.org
For additional commands, e-mail: builds-help@beam.apache.org


Jenkins build is back to normal : beam_PostCommit_Java_PVR_Spark_Batch #2725

Posted by Apache Jenkins Server <je...@builds.apache.org>.
See <https://ci-beam.apache.org/job/beam_PostCommit_Java_PVR_Spark_Batch/2725/display/redirect>


---------------------------------------------------------------------
To unsubscribe, e-mail: builds-unsubscribe@beam.apache.org
For additional commands, e-mail: builds-help@beam.apache.org


Build failed in Jenkins: beam_PostCommit_Java_PVR_Spark_Batch #2724

Posted by Apache Jenkins Server <je...@builds.apache.org>.
See <https://ci-beam.apache.org/job/beam_PostCommit_Java_PVR_Spark_Batch/2724/display/redirect?page=changes>

Changes:

[noreply] Merge pull request #29330: TPC-DS query processing should fail if output


------------------------------------------
[...truncated 42.54 KB...]
> Task :release:go-licenses:java:dockerPrepare

> Task :release:go-licenses:java:docker
#1 [internal] load build definition from Dockerfile
#1 transferring dockerfile: 1.24kB done
#1 DONE 0.0s

#2 [internal] load .dockerignore
#2 transferring context: 2B done
#2 DONE 0.0s

#3 [internal] load metadata for docker.io/library/golang:1.20-bullseye
#3 DONE 0.3s

#4 [1/5] FROM docker.io/library/golang:1.20-bullseye@sha256:6ca808ba2b9fd81a04dec98345a40c53f2c90d7b70dfb47e32cbe652f216ad4c
#4 DONE 0.0s

#5 [internal] load build context
#5 transferring context: 1.96kB 0.0s done
#5 DONE 0.0s

#6 [2/5] WORKDIR /usr/src/app
#6 CACHED

#7 [3/5] COPY go.mod ./
#7 CACHED

#8 [4/5] RUN go install github.com/google/go-licenses@latest
#8 CACHED

#9 [5/5] COPY get-licenses.sh /opt/apache/beam/
#9 CACHED

#10 exporting to image
#10 exporting layers done
#10 writing image sha256:53b7c9560183a6729641a84f7db4bf455b3576b4c079490f58ca4b0719f54de1 done
#10 naming to docker.io/library/golicenses-java done
#10 DONE 0.0s

> Task :sdks:java:container:pullLicenses
Collecting setuptools
  Using cached setuptools-68.2.2-py3-none-any.whl (807 kB)
Collecting wheel
  Using cached wheel-0.41.3-py3-none-any.whl (65 kB)
Installing collected packages: pip, setuptools, wheel
  Attempting uninstall: pip
    Found existing installation: pip 20.0.2
    Uninstalling pip-20.0.2:
      Successfully uninstalled pip-20.0.2
  Attempting uninstall: setuptools
    Found existing installation: setuptools 44.0.0
    Uninstalling setuptools-44.0.0:
      Successfully uninstalled setuptools-44.0.0
Successfully installed pip-23.3.1 setuptools-68.2.2 wheel-0.41.3
Collecting beautifulsoup4<5.0,>=4.9.0 (from -r <https://ci-beam.apache.org/job/beam_PostCommit_Java_PVR_Spark_Batch/ws/src/sdks/java/container/license_scripts/requirement.txt> (line 19))
  Using cached beautifulsoup4-4.12.2-py3-none-any.whl (142 kB)
Collecting pyyaml<7,>=6.0.1 (from -r <https://ci-beam.apache.org/job/beam_PostCommit_Java_PVR_Spark_Batch/ws/src/sdks/java/container/license_scripts/requirement.txt> (line 20))
  Using cached PyYAML-6.0.1-cp38-cp38-manylinux_2_17_x86_64.manylinux2014_x86_64.whl.metadata (2.1 kB)
Collecting tenacity<9.0,>=6.1.0 (from -r <https://ci-beam.apache.org/job/beam_PostCommit_Java_PVR_Spark_Batch/ws/src/sdks/java/container/license_scripts/requirement.txt> (line 21))
  Using cached tenacity-8.2.3-py3-none-any.whl.metadata (1.0 kB)
Collecting soupsieve>1.2 (from beautifulsoup4<5.0,>=4.9.0->-r <https://ci-beam.apache.org/job/beam_PostCommit_Java_PVR_Spark_Batch/ws/src/sdks/java/container/license_scripts/requirement.txt> (line 19))
  Using cached soupsieve-2.5-py3-none-any.whl.metadata (4.7 kB)
Using cached PyYAML-6.0.1-cp38-cp38-manylinux_2_17_x86_64.manylinux2014_x86_64.whl (736 kB)
Using cached tenacity-8.2.3-py3-none-any.whl (24 kB)
Using cached soupsieve-2.5-py3-none-any.whl (36 kB)
Installing collected packages: tenacity, soupsieve, pyyaml, beautifulsoup4
Successfully installed beautifulsoup4-4.12.2 pyyaml-6.0.1 soupsieve-2.5 tenacity-8.2.3
Executing python <https://ci-beam.apache.org/job/beam_PostCommit_Java_PVR_Spark_Batch/ws/src/sdks/java/container/license_scripts/pull_licenses_java.py> --license_index=<https://ci-beam.apache.org/job/beam_PostCommit_Java_PVR_Spark_Batch/ws/src/sdks/java/container/build/reports/dependency-license/index.json>        --output_dir=<https://ci-beam.apache.org/job/beam_PostCommit_Java_PVR_Spark_Batch/ws/src/sdks/java/container/build/target/java_third_party_licenses>        --dep_url_yaml=<https://ci-beam.apache.org/job/beam_PostCommit_Java_PVR_Spark_Batch/ws/src/sdks/java/container/license_scripts/dep_urls_java.yaml>        --manual_license_path=<https://ci-beam.apache.org/job/beam_PostCommit_Java_PVR_Spark_Batch/ws/src/sdks/java/container/license_scripts/manual_licenses>
INFO:root:Pulling license for 126 dependencies using 16 threads.
INFO:root:Replaced local file URL with file://<https://ci-beam.apache.org/job/beam_PostCommit_Java_PVR_Spark_Batch/ws/src/sdks/java/container/license_scripts/manual_licenses/xz/COPYING> for xz-1.5
INFO:root:pull_licenses_java.py succeed. It took 1.480111 seconds with 16 threads.
Copying licenses from <https://ci-beam.apache.org/job/beam_PostCommit_Java_PVR_Spark_Batch/ws/src/sdks/java/container/build/target/java_third_party_licenses> to <https://ci-beam.apache.org/job/beam_PostCommit_Java_PVR_Spark_Batch/ws/src/sdks/java/container/build/target/third_party_licenses.>
Finished license_scripts.sh

> Task :release:go-licenses:java:dockerRun
+ rm -rf '/output/*'
+ go get github.com/apache/beam/sdks/v2/java/container
go: downloading github.com/apache/beam/sdks/v2 v2.51.0
go: downloading github.com/apache/beam v2.51.0+incompatible

> Task :sdks:java:container:java8:copyJavaThirdPartyLicenses

> Task :sdks:java:container:downloadCloudProfilerAgent
  % Total    % Received % Xferd  Average Speed   Time    Time     Time  Current
                                 Dload  Upload   Total   Spent    Left  Speed
  0     0    0     0    0     0      0      0 --:--:-- --:--:-- --:--:--     0version.txt
NOTICES
profiler_java_agent.so
100 4183k  100 4183k    0     0  22.0M      0 --:--:-- --:--:-- --:--:-- 22.0M

> Task :sdks:java:container:goPrepare UP-TO-DATE

> Task :sdks:java:container:goBuild
/home/jenkins/go/bin/go1.21.4 build -o ./build/target/linux_amd64/boot boot.go boot_test.go pathingjar.go pathingjar_test.go

> Task :sdks:java:container:java8:copySdkHarnessLauncher

> Task :release:go-licenses:java:dockerRun
go: downloading google.golang.org/grpc v1.58.1
go: downloading github.com/golang/protobuf v1.5.3
go: downloading google.golang.org/protobuf v1.31.0
go: downloading golang.org/x/sys v0.12.0
go: downloading google.golang.org/genproto/googleapis/rpc v0.0.0-20230913181813-007df8e322eb
go: downloading golang.org/x/net v0.15.0
go: downloading google.golang.org/genproto v0.0.0-20230821184602-ccc8af3d0e93
go: downloading golang.org/x/text v0.13.0
go: added github.com/apache/beam/sdks/v2 v2.51.0
go: added github.com/golang/protobuf v1.5.3
go: added golang.org/x/net v0.15.0
go: added golang.org/x/sys v0.12.0
go: added golang.org/x/text v0.13.0
go: added google.golang.org/genproto/googleapis/rpc v0.0.0-20230913181813-007df8e322eb
go: added google.golang.org/grpc v1.58.1
go: added google.golang.org/protobuf v1.31.0
+ go-licenses save github.com/apache/beam/sdks/v2/java/container --save_path=/output/licenses
W1114 16:21:04.893131      33 library.go:101] "golang.org/x/sys/unix" contains non-Go code that can't be inspected for further dependencies:
/go/pkg/mod/golang.org/x/sys@v0.12.0/unix/asm_linux_amd64.s
+ go-licenses csv github.com/apache/beam/sdks/v2/java/container
+ tee /output/licenses/list.csv
W1114 16:21:11.295280      77 library.go:101] "golang.org/x/sys/unix" contains non-Go code that can't be inspected for further dependencies:
/go/pkg/mod/golang.org/x/sys@v0.12.0/unix/asm_linux_amd64.s
github.com/apache/beam/sdks/v2/go,https://github.com/apache/beam/blob/sdks/v2.51.0/sdks/go/README.md,Apache-2.0
github.com/apache/beam/sdks/v2/java/container,https://github.com/apache/beam/blob/sdks/v2.51.0/sdks/LICENSE,Apache-2.0
github.com/golang/protobuf,https://github.com/golang/protobuf/blob/v1.5.3/LICENSE,BSD-3-Clause
golang.org/x/net,https://cs.opensource.google/go/x/net/+/v0.15.0:LICENSE,BSD-3-Clause
golang.org/x/sys/unix,https://cs.opensource.google/go/x/sys/+/v0.12.0:LICENSE,BSD-3-Clause
golang.org/x/text,https://cs.opensource.google/go/x/text/+/v0.13.0:LICENSE,BSD-3-Clause
google.golang.org/genproto/googleapis/rpc/status,https://github.com/googleapis/go-genproto/blob/007df8e322eb/googleapis/rpc/LICENSE,Apache-2.0
google.golang.org/grpc,https://github.com/grpc/grpc-go/blob/v1.58.1/LICENSE,Apache-2.0
google.golang.org/protobuf,https://github.com/protocolbuffers/protobuf-go/blob/v1.31.0/LICENSE,BSD-3-Clause
+ chmod -R a+w /output/licenses

> Task :runners:spark:3:job-server:validatesPortableRunnerBatch
> Task :release:go-licenses:java:createLicenses
> Task :sdks:java:container:java8:copyGolangLicenses
> Task :sdks:java:container:java8:dockerPrepare

> Task :sdks:java:container:java8:docker
#1 [internal] load .dockerignore
#1 transferring context: 2B done
#1 DONE 1.5s

#2 [internal] load build definition from Dockerfile
#2 transferring dockerfile: 2.59kB done
#2 DONE 2.9s

#3 [internal] load metadata for docker.io/library/eclipse-temurin:8
#3 DONE 1.5s

#4 [ 1/16] FROM docker.io/library/eclipse-temurin:8@sha256:2dd6410e398413f7cab3054dd4da1652cb98dc0fafa594d139cd4675694bbfaf
#4 CACHED

#5 [internal] load build context
#5 transferring context: 47.29MB 0.4s done
#5 DONE 0.5s

#6 [ 2/16] ADD target/slf4j-api.jar /opt/apache/beam/jars/
#6 DONE 1.3s

#7 [ 3/16] ADD target/slf4j-jdk14.jar /opt/apache/beam/jars/
#7 DONE 0.0s

#8 [ 4/16] ADD target/jcl-over-slf4j.jar /opt/apache/beam/jars/
#8 DONE 0.1s

#9 [ 5/16] ADD target/log4j-over-slf4j.jar /opt/apache/beam/jars/
#9 DONE 0.0s

#10 [ 6/16] ADD target/log4j-to-slf4j.jar /opt/apache/beam/jars/
#10 DONE 0.0s

#11 [ 7/16] ADD target/beam-sdks-java-harness.jar /opt/apache/beam/jars/
#11 DONE 0.1s

#12 [ 8/16] COPY target/jamm.jar target/open-module-agent*.jar /opt/apache/beam/jars/
#12 DONE 0.1s

#13 [ 9/16] COPY target/linux_amd64/boot /opt/apache/beam/
#13 DONE 0.2s

#14 [10/16] COPY target/LICENSE /opt/apache/beam/
#14 DONE 0.1s

#15 [11/16] COPY target/NOTICE /opt/apache/beam/
#15 DONE 0.1s

#16 [12/16] ADD target/third_party_licenses /opt/apache/beam/third_party_licenses/
#16 DONE 0.2s

#17 [13/16] COPY target/LICENSE target/options/* /opt/apache/beam/options/
#17 DONE 0.1s

#18 [14/16] COPY target/go-licenses/* /opt/apache/beam/third_party_licenses/golang/
#18 DONE 0.1s

#19 [15/16] RUN if [ "true" = "false" ] ; then     rm -rf /opt/apache/beam/third_party_licenses ;    fi
#19 DONE 0.5s

#20 [16/16] COPY target/profiler/* /opt/google_cloud_profiler/
#20 DONE 0.1s

#21 exporting to image
#21 exporting layers
#21 exporting layers 0.3s done
#21 writing image sha256:fb4958e5a16328d1bfeeb1a1a9c3a19d1aca0898c04cc129b8251bd157fc3664 done
#21 naming to docker.io/apache/beam_java8_sdk:2.53.0.dev done
#21 DONE 0.3s
[shutdown-hook-0] INFO org.apache.spark.util.ShutdownHookManager - Shutdown hook called
[shutdown-hook-0] INFO org.apache.spark.util.ShutdownHookManager - Deleting directory /tmp/spark-efcfc1cd-9b05-4f1e-98f5-048677d63604

> Task :runners:spark:3:job-server:validatesPortableRunnerBatch

org.apache.beam.sdk.transforms.ParDoTest$MultipleInputsAndOutputTests > testMultiOutputParDoWithSideInputsIsCumulative FAILED
    java.lang.RuntimeException at ParDoTest.java:1289

[shutdown-hook-0] INFO org.apache.spark.util.ShutdownHookManager - Shutdown hook called
[shutdown-hook-0] INFO org.apache.spark.util.ShutdownHookManager - Deleting directory /tmp/spark-8cd26263-4823-4124-9b6a-ee620da41d8c
[shutdown-hook-0] INFO org.apache.spark.util.ShutdownHookManager - Shutdown hook called
[shutdown-hook-0] INFO org.apache.spark.util.ShutdownHookManager - Deleting directory /tmp/spark-75870f02-af3c-4ee6-b75c-13be75b555c2
[shutdown-hook-0] INFO org.apache.spark.util.ShutdownHookManager - Shutdown hook called
[shutdown-hook-0] INFO org.apache.spark.util.ShutdownHookManager - Deleting directory /tmp/spark-fd9f2328-552e-40ca-9550-2649d24a7c2f

> Task :runners:spark:3:job-server:validatesPortableRunnerBatch

233 tests completed, 1 failed, 1 skipped

> Task :runners:spark:3:job-server:validatesPortableRunnerBatch FAILED
> Task :runners:spark:3:job-server:validatesPortableRunnerDocker FROM-CACHE

FAILURE: Build failed with an exception.

* What went wrong:
Execution failed for task ':runners:spark:3:job-server:validatesPortableRunnerBatch'.
> There were failing tests. See the report at: file://<https://ci-beam.apache.org/job/beam_PostCommit_Java_PVR_Spark_Batch/ws/src/runners/spark/3/job-server/build/reports/tests/validatesPortableRunnerBatch/index.html>

Deprecated Gradle features were used in this build, making it incompatible with Gradle 9.0.

You can use '--warning-mode all' to show the individual deprecation warnings and determine if they come from your own scripts or plugins.

For more on this, please refer to https://docs.gradle.org/8.4/userguide/command_line_interface.html#sec:command_line_warnings in the Gradle documentation.

BUILD FAILED in 1h 44m 51s
121 actionable tasks: 78 executed, 41 from cache, 2 up-to-date

Publishing build scan...
https://ge.apache.org/s/uvh5jfkvyse2u

Build step 'Invoke Gradle script' changed build result to FAILURE
Build step 'Invoke Gradle script' marked build as failure

---------------------------------------------------------------------
To unsubscribe, e-mail: builds-unsubscribe@beam.apache.org
For additional commands, e-mail: builds-help@beam.apache.org


Build failed in Jenkins: beam_PostCommit_Java_PVR_Spark_Batch #2723

Posted by Apache Jenkins Server <je...@builds.apache.org>.
See <https://ci-beam.apache.org/job/beam_PostCommit_Java_PVR_Spark_Batch/2723/display/redirect>

Changes:


------------------------------------------
[...truncated 43.38 KB...]
#2 DONE 0.0s

#3 [internal] load metadata for docker.io/library/golang:1.20-bullseye
#3 DONE 0.3s

#4 [1/5] FROM docker.io/library/golang:1.20-bullseye@sha256:6ca808ba2b9fd81a04dec98345a40c53f2c90d7b70dfb47e32cbe652f216ad4c
#4 DONE 0.0s

#5 [internal] load build context
#5 transferring context: 1.96kB 0.0s done
#5 DONE 0.0s

#6 [2/5] WORKDIR /usr/src/app
#6 CACHED

#7 [3/5] COPY go.mod ./
#7 CACHED

#8 [4/5] RUN go install github.com/google/go-licenses@latest
#8 CACHED

#9 [5/5] COPY get-licenses.sh /opt/apache/beam/
#9 CACHED

#10 exporting to image
#10 exporting layers done
#10 writing image sha256:53b7c9560183a6729641a84f7db4bf455b3576b4c079490f58ca4b0719f54de1
#10 writing image sha256:53b7c9560183a6729641a84f7db4bf455b3576b4c079490f58ca4b0719f54de1 done
#10 naming to docker.io/library/golicenses-java done
#10 DONE 0.0s

> Task :sdks:java:container:pullLicenses
Collecting setuptools
  Using cached setuptools-68.2.2-py3-none-any.whl (807 kB)
Collecting wheel
  Using cached wheel-0.41.3-py3-none-any.whl (65 kB)
Installing collected packages: pip, setuptools, wheel
  Attempting uninstall: pip
    Found existing installation: pip 20.0.2
    Uninstalling pip-20.0.2:
      Successfully uninstalled pip-20.0.2
  Attempting uninstall: setuptools
    Found existing installation: setuptools 44.0.0
    Uninstalling setuptools-44.0.0:
      Successfully uninstalled setuptools-44.0.0
Successfully installed pip-23.3.1 setuptools-68.2.2 wheel-0.41.3
Collecting beautifulsoup4<5.0,>=4.9.0 (from -r <https://ci-beam.apache.org/job/beam_PostCommit_Java_PVR_Spark_Batch/ws/src/sdks/java/container/license_scripts/requirement.txt> (line 19))
  Using cached beautifulsoup4-4.12.2-py3-none-any.whl (142 kB)
Collecting pyyaml<7,>=6.0.1 (from -r <https://ci-beam.apache.org/job/beam_PostCommit_Java_PVR_Spark_Batch/ws/src/sdks/java/container/license_scripts/requirement.txt> (line 20))
  Using cached PyYAML-6.0.1-cp38-cp38-manylinux_2_17_x86_64.manylinux2014_x86_64.whl.metadata (2.1 kB)
Collecting tenacity<9.0,>=6.1.0 (from -r <https://ci-beam.apache.org/job/beam_PostCommit_Java_PVR_Spark_Batch/ws/src/sdks/java/container/license_scripts/requirement.txt> (line 21))
  Using cached tenacity-8.2.3-py3-none-any.whl.metadata (1.0 kB)
Collecting soupsieve>1.2 (from beautifulsoup4<5.0,>=4.9.0->-r <https://ci-beam.apache.org/job/beam_PostCommit_Java_PVR_Spark_Batch/ws/src/sdks/java/container/license_scripts/requirement.txt> (line 19))
  Using cached soupsieve-2.5-py3-none-any.whl.metadata (4.7 kB)
Using cached PyYAML-6.0.1-cp38-cp38-manylinux_2_17_x86_64.manylinux2014_x86_64.whl (736 kB)
Using cached tenacity-8.2.3-py3-none-any.whl (24 kB)
Using cached soupsieve-2.5-py3-none-any.whl (36 kB)
Installing collected packages: tenacity, soupsieve, pyyaml, beautifulsoup4
Successfully installed beautifulsoup4-4.12.2 pyyaml-6.0.1 soupsieve-2.5 tenacity-8.2.3
Executing python <https://ci-beam.apache.org/job/beam_PostCommit_Java_PVR_Spark_Batch/ws/src/sdks/java/container/license_scripts/pull_licenses_java.py> --license_index=<https://ci-beam.apache.org/job/beam_PostCommit_Java_PVR_Spark_Batch/ws/src/sdks/java/container/build/reports/dependency-license/index.json>        --output_dir=<https://ci-beam.apache.org/job/beam_PostCommit_Java_PVR_Spark_Batch/ws/src/sdks/java/container/build/target/java_third_party_licenses>        --dep_url_yaml=<https://ci-beam.apache.org/job/beam_PostCommit_Java_PVR_Spark_Batch/ws/src/sdks/java/container/license_scripts/dep_urls_java.yaml>        --manual_license_path=<https://ci-beam.apache.org/job/beam_PostCommit_Java_PVR_Spark_Batch/ws/src/sdks/java/container/license_scripts/manual_licenses>
INFO:root:Pulling license for 126 dependencies using 16 threads.
INFO:root:Replaced local file URL with file://<https://ci-beam.apache.org/job/beam_PostCommit_Java_PVR_Spark_Batch/ws/src/sdks/java/container/license_scripts/manual_licenses/xz/COPYING> for xz-1.5
INFO:root:pull_licenses_java.py succeed. It took 1.373005 seconds with 16 threads.
Copying licenses from <https://ci-beam.apache.org/job/beam_PostCommit_Java_PVR_Spark_Batch/ws/src/sdks/java/container/build/target/java_third_party_licenses> to <https://ci-beam.apache.org/job/beam_PostCommit_Java_PVR_Spark_Batch/ws/src/sdks/java/container/build/target/third_party_licenses.>
Finished license_scripts.sh

> Task :release:go-licenses:java:dockerRun
+ rm -rf '/output/*'
+ go get github.com/apache/beam/sdks/v2/java/container
go: downloading github.com/apache/beam/sdks/v2 v2.51.0
go: downloading github.com/apache/beam v2.51.0+incompatible

> Task :sdks:java:container:java8:copyJavaThirdPartyLicenses

> Task :sdks:java:container:downloadCloudProfilerAgent
  % Total    % Received % Xferd  Average Speed   Time    Time     Time  Current
                                 Dload  Upload   Total   Spent    Left  Speed
  0     0    0     0    0     0      0      0 --:--:-- --:--:-- --:--:--     0version.txt
NOTICES
profiler_java_agent.so
100 4183k  100 4183k    0     0  20.5M      0 --:--:-- --:--:-- --:--:-- 20.5M

> Task :sdks:java:container:goPrepare UP-TO-DATE

> Task :sdks:java:container:goBuild
/home/jenkins/go/bin/go1.21.4 build -o ./build/target/linux_amd64/boot boot.go boot_test.go pathingjar.go pathingjar_test.go

> Task :sdks:java:container:java8:copySdkHarnessLauncher

> Task :release:go-licenses:java:dockerRun
go: downloading github.com/golang/protobuf v1.5.3
go: downloading google.golang.org/grpc v1.58.1
go: downloading google.golang.org/protobuf v1.31.0
go: downloading golang.org/x/sys v0.12.0
go: downloading golang.org/x/net v0.15.0
go: downloading google.golang.org/genproto/googleapis/rpc v0.0.0-20230913181813-007df8e322eb
go: downloading google.golang.org/genproto v0.0.0-20230821184602-ccc8af3d0e93
go: downloading golang.org/x/text v0.13.0
go: added github.com/apache/beam/sdks/v2 v2.51.0
go: added github.com/golang/protobuf v1.5.3
go: added golang.org/x/net v0.15.0
go: added golang.org/x/sys v0.12.0
go: added golang.org/x/text v0.13.0
go: added google.golang.org/genproto/googleapis/rpc v0.0.0-20230913181813-007df8e322eb
go: added google.golang.org/grpc v1.58.1
go: added google.golang.org/protobuf v1.31.0
+ go-licenses save github.com/apache/beam/sdks/v2/java/container --save_path=/output/licenses
W1114 10:21:03.767663      36 library.go:101] "golang.org/x/sys/unix" contains non-Go code that can't be inspected for further dependencies:
/go/pkg/mod/golang.org/x/sys@v0.12.0/unix/asm_linux_amd64.s
+ go-licenses csv github.com/apache/beam/sdks/v2/java/container
+ tee /output/licenses/list.csv
W1114 10:21:10.556467      78 library.go:101] "golang.org/x/sys/unix" contains non-Go code that can't be inspected for further dependencies:
/go/pkg/mod/golang.org/x/sys@v0.12.0/unix/asm_linux_amd64.s
github.com/apache/beam/sdks/v2/go,https://github.com/apache/beam/blob/sdks/v2.51.0/sdks/go/README.md,Apache-2.0
github.com/apache/beam/sdks/v2/java/container,https://github.com/apache/beam/blob/sdks/v2.51.0/sdks/LICENSE,Apache-2.0
github.com/golang/protobuf,https://github.com/golang/protobuf/blob/v1.5.3/LICENSE,BSD-3-Clause
golang.org/x/net,https://cs.opensource.google/go/x/net/+/v0.15.0:LICENSE,BSD-3-Clause
golang.org/x/sys/unix,https://cs.opensource.google/go/x/sys/+/v0.12.0:LICENSE,BSD-3-Clause
golang.org/x/text,https://cs.opensource.google/go/x/text/+/v0.13.0:LICENSE,BSD-3-Clause
google.golang.org/genproto/googleapis/rpc/status,https://github.com/googleapis/go-genproto/blob/007df8e322eb/googleapis/rpc/LICENSE,Apache-2.0
google.golang.org/grpc,https://github.com/grpc/grpc-go/blob/v1.58.1/LICENSE,Apache-2.0
google.golang.org/protobuf,https://github.com/protocolbuffers/protobuf-go/blob/v1.31.0/LICENSE,BSD-3-Clause
+ chmod -R a+w /output/licenses

> Task :runners:spark:3:job-server:validatesPortableRunnerBatch
> Task :release:go-licenses:java:createLicenses
> Task :sdks:java:container:java8:copyGolangLicenses
> Task :sdks:java:container:java8:dockerPrepare

> Task :sdks:java:container:java8:docker
#1 [internal] load .dockerignore
#1 transferring context:
#1 transferring context: 2B done
#1 ...

#2 [internal] load build definition from Dockerfile
#2 transferring dockerfile: 2.59kB done
#2 DONE 2.1s

#1 [internal] load .dockerignore
#1 DONE 3.1s

#3 [internal] load metadata for docker.io/library/eclipse-temurin:8
#3 DONE 1.6s

#4 [ 1/16] FROM docker.io/library/eclipse-temurin:8@sha256:2dd6410e398413f7cab3054dd4da1652cb98dc0fafa594d139cd4675694bbfaf
#4 CACHED

#5 [internal] load build context
#5 transferring context: 10.17MB 0.1s
#5 transferring context: 47.29MB 0.6s done
#5 DONE 0.6s

#6 [ 2/16] ADD target/slf4j-api.jar /opt/apache/beam/jars/
#6 DONE 1.2s

#7 [ 3/16] ADD target/slf4j-jdk14.jar /opt/apache/beam/jars/
#7 DONE 0.1s

#8 [ 4/16] ADD target/jcl-over-slf4j.jar /opt/apache/beam/jars/
#8 DONE 0.0s

#9 [ 5/16] ADD target/log4j-over-slf4j.jar /opt/apache/beam/jars/
#9 DONE 0.0s

#10 [ 6/16] ADD target/log4j-to-slf4j.jar /opt/apache/beam/jars/
#10 DONE 0.1s

#11 [ 7/16] ADD target/beam-sdks-java-harness.jar /opt/apache/beam/jars/
#11 DONE 0.1s

#12 [ 8/16] COPY target/jamm.jar target/open-module-agent*.jar /opt/apache/beam/jars/
#12 DONE 0.1s

#13 [ 9/16] COPY target/linux_amd64/boot /opt/apache/beam/
#13 DONE 0.2s

#14 [10/16] COPY target/LICENSE /opt/apache/beam/
#14 DONE 0.1s

#15 [11/16] COPY target/NOTICE /opt/apache/beam/
#15 DONE 0.1s

#16 [12/16] ADD target/third_party_licenses /opt/apache/beam/third_party_licenses/
#16 DONE 0.2s

#17 [13/16] COPY target/LICENSE target/options/* /opt/apache/beam/options/
#17 DONE 0.1s

#18 [14/16] COPY target/go-licenses/* /opt/apache/beam/third_party_licenses/golang/
#18 DONE 0.1s

#19 [15/16] RUN if [ "true" = "false" ] ; then     rm -rf /opt/apache/beam/third_party_licenses ;    fi
#19 DONE 0.6s

#20 [16/16] COPY target/profiler/* /opt/google_cloud_profiler/
#20 DONE 0.1s

#21 exporting to image
#21 exporting layers
#21 exporting layers 0.4s done
#21 writing image sha256:6a8b9ce674b278463ca4bf35af02acfd5821c28f1b03963798ff510dbb6e440f done
#21 naming to docker.io/apache/beam_java8_sdk:2.53.0.dev done
#21 DONE 0.4s

> Task :runners:spark:3:job-server:validatesPortableRunnerBatch

org.apache.beam.sdk.transforms.ParDoTest$MultipleInputsAndOutputTests > testParDoWithOnlyTaggedOutput FAILED
    java.lang.RuntimeException at ParDoTest.java:818

org.apache.beam.sdk.transforms.ParDoTest$MultipleInputsAndOutputTests > testMultiOutputParDoWithSideInputs FAILED
    java.lang.RuntimeException at ParDoTest.java:1251

[shutdown-hook-0] INFO org.apache.spark.util.ShutdownHookManager - Shutdown hook called
[shutdown-hook-0] INFO org.apache.spark.util.ShutdownHookManager - Deleting directory /tmp/spark-b94db999-df1a-4699-8353-cbf88e5a1adc
[shutdown-hook-0] INFO org.apache.spark.util.ShutdownHookManager - Shutdown hook called
[shutdown-hook-0] INFO org.apache.spark.util.ShutdownHookManager - Deleting directory /tmp/spark-d2e2bbf5-795c-4300-b421-b5aa7b112546
[shutdown-hook-0] INFO org.apache.spark.util.ShutdownHookManager - Shutdown hook called
[shutdown-hook-0] INFO org.apache.spark.util.ShutdownHookManager - Deleting directory /tmp/spark-711d2c39-1672-4eb1-bc75-313fc468eec1
[shutdown-hook-0] INFO org.apache.spark.util.ShutdownHookManager - Shutdown hook called
[shutdown-hook-0] INFO org.apache.spark.util.ShutdownHookManager - Deleting directory /tmp/spark-b61cd367-bff1-4f47-9ab1-809f9cd90e94

> Task :runners:spark:3:job-server:validatesPortableRunnerBatch

233 tests completed, 2 failed, 1 skipped

> Task :runners:spark:3:job-server:validatesPortableRunnerBatch FAILED
> Task :runners:spark:3:job-server:validatesPortableRunnerDocker FROM-CACHE

FAILURE: Build failed with an exception.

* What went wrong:
Execution failed for task ':runners:spark:3:job-server:validatesPortableRunnerBatch'.
> There were failing tests. See the report at: file://<https://ci-beam.apache.org/job/beam_PostCommit_Java_PVR_Spark_Batch/ws/src/runners/spark/3/job-server/build/reports/tests/validatesPortableRunnerBatch/index.html>

Deprecated Gradle features were used in this build, making it incompatible with Gradle 9.0.

You can use '--warning-mode all' to show the individual deprecation warnings and determine if they come from your own scripts or plugins.

For more on this, please refer to https://docs.gradle.org/8.4/userguide/command_line_interface.html#sec:command_line_warnings in the Gradle documentation.

BUILD FAILED in 1h 33m 32s
121 actionable tasks: 78 executed, 41 from cache, 2 up-to-date

Publishing build scan...
https://ge.apache.org/s/d4ak4duwtdipi

Build step 'Invoke Gradle script' changed build result to FAILURE
Build step 'Invoke Gradle script' marked build as failure

---------------------------------------------------------------------
To unsubscribe, e-mail: builds-unsubscribe@beam.apache.org
For additional commands, e-mail: builds-help@beam.apache.org


Build failed in Jenkins: beam_PostCommit_Java_PVR_Spark_Batch #2722

Posted by Apache Jenkins Server <je...@builds.apache.org>.
See <https://ci-beam.apache.org/job/beam_PostCommit_Java_PVR_Spark_Batch/2722/display/redirect>

Changes:


------------------------------------------
[...truncated 43.68 KB...]
#5 transferring context: 1.96kB 0.0s done
#5 DONE 0.0s

#6 [4/5] RUN go install github.com/google/go-licenses@latest
#6 CACHED

#7 [2/5] WORKDIR /usr/src/app
#7 CACHED

#8 [3/5] COPY go.mod ./
#8 CACHED

#9 [5/5] COPY get-licenses.sh /opt/apache/beam/
#9 CACHED

#10 exporting to image
#10 exporting layers done
#10 writing image sha256:53b7c9560183a6729641a84f7db4bf455b3576b4c079490f58ca4b0719f54de1 done
#10 naming to docker.io/library/golicenses-java done
#10 DONE 0.0s

> Task :sdks:java:container:pullLicenses
Collecting setuptools
  Using cached setuptools-68.2.2-py3-none-any.whl (807 kB)
Collecting wheel
  Using cached wheel-0.41.3-py3-none-any.whl (65 kB)
Installing collected packages: pip, setuptools, wheel
  Attempting uninstall: pip
    Found existing installation: pip 20.0.2
    Uninstalling pip-20.0.2:
      Successfully uninstalled pip-20.0.2
  Attempting uninstall: setuptools
    Found existing installation: setuptools 44.0.0
    Uninstalling setuptools-44.0.0:
      Successfully uninstalled setuptools-44.0.0
Successfully installed pip-23.3.1 setuptools-68.2.2 wheel-0.41.3
Collecting beautifulsoup4<5.0,>=4.9.0 (from -r <https://ci-beam.apache.org/job/beam_PostCommit_Java_PVR_Spark_Batch/ws/src/sdks/java/container/license_scripts/requirement.txt> (line 19))
  Using cached beautifulsoup4-4.12.2-py3-none-any.whl (142 kB)
Collecting pyyaml<7,>=6.0.1 (from -r <https://ci-beam.apache.org/job/beam_PostCommit_Java_PVR_Spark_Batch/ws/src/sdks/java/container/license_scripts/requirement.txt> (line 20))
  Using cached PyYAML-6.0.1-cp38-cp38-manylinux_2_17_x86_64.manylinux2014_x86_64.whl.metadata (2.1 kB)
Collecting tenacity<9.0,>=6.1.0 (from -r <https://ci-beam.apache.org/job/beam_PostCommit_Java_PVR_Spark_Batch/ws/src/sdks/java/container/license_scripts/requirement.txt> (line 21))
  Using cached tenacity-8.2.3-py3-none-any.whl.metadata (1.0 kB)
Collecting soupsieve>1.2 (from beautifulsoup4<5.0,>=4.9.0->-r <https://ci-beam.apache.org/job/beam_PostCommit_Java_PVR_Spark_Batch/ws/src/sdks/java/container/license_scripts/requirement.txt> (line 19))
  Using cached soupsieve-2.5-py3-none-any.whl.metadata (4.7 kB)
Using cached PyYAML-6.0.1-cp38-cp38-manylinux_2_17_x86_64.manylinux2014_x86_64.whl (736 kB)
Using cached tenacity-8.2.3-py3-none-any.whl (24 kB)
Using cached soupsieve-2.5-py3-none-any.whl (36 kB)
Installing collected packages: tenacity, soupsieve, pyyaml, beautifulsoup4
Successfully installed beautifulsoup4-4.12.2 pyyaml-6.0.1 soupsieve-2.5 tenacity-8.2.3
Executing python <https://ci-beam.apache.org/job/beam_PostCommit_Java_PVR_Spark_Batch/ws/src/sdks/java/container/license_scripts/pull_licenses_java.py> --license_index=<https://ci-beam.apache.org/job/beam_PostCommit_Java_PVR_Spark_Batch/ws/src/sdks/java/container/build/reports/dependency-license/index.json>        --output_dir=<https://ci-beam.apache.org/job/beam_PostCommit_Java_PVR_Spark_Batch/ws/src/sdks/java/container/build/target/java_third_party_licenses>        --dep_url_yaml=<https://ci-beam.apache.org/job/beam_PostCommit_Java_PVR_Spark_Batch/ws/src/sdks/java/container/license_scripts/dep_urls_java.yaml>        --manual_license_path=<https://ci-beam.apache.org/job/beam_PostCommit_Java_PVR_Spark_Batch/ws/src/sdks/java/container/license_scripts/manual_licenses>
INFO:root:Pulling license for 126 dependencies using 16 threads.
INFO:root:Replaced local file URL with file://<https://ci-beam.apache.org/job/beam_PostCommit_Java_PVR_Spark_Batch/ws/src/sdks/java/container/license_scripts/manual_licenses/xz/COPYING> for xz-1.5
INFO:root:pull_licenses_java.py succeed. It took 1.430452 seconds with 16 threads.
Copying licenses from <https://ci-beam.apache.org/job/beam_PostCommit_Java_PVR_Spark_Batch/ws/src/sdks/java/container/build/target/java_third_party_licenses> to <https://ci-beam.apache.org/job/beam_PostCommit_Java_PVR_Spark_Batch/ws/src/sdks/java/container/build/target/third_party_licenses.>
Finished license_scripts.sh

> Task :release:go-licenses:java:dockerRun
+ rm -rf '/output/*'
+ go get github.com/apache/beam/sdks/v2/java/container
go: downloading github.com/apache/beam v2.51.0+incompatible
go: downloading github.com/apache/beam/sdks/v2 v2.51.0

> Task :sdks:java:container:java8:copyJavaThirdPartyLicenses

> Task :sdks:java:container:downloadCloudProfilerAgent
  % Total    % Received % Xferd  Average Speed   Time    Time     Time  Current
                                 Dload  Upload   Total   Spent    Left  Speed
  0     0    0     0    0     0      0      0 --:--:-- --:--:-- --:--:--     0version.txt
NOTICES
profiler_java_agent.so
100 4183k  100 4183k    0     0  20.9M      0 --:--:-- --:--:-- --:--:-- 20.9M

> Task :sdks:java:container:goPrepare UP-TO-DATE

> Task :release:go-licenses:java:dockerRun
go: downloading github.com/golang/protobuf v1.5.3
go: downloading google.golang.org/grpc v1.58.1
go: downloading google.golang.org/protobuf v1.31.0
go: downloading golang.org/x/sys v0.12.0
go: downloading golang.org/x/net v0.15.0
go: downloading google.golang.org/genproto/googleapis/rpc v0.0.0-20230913181813-007df8e322eb
go: downloading google.golang.org/genproto v0.0.0-20230821184602-ccc8af3d0e93
go: downloading golang.org/x/text v0.13.0

> Task :sdks:java:container:goBuild
/home/jenkins/go/bin/go1.21.4 build -o ./build/target/linux_amd64/boot boot.go boot_test.go pathingjar.go pathingjar_test.go

> Task :sdks:java:container:java8:copySdkHarnessLauncher

> Task :release:go-licenses:java:dockerRun
go: added github.com/apache/beam/sdks/v2 v2.51.0
go: added github.com/golang/protobuf v1.5.3
go: added golang.org/x/net v0.15.0
go: added golang.org/x/sys v0.12.0
go: added golang.org/x/text v0.13.0
go: added google.golang.org/genproto/googleapis/rpc v0.0.0-20230913181813-007df8e322eb
go: added google.golang.org/grpc v1.58.1
go: added google.golang.org/protobuf v1.31.0
+ go-licenses save github.com/apache/beam/sdks/v2/java/container --save_path=/output/licenses
W1114 04:21:12.462926      37 library.go:101] "golang.org/x/sys/unix" contains non-Go code that can't be inspected for further dependencies:
/go/pkg/mod/golang.org/x/sys@v0.12.0/unix/asm_linux_amd64.s
+ go-licenses csv github.com/apache/beam/sdks/v2/java/container
+ tee /output/licenses/list.csv
W1114 04:21:19.722907      79 library.go:101] "golang.org/x/sys/unix" contains non-Go code that can't be inspected for further dependencies:
/go/pkg/mod/golang.org/x/sys@v0.12.0/unix/asm_linux_amd64.s
github.com/apache/beam/sdks/v2/go,https://github.com/apache/beam/blob/sdks/v2.51.0/sdks/go/README.md,Apache-2.0
github.com/apache/beam/sdks/v2/java/container,https://github.com/apache/beam/blob/sdks/v2.51.0/sdks/LICENSE,Apache-2.0
github.com/golang/protobuf,https://github.com/golang/protobuf/blob/v1.5.3/LICENSE,BSD-3-Clause
golang.org/x/net,https://cs.opensource.google/go/x/net/+/v0.15.0:LICENSE,BSD-3-Clause
golang.org/x/sys/unix,https://cs.opensource.google/go/x/sys/+/v0.12.0:LICENSE,BSD-3-Clause
golang.org/x/text,https://cs.opensource.google/go/x/text/+/v0.13.0:LICENSE,BSD-3-Clause
google.golang.org/genproto/googleapis/rpc/status,https://github.com/googleapis/go-genproto/blob/007df8e322eb/googleapis/rpc/LICENSE,Apache-2.0
google.golang.org/grpc,https://github.com/grpc/grpc-go/blob/v1.58.1/LICENSE,Apache-2.0
google.golang.org/protobuf,https://github.com/protocolbuffers/protobuf-go/blob/v1.31.0/LICENSE,BSD-3-Clause
+ chmod -R a+w /output/licenses

> Task :runners:spark:3:job-server:validatesPortableRunnerBatch
> Task :release:go-licenses:java:createLicenses
> Task :sdks:java:container:java8:copyGolangLicenses
> Task :sdks:java:container:java8:dockerPrepare

> Task :sdks:java:container:java8:docker
#1 [internal] load build definition from Dockerfile
#1 transferring dockerfile:
#1 transferring dockerfile: 2.59kB done
#1 DONE 1.4s

#2 [internal] load .dockerignore
#2 transferring context: 2B done
#2 DONE 2.3s

#3 [internal] load metadata for docker.io/library/eclipse-temurin:8
#3 DONE 2.0s

#4 [ 1/16] FROM docker.io/library/eclipse-temurin:8@sha256:2dd6410e398413f7cab3054dd4da1652cb98dc0fafa594d139cd4675694bbfaf
#4 CACHED

#5 [internal] load build context
#5 transferring context: 47.29MB 0.5s done
#5 DONE 1.1s

#6 [ 2/16] ADD target/slf4j-api.jar /opt/apache/beam/jars/
#6 DONE 3.4s

#7 [ 3/16] ADD target/slf4j-jdk14.jar /opt/apache/beam/jars/
#7 DONE 0.1s

#8 [ 4/16] ADD target/jcl-over-slf4j.jar /opt/apache/beam/jars/
#8 DONE 0.1s

#9 [ 5/16] ADD target/log4j-over-slf4j.jar /opt/apache/beam/jars/
#9 DONE 0.1s

#10 [ 6/16] ADD target/log4j-to-slf4j.jar /opt/apache/beam/jars/
#10 DONE 0.1s

#11 [ 7/16] ADD target/beam-sdks-java-harness.jar /opt/apache/beam/jars/
#11 DONE 0.1s

#12 [ 8/16] COPY target/jamm.jar target/open-module-agent*.jar /opt/apache/beam/jars/
#12 DONE 0.1s

#13 [ 9/16] COPY target/linux_amd64/boot /opt/apache/beam/
#13 DONE 0.2s

#14 [10/16] COPY target/LICENSE /opt/apache/beam/
#14 DONE 0.1s

#15 [11/16] COPY target/NOTICE /opt/apache/beam/
#15 DONE 0.0s

#16 [12/16] ADD target/third_party_licenses /opt/apache/beam/third_party_licenses/
#16 DONE 0.2s

#17 [13/16] COPY target/LICENSE target/options/* /opt/apache/beam/options/
#17 DONE 0.1s

#18 [14/16] COPY target/go-licenses/* /opt/apache/beam/third_party_licenses/golang/
#18 DONE 0.1s

#19 [15/16] RUN if [ "true" = "false" ] ; then     rm -rf /opt/apache/beam/third_party_licenses ;    fi
#19 DONE 0.5s

#20 [16/16] COPY target/profiler/* /opt/google_cloud_profiler/
#20 DONE 0.1s

#21 exporting to image
#21 exporting layers
#21 exporting layers 0.3s done
#21 writing image sha256:798f5a6e18f866ce034fe76ff160bf6a32c785ebca279fb8290e3bc845a15a7b done
#21 naming to docker.io/apache/beam_java8_sdk:2.53.0.dev done
#21 DONE 0.4s

> Task :runners:spark:3:job-server:validatesPortableRunnerBatch

org.apache.beam.sdk.transforms.ParDoTest$MultipleInputsAndOutputTests > testParDoEmptyWithTaggedOutput FAILED
    java.lang.RuntimeException at ParDoTest.java:765

[shutdown-hook-0] INFO org.apache.spark.util.ShutdownHookManager - Shutdown hook called
[shutdown-hook-0] INFO org.apache.spark.util.ShutdownHookManager - Deleting directory /tmp/spark-53cfc697-47af-4ac9-99a4-a26a64605f64

> Task :runners:spark:3:job-server:validatesPortableRunnerBatch

org.apache.beam.sdk.transforms.ParDoTest$MultipleInputsAndOutputTests > testMultiOutputParDoWithSideInputsIsCumulative FAILED
    java.lang.RuntimeException at ParDoTest.java:1289

org.apache.beam.sdk.transforms.ParDoTest$MultipleInputsAndOutputTests > testSideInputAnnotationWithMultipleSideInputs FAILED
    java.lang.RuntimeException at ParDoTest.java:1179

org.apache.beam.sdk.transforms.ParDoTest$StateTests > testBagState FAILED
    java.lang.RuntimeException at ParDoTest.java:2627

org.apache.beam.sdk.transforms.ParDoTest$StateTests > testValueStateSameId FAILED
    java.lang.RuntimeException at ParDoTest.java:2528

[shutdown-hook-0] INFO org.apache.spark.util.ShutdownHookManager - Shutdown hook called
[shutdown-hook-0] INFO org.apache.spark.util.ShutdownHookManager - Deleting directory /tmp/spark-672672a5-1fc8-4e3c-8f3d-cbcd5457be17
[shutdown-hook-0] INFO org.apache.spark.util.ShutdownHookManager - Shutdown hook called
[shutdown-hook-0] INFO org.apache.spark.util.ShutdownHookManager - Deleting directory /tmp/spark-89f76405-ed0d-493b-a377-268bffd53232
[shutdown-hook-0] INFO org.apache.spark.util.ShutdownHookManager - Shutdown hook called
[shutdown-hook-0] INFO org.apache.spark.util.ShutdownHookManager - Deleting directory /tmp/spark-68d5378f-a71c-4fe6-a947-4deed7dadb32

> Task :runners:spark:3:job-server:validatesPortableRunnerBatch

233 tests completed, 5 failed, 1 skipped

> Task :runners:spark:3:job-server:validatesPortableRunnerBatch FAILED
> Task :runners:spark:3:job-server:validatesPortableRunnerDocker FROM-CACHE

FAILURE: Build failed with an exception.

* What went wrong:
Execution failed for task ':runners:spark:3:job-server:validatesPortableRunnerBatch'.
> There were failing tests. See the report at: file://<https://ci-beam.apache.org/job/beam_PostCommit_Java_PVR_Spark_Batch/ws/src/runners/spark/3/job-server/build/reports/tests/validatesPortableRunnerBatch/index.html>

Deprecated Gradle features were used in this build, making it incompatible with Gradle 9.0.

You can use '--warning-mode all' to show the individual deprecation warnings and determine if they come from your own scripts or plugins.

For more on this, please refer to https://docs.gradle.org/8.4/userguide/command_line_interface.html#sec:command_line_warnings in the Gradle documentation.

BUILD FAILED in 1h 32m 47s
121 actionable tasks: 78 executed, 41 from cache, 2 up-to-date

Publishing build scan...
https://ge.apache.org/s/v64ppqosleaqk

Build step 'Invoke Gradle script' changed build result to FAILURE
Build step 'Invoke Gradle script' marked build as failure

---------------------------------------------------------------------
To unsubscribe, e-mail: builds-unsubscribe@beam.apache.org
For additional commands, e-mail: builds-help@beam.apache.org


Build failed in Jenkins: beam_PostCommit_Java_PVR_Spark_Batch #2721

Posted by Apache Jenkins Server <je...@builds.apache.org>.
See <https://ci-beam.apache.org/job/beam_PostCommit_Java_PVR_Spark_Batch/2721/display/redirect>

Changes:


------------------------------------------
[...truncated 47.58 KB...]
Copying licenses from <https://ci-beam.apache.org/job/beam_PostCommit_Java_PVR_Spark_Batch/ws/src/sdks/java/container/build/target/java_third_party_licenses> to <https://ci-beam.apache.org/job/beam_PostCommit_Java_PVR_Spark_Batch/ws/src/sdks/java/container/build/target/third_party_licenses.>
Finished license_scripts.sh

> Task :release:go-licenses:java:dockerRun
+ rm -rf '/output/*'
+ go get github.com/apache/beam/sdks/v2/java/container
go: downloading github.com/apache/beam/sdks/v2 v2.51.0
go: downloading github.com/apache/beam v2.51.0+incompatible

> Task :sdks:java:container:java8:copyJavaThirdPartyLicenses

> Task :sdks:java:container:downloadCloudProfilerAgent
  % Total    % Received % Xferd  Average Speed   Time    Time     Time  Current
                                 Dload  Upload   Total   Spent    Left  Speed
  0     0    0     0    0     0      0      0 --:--:-- --:--:-- --:--:--     0version.txt
NOTICES
profiler_java_agent.so
100 4183k  100 4183k    0     0  20.0M      0 --:--:-- --:--:-- --:--:-- 20.0M

> Task :sdks:java:container:goPrepare UP-TO-DATE

> Task :release:go-licenses:java:dockerRun
go: downloading github.com/golang/protobuf v1.5.3
go: downloading google.golang.org/grpc v1.58.1
go: downloading google.golang.org/protobuf v1.31.0
go: downloading golang.org/x/sys v0.12.0
go: downloading google.golang.org/genproto/googleapis/rpc v0.0.0-20230913181813-007df8e322eb
go: downloading golang.org/x/net v0.15.0
go: downloading google.golang.org/genproto v0.0.0-20230821184602-ccc8af3d0e93
go: downloading golang.org/x/text v0.13.0

> Task :sdks:java:container:goBuild
/home/jenkins/go/bin/go1.21.4 build -o ./build/target/linux_amd64/boot boot.go boot_test.go pathingjar.go pathingjar_test.go

> Task :sdks:java:container:java8:copySdkHarnessLauncher

> Task :release:go-licenses:java:dockerRun
go: added github.com/apache/beam/sdks/v2 v2.51.0
go: added github.com/golang/protobuf v1.5.3
go: added golang.org/x/net v0.15.0
go: added golang.org/x/sys v0.12.0
go: added golang.org/x/text v0.13.0
go: added google.golang.org/genproto/googleapis/rpc v0.0.0-20230913181813-007df8e322eb
go: added google.golang.org/grpc v1.58.1
go: added google.golang.org/protobuf v1.31.0
+ go-licenses save github.com/apache/beam/sdks/v2/java/container --save_path=/output/licenses
W1113 22:21:05.560890      36 library.go:101] "golang.org/x/sys/unix" contains non-Go code that can't be inspected for further dependencies:
/go/pkg/mod/golang.org/x/sys@v0.12.0/unix/asm_linux_amd64.s
+ go-licenses csv github.com/apache/beam/sdks/v2/java/container
+ tee /output/licenses/list.csv
W1113 22:21:12.402552      79 library.go:101] "golang.org/x/sys/unix" contains non-Go code that can't be inspected for further dependencies:
/go/pkg/mod/golang.org/x/sys@v0.12.0/unix/asm_linux_amd64.s
github.com/apache/beam/sdks/v2/go,https://github.com/apache/beam/blob/sdks/v2.51.0/sdks/go/README.md,Apache-2.0
github.com/apache/beam/sdks/v2/java/container,https://github.com/apache/beam/blob/sdks/v2.51.0/sdks/LICENSE,Apache-2.0
github.com/golang/protobuf,https://github.com/golang/protobuf/blob/v1.5.3/LICENSE,BSD-3-Clause
golang.org/x/net,https://cs.opensource.google/go/x/net/+/v0.15.0:LICENSE,BSD-3-Clause
golang.org/x/sys/unix,https://cs.opensource.google/go/x/sys/+/v0.12.0:LICENSE,BSD-3-Clause
golang.org/x/text,https://cs.opensource.google/go/x/text/+/v0.13.0:LICENSE,BSD-3-Clause
google.golang.org/genproto/googleapis/rpc/status,https://github.com/googleapis/go-genproto/blob/007df8e322eb/googleapis/rpc/LICENSE,Apache-2.0
google.golang.org/grpc,https://github.com/grpc/grpc-go/blob/v1.58.1/LICENSE,Apache-2.0
google.golang.org/protobuf,https://github.com/protocolbuffers/protobuf-go/blob/v1.31.0/LICENSE,BSD-3-Clause
+ chmod -R a+w /output/licenses

> Task :runners:spark:3:job-server:validatesPortableRunnerBatch
> Task :release:go-licenses:java:createLicenses
> Task :sdks:java:container:java8:copyGolangLicenses
> Task :sdks:java:container:java8:dockerPrepare

> Task :sdks:java:container:java8:docker
#1 [internal] load .dockerignore
#1 transferring context: 2B done
#1 ...

#2 [internal] load build definition from Dockerfile
#2 transferring dockerfile: 2.59kB done
#2 DONE 2.1s

#1 [internal] load .dockerignore
#1 DONE 3.0s

#3 [internal] load metadata for docker.io/library/eclipse-temurin:8
#3 DONE 1.2s

#4 [ 1/16] FROM docker.io/library/eclipse-temurin:8@sha256:2dd6410e398413f7cab3054dd4da1652cb98dc0fafa594d139cd4675694bbfaf
#4 CACHED

#5 [internal] load build context
#5 transferring context: 47.29MB 0.5s done
#5 DONE 0.6s

#6 [ 2/16] ADD target/slf4j-api.jar /opt/apache/beam/jars/
#6 DONE 1.1s

#7 [ 3/16] ADD target/slf4j-jdk14.jar /opt/apache/beam/jars/
#7 DONE 0.1s

#8 [ 4/16] ADD target/jcl-over-slf4j.jar /opt/apache/beam/jars/
#8 DONE 0.1s

#9 [ 5/16] ADD target/log4j-over-slf4j.jar /opt/apache/beam/jars/
#9 DONE 0.1s

#10 [ 6/16] ADD target/log4j-to-slf4j.jar /opt/apache/beam/jars/
#10 DONE 0.1s

#11 [ 7/16] ADD target/beam-sdks-java-harness.jar /opt/apache/beam/jars/
#11 DONE 0.1s

#12 [ 8/16] COPY target/jamm.jar target/open-module-agent*.jar /opt/apache/beam/jars/
#12 DONE 0.1s

#13 [ 9/16] COPY target/linux_amd64/boot /opt/apache/beam/
#13 DONE 0.2s

#14 [10/16] COPY target/LICENSE /opt/apache/beam/
#14 DONE 0.1s

#15 [11/16] COPY target/NOTICE /opt/apache/beam/
#15 DONE 0.1s

#16 [12/16] ADD target/third_party_licenses /opt/apache/beam/third_party_licenses/
#16 DONE 0.2s

#17 [13/16] COPY target/LICENSE target/options/* /opt/apache/beam/options/
#17 DONE 0.1s

#18 [14/16] COPY target/go-licenses/* /opt/apache/beam/third_party_licenses/golang/
#18 DONE 0.1s

#19 [15/16] RUN if [ "true" = "false" ] ; then     rm -rf /opt/apache/beam/third_party_licenses ;    fi
#19 DONE 0.6s

#20 [16/16] COPY target/profiler/* /opt/google_cloud_profiler/
#20 DONE 0.1s

#21 exporting to image
#21 exporting layers
#21 exporting layers 0.3s done
#21 writing image sha256:a9ead0c3de0271cc9ed0d34270d58cdc2f4b7bb579f436443cd24f66c313e9c2 done
#21 naming to docker.io/apache/beam_java8_sdk:2.53.0.dev done
#21 DONE 0.3s

> Task :runners:spark:3:job-server:validatesPortableRunnerBatch

org.apache.beam.sdk.transforms.ParDoTest$MultipleInputsAndOutputTests > testParDoWithOnlyTaggedOutput FAILED
    java.lang.RuntimeException at ParDoTest.java:818

org.apache.beam.sdk.transforms.ParDoTest$MultipleInputsAndOutputTests > testMultiOutputParDoWithSideInputs FAILED
    java.lang.RuntimeException at ParDoTest.java:1251

org.apache.beam.sdk.transforms.ParDoTest$MultipleInputsAndOutputTests > testParDoEmptyWithTaggedOutput FAILED
    java.lang.RuntimeException at ParDoTest.java:765

org.apache.beam.sdk.transforms.ParDoTest$MultipleInputsAndOutputTests > testParDoWithTaggedOutput FAILED
    java.lang.RuntimeException at ParDoTest.java:723

[shutdown-hook-0] INFO org.apache.spark.util.ShutdownHookManager - Shutdown hook called
[shutdown-hook-0] INFO org.apache.spark.util.ShutdownHookManager - Deleting directory /tmp/spark-21835bbc-39b7-4f65-9a6f-c82e4e7dd02b

> Task :runners:spark:3:job-server:validatesPortableRunnerBatch

org.apache.beam.sdk.transforms.ParDoTest$MultipleInputsAndOutputTests > testMultiOutputParDoWithSideInputsIsCumulative FAILED
    java.lang.RuntimeException at ParDoTest.java:1289

org.apache.beam.sdk.transforms.ParDoTest$MultipleInputsAndOutputTests > testSideInputAnnotationWithMultipleSideInputs FAILED
    java.lang.RuntimeException at ParDoTest.java:1179

org.apache.beam.sdk.transforms.ParDoTest$MultipleInputsAndOutputTests > testSideInputAnnotation FAILED
    java.lang.RuntimeException at ParDoTest.java:1076

org.apache.beam.sdk.transforms.ParDoTest$MultipleInputsAndOutputTests > testParDoWithEmptyTaggedOutput FAILED
    java.lang.RuntimeException at ParDoTest.java:789

org.apache.beam.sdk.transforms.ParDoTest$StateTests > testBagState FAILED
    java.lang.RuntimeException at ParDoTest.java:2627

org.apache.beam.sdk.transforms.ParDoTest$StateTests > testCombiningState FAILED
    java.lang.RuntimeException at ParDoTest.java:3497

org.apache.beam.sdk.transforms.ParDoTest$StateTests > testValueStateSameId FAILED
    java.lang.RuntimeException at ParDoTest.java:2528

org.apache.beam.sdk.transforms.ParDoTest$StateTests > testValueStateSimple FAILED
    java.lang.RuntimeException at ParDoTest.java:2292

org.apache.beam.sdk.transforms.ParDoTest$StateTests > testValueStateTaggedOutput FAILED
    java.lang.RuntimeException at ParDoTest.java:2579

org.apache.beam.sdk.transforms.ParDoTest$StateTests > testBagStateSideInput FAILED
    java.lang.RuntimeException at ParDoTest.java:3583

org.apache.beam.sdk.transforms.ParDoTest$StateTests > testCombiningStateParameterSuperclass FAILED
    java.lang.RuntimeException at ParDoTest.java:3533

org.apache.beam.sdk.transforms.ParDoTest$StateTests > testCoderInferenceOfList FAILED
    java.lang.RuntimeException at ParDoTest.java:2429

org.apache.beam.sdk.transforms.ParDoTest$StateTests > testValueStateDedup FAILED
    java.lang.RuntimeException at ParDoTest.java:2342

org.apache.beam.sdk.transforms.ParDoTest$StateTests > testValueStateFixedWindows FAILED
    java.lang.RuntimeException at ParDoTest.java:2473

org.apache.beam.sdk.transforms.ParDoTest$TimestampTests > testParDoTaggedOutputWithTimestamp FAILED
    java.lang.RuntimeException at ParDoTest.java:2030

[shutdown-hook-0] INFO org.apache.spark.util.ShutdownHookManager - Shutdown hook called
[shutdown-hook-0] INFO org.apache.spark.util.ShutdownHookManager - Deleting directory /tmp/spark-b0640291-ed5e-45da-8cb9-d2c5232ce55e

> Task :runners:spark:3:job-server:validatesPortableRunnerBatch

org.apache.beam.sdk.transforms.ParDoTest$TimestampTests > testParDoShiftTimestampUnlimited FAILED
    java.lang.RuntimeException at ParDoTest.java:2142

[shutdown-hook-0] INFO org.apache.spark.util.ShutdownHookManager - Shutdown hook called
[shutdown-hook-0] INFO org.apache.spark.util.ShutdownHookManager - Deleting directory /tmp/spark-d92b0b69-a012-4eeb-b72b-5ee9ec602564
[shutdown-hook-0] INFO org.apache.spark.util.ShutdownHookManager - Shutdown hook called
[shutdown-hook-0] INFO org.apache.spark.util.ShutdownHookManager - Deleting directory /tmp/spark-6d008082-e1f9-4710-a13b-83ad496c1647

> Task :runners:spark:3:job-server:validatesPortableRunnerBatch

233 tests completed, 20 failed, 1 skipped

> Task :runners:spark:3:job-server:validatesPortableRunnerBatch FAILED
> Task :runners:spark:3:job-server:validatesPortableRunnerDocker

[shutdown-hook-0] INFO org.apache.spark.util.ShutdownHookManager - Shutdown hook called
[shutdown-hook-0] INFO org.apache.spark.util.ShutdownHookManager - Deleting directory /tmp/spark-5056738f-2ab6-4746-8dcd-97b23fa03cd2

FAILURE: Build failed with an exception.

* What went wrong:
Execution failed for task ':runners:spark:3:job-server:validatesPortableRunnerBatch'.
> There were failing tests. See the report at: file://<https://ci-beam.apache.org/job/beam_PostCommit_Java_PVR_Spark_Batch/ws/src/runners/spark/3/job-server/build/reports/tests/validatesPortableRunnerBatch/index.html>

Deprecated Gradle features were used in this build, making it incompatible with Gradle 9.0.

You can use '--warning-mode all' to show the individual deprecation warnings and determine if they come from your own scripts or plugins.

For more on this, please refer to https://docs.gradle.org/8.4/userguide/command_line_interface.html#sec:command_line_warnings in the Gradle documentation.

BUILD FAILED in 1h 35m 59s
121 actionable tasks: 79 executed, 40 from cache, 2 up-to-date

Publishing build scan...
https://ge.apache.org/s/dk22533cehuvo

Build step 'Invoke Gradle script' changed build result to FAILURE
Build step 'Invoke Gradle script' marked build as failure

---------------------------------------------------------------------
To unsubscribe, e-mail: builds-unsubscribe@beam.apache.org
For additional commands, e-mail: builds-help@beam.apache.org


Build failed in Jenkins: beam_PostCommit_Java_PVR_Spark_Batch #2720

Posted by Apache Jenkins Server <je...@builds.apache.org>.
See <https://ci-beam.apache.org/job/beam_PostCommit_Java_PVR_Spark_Batch/2720/display/redirect>

Changes:


------------------------------------------
Started by timer
Running as SYSTEM
[EnvInject] - Loading node environment variables.
Building remotely on apache-beam-jenkins-11 (beam) in workspace <https://ci-beam.apache.org/job/beam_PostCommit_Java_PVR_Spark_Batch/ws/>
The recommended git tool is: NONE
No credentials specified
Wiping out workspace first.
Cloning the remote Git repository
Using shallow clone with depth 1
Avoid fetching tags
Cloning repository https://github.com/apache/beam.git
 > git init <https://ci-beam.apache.org/job/beam_PostCommit_Java_PVR_Spark_Batch/ws/src> # timeout=10
Fetching upstream changes from https://github.com/apache/beam.git
 > git --version # timeout=10
 > git --version # 'git version 2.25.1'
 > git fetch --no-tags --force --progress --depth=1 -- https://github.com/apache/beam.git +refs/heads/*:refs/remotes/origin/* # timeout=10
 > git config remote.origin.url https://github.com/apache/beam.git # timeout=10
 > git config --add remote.origin.fetch +refs/heads/*:refs/remotes/origin/* # timeout=10
 > git config remote.origin.url https://github.com/apache/beam.git # timeout=10
Using shallow fetch with depth 1
Fetching upstream changes from https://github.com/apache/beam.git
 > git fetch --no-tags --force --progress --depth=1 -- https://github.com/apache/beam.git +refs/heads/*:refs/remotes/origin/* +refs/pull/${ghprbPullId}/*:refs/remotes/origin/pr/${ghprbPullId}/* # timeout=10
 > git rev-parse origin/master^{commit} # timeout=10
Checking out Revision 8fa5b19f5468c716e16c688994b538cc2abd3811 (origin/master)
 > git config core.sparsecheckout # timeout=10
 > git checkout -f 8fa5b19f5468c716e16c688994b538cc2abd3811 # timeout=10
Commit message: "Add getters to CheckResult in IT framework (#29411)"
 > git rev-list --no-walk 8fa5b19f5468c716e16c688994b538cc2abd3811 # timeout=10
No emails were triggered.
[EnvInject] - Executing scripts and injecting environment variables after the SCM step.
[EnvInject] - Injecting as environment variables the properties content 
SETUPTOOLS_USE_DISTUTILS=stdlib
SPARK_LOCAL_IP=127.0.0.1

[EnvInject] - Variables injected successfully.
[Gradle] - Launching build.
[src] $ <https://ci-beam.apache.org/job/beam_PostCommit_Java_PVR_Spark_Batch/ws/src/gradlew> --continue --max-workers=8 -Dorg.gradle.jvmargs=-Xms2g -Dorg.gradle.jvmargs=-Xmx6g -Dorg.gradle.vfs.watch=false -Pdocker-pull-licenses :runners:spark:3:job-server:validatesPortableRunnerBatch :runners:spark:3:job-server:validatesPortableRunnerDocker
To honour the JVM settings for this build a single-use Daemon process will be forked. For more on this, please refer to https://docs.gradle.org/8.4/userguide/gradle_daemon.html#sec:disabling_the_daemon in the Gradle documentation.
Daemon will be stopped at the end of the build 
Configuration on demand is an incubating feature.
Gradle Enterprise plugins resolution: https://plugins.gradle.org/m2
Enforcing Gradle Enterprise: https://ge.apache.org, allowUntrustedServer: false
> Task :buildSrc:compileJava NO-SOURCE
> Task :buildSrc:compileGroovy FROM-CACHE
> Task :buildSrc:pluginDescriptors
> Task :buildSrc:processResources
> Task :buildSrc:classes
> Task :buildSrc:jar

> Configure project :sdks:java:container:java8
docker-pull-licenses set, creating go-licenses
System Go installation: /snap/bin/go is go version go1.16.15 linux/amd64; Preparing to use /home/jenkins/go/bin/go1.21.4
/home/jenkins/go/pkg/mod/golang.org/dl@v0.0.0-20231107201224-8165dcd93058/go1.21.4/main.go:20:8: //go:build comment without // +build comment

FAILURE: Build failed with an exception.

* What went wrong:
Could not determine the dependencies of task ':sdks:java:container:goBuild'.
> Could not create task ':sdks:java:container:goPrepare'.
   > Process 'command 'sh'' finished with non-zero exit value 1

* Try:
> Run with --stacktrace option to get the stack trace.
> Run with --info or --debug option to get more log output.
> Get more help at https://help.gradle.org.

Deprecated Gradle features were used in this build, making it incompatible with Gradle 9.0.

You can use '--warning-mode all' to show the individual deprecation warnings and determine if they come from your own scripts or plugins.

For more on this, please refer to https://docs.gradle.org/8.4/userguide/command_line_interface.html#sec:command_line_warnings in the Gradle documentation.

BUILD FAILED in 21s
4 actionable tasks: 3 executed, 1 from cache

Publishing build scan...
https://ge.apache.org/s/ltfjq32gt3c7q

Build step 'Invoke Gradle script' changed build result to FAILURE
Build step 'Invoke Gradle script' marked build as failure

---------------------------------------------------------------------
To unsubscribe, e-mail: builds-unsubscribe@beam.apache.org
For additional commands, e-mail: builds-help@beam.apache.org