You are viewing a plain text version of this content. The canonical link for it is here.
Posted to dev@lucene.apache.org by Policeman Jenkins Server <je...@thetaphi.de> on 2016/07/11 01:44:11 UTC

[JENKINS] Lucene-Solr-master-Linux (64bit/jdk1.8.0_92) - Build # 17212 - Still Failing!

Build: http://jenkins.thetaphi.de/job/Lucene-Solr-master-Linux/17212/
Java: 64bit/jdk1.8.0_92 -XX:-UseCompressedOops -XX:+UseConcMarkSweepGC

1 tests failed.
FAILED:  org.apache.solr.cloud.LeaderFailoverAfterPartitionTest.test

Error Message:
org.apache.solr.client.solrj.SolrServerException: No live SolrServers available to handle this request:[http://127.0.0.1:41265/c8n_1x3_lf_shard1_replica2]

Stack Trace:
org.apache.solr.client.solrj.SolrServerException: org.apache.solr.client.solrj.SolrServerException: No live SolrServers available to handle this request:[http://127.0.0.1:41265/c8n_1x3_lf_shard1_replica2]
	at __randomizedtesting.SeedInfo.seed([8769F97AB91D583A:F3DC6A017E135C2]:0)
	at org.apache.solr.client.solrj.impl.CloudSolrClient.directUpdate(CloudSolrClient.java:753)
	at org.apache.solr.client.solrj.impl.CloudSolrClient.sendRequest(CloudSolrClient.java:1151)
	at org.apache.solr.client.solrj.impl.CloudSolrClient.requestWithRetryOnStaleState(CloudSolrClient.java:1040)
	at org.apache.solr.client.solrj.impl.CloudSolrClient.request(CloudSolrClient.java:976)
	at org.apache.solr.cloud.AbstractFullDistribZkTestBase.sendDocsWithRetry(AbstractFullDistribZkTestBase.java:753)
	at org.apache.solr.cloud.AbstractFullDistribZkTestBase.sendDocsWithRetry(AbstractFullDistribZkTestBase.java:741)
	at org.apache.solr.cloud.LeaderFailoverAfterPartitionTest.testRf3WithLeaderFailover(LeaderFailoverAfterPartitionTest.java:178)
	at org.apache.solr.cloud.LeaderFailoverAfterPartitionTest.test(LeaderFailoverAfterPartitionTest.java:57)
	at sun.reflect.NativeMethodAccessorImpl.invoke0(Native Method)
	at sun.reflect.NativeMethodAccessorImpl.invoke(NativeMethodAccessorImpl.java:62)
	at sun.reflect.DelegatingMethodAccessorImpl.invoke(DelegatingMethodAccessorImpl.java:43)
	at java.lang.reflect.Method.invoke(Method.java:498)
	at com.carrotsearch.randomizedtesting.RandomizedRunner.invoke(RandomizedRunner.java:1764)
	at com.carrotsearch.randomizedtesting.RandomizedRunner$8.evaluate(RandomizedRunner.java:871)
	at com.carrotsearch.randomizedtesting.RandomizedRunner$9.evaluate(RandomizedRunner.java:907)
	at com.carrotsearch.randomizedtesting.RandomizedRunner$10.evaluate(RandomizedRunner.java:921)
	at org.apache.solr.BaseDistributedSearchTestCase$ShardsRepeatRule$ShardsFixedStatement.callStatement(BaseDistributedSearchTestCase.java:985)
	at org.apache.solr.BaseDistributedSearchTestCase$ShardsRepeatRule$ShardsStatement.evaluate(BaseDistributedSearchTestCase.java:960)
	at com.carrotsearch.randomizedtesting.rules.SystemPropertiesRestoreRule$1.evaluate(SystemPropertiesRestoreRule.java:57)
	at org.apache.lucene.util.TestRuleSetupTeardownChained$1.evaluate(TestRuleSetupTeardownChained.java:49)
	at org.apache.lucene.util.AbstractBeforeAfterRule$1.evaluate(AbstractBeforeAfterRule.java:45)
	at org.apache.lucene.util.TestRuleThreadAndTestName$1.evaluate(TestRuleThreadAndTestName.java:48)
	at org.apache.lucene.util.TestRuleIgnoreAfterMaxFailures$1.evaluate(TestRuleIgnoreAfterMaxFailures.java:64)
	at org.apache.lucene.util.TestRuleMarkFailure$1.evaluate(TestRuleMarkFailure.java:47)
	at com.carrotsearch.randomizedtesting.rules.StatementAdapter.evaluate(StatementAdapter.java:36)
	at com.carrotsearch.randomizedtesting.ThreadLeakControl$StatementRunner.run(ThreadLeakControl.java:367)
	at com.carrotsearch.randomizedtesting.ThreadLeakControl.forkTimeoutingTask(ThreadLeakControl.java:809)
	at com.carrotsearch.randomizedtesting.ThreadLeakControl$3.evaluate(ThreadLeakControl.java:460)
	at com.carrotsearch.randomizedtesting.RandomizedRunner.runSingleTest(RandomizedRunner.java:880)
	at com.carrotsearch.randomizedtesting.RandomizedRunner$5.evaluate(RandomizedRunner.java:781)
	at com.carrotsearch.randomizedtesting.RandomizedRunner$6.evaluate(RandomizedRunner.java:816)
	at com.carrotsearch.randomizedtesting.RandomizedRunner$7.evaluate(RandomizedRunner.java:827)
	at com.carrotsearch.randomizedtesting.rules.StatementAdapter.evaluate(StatementAdapter.java:36)
	at com.carrotsearch.randomizedtesting.rules.SystemPropertiesRestoreRule$1.evaluate(SystemPropertiesRestoreRule.java:57)
	at org.apache.lucene.util.AbstractBeforeAfterRule$1.evaluate(AbstractBeforeAfterRule.java:45)
	at com.carrotsearch.randomizedtesting.rules.StatementAdapter.evaluate(StatementAdapter.java:36)
	at org.apache.lucene.util.TestRuleStoreClassName$1.evaluate(TestRuleStoreClassName.java:41)
	at com.carrotsearch.randomizedtesting.rules.NoShadowingOrOverridesOnMethodsRule$1.evaluate(NoShadowingOrOverridesOnMethodsRule.java:40)
	at com.carrotsearch.randomizedtesting.rules.NoShadowingOrOverridesOnMethodsRule$1.evaluate(NoShadowingOrOverridesOnMethodsRule.java:40)
	at com.carrotsearch.randomizedtesting.rules.StatementAdapter.evaluate(StatementAdapter.java:36)
	at com.carrotsearch.randomizedtesting.rules.StatementAdapter.evaluate(StatementAdapter.java:36)
	at com.carrotsearch.randomizedtesting.rules.StatementAdapter.evaluate(StatementAdapter.java:36)
	at org.apache.lucene.util.TestRuleAssertionsRequired$1.evaluate(TestRuleAssertionsRequired.java:53)
	at org.apache.lucene.util.TestRuleMarkFailure$1.evaluate(TestRuleMarkFailure.java:47)
	at org.apache.lucene.util.TestRuleIgnoreAfterMaxFailures$1.evaluate(TestRuleIgnoreAfterMaxFailures.java:64)
	at org.apache.lucene.util.TestRuleIgnoreTestSuites$1.evaluate(TestRuleIgnoreTestSuites.java:54)
	at com.carrotsearch.randomizedtesting.rules.StatementAdapter.evaluate(StatementAdapter.java:36)
	at com.carrotsearch.randomizedtesting.ThreadLeakControl$StatementRunner.run(ThreadLeakControl.java:367)
	at java.lang.Thread.run(Thread.java:745)
Caused by: org.apache.solr.client.solrj.SolrServerException: No live SolrServers available to handle this request:[http://127.0.0.1:41265/c8n_1x3_lf_shard1_replica2]
	at org.apache.solr.client.solrj.impl.LBHttpSolrClient.request(LBHttpSolrClient.java:393)
	at org.apache.solr.client.solrj.impl.CloudSolrClient.directUpdate(CloudSolrClient.java:747)
	... 48 more
Caused by: org.apache.solr.client.solrj.SolrServerException: Server refused connection at: http://127.0.0.1:41265/c8n_1x3_lf_shard1_replica2
	at org.apache.solr.client.solrj.impl.HttpSolrClient.executeMethod(HttpSolrClient.java:613)
	at org.apache.solr.client.solrj.impl.HttpSolrClient.request(HttpSolrClient.java:259)
	at org.apache.solr.client.solrj.impl.HttpSolrClient.request(HttpSolrClient.java:248)
	at org.apache.solr.client.solrj.impl.LBHttpSolrClient.doRequest(LBHttpSolrClient.java:413)
	at org.apache.solr.client.solrj.impl.LBHttpSolrClient.request(LBHttpSolrClient.java:382)
	... 49 more
Caused by: org.apache.http.conn.HttpHostConnectException: Connect to 127.0.0.1:41265 [/127.0.0.1] failed: Connection refused
	at org.apache.http.impl.conn.DefaultHttpClientConnectionOperator.connect(DefaultHttpClientConnectionOperator.java:151)
	at org.apache.http.impl.conn.PoolingHttpClientConnectionManager.connect(PoolingHttpClientConnectionManager.java:353)
	at org.apache.http.impl.execchain.MainClientExec.establishRoute(MainClientExec.java:380)
	at org.apache.http.impl.execchain.MainClientExec.execute(MainClientExec.java:236)
	at org.apache.http.impl.execchain.ProtocolExec.execute(ProtocolExec.java:184)
	at org.apache.http.impl.execchain.RetryExec.execute(RetryExec.java:88)
	at org.apache.http.impl.execchain.RedirectExec.execute(RedirectExec.java:110)
	at org.apache.http.impl.client.InternalHttpClient.doExecute(InternalHttpClient.java:184)
	at org.apache.http.impl.client.CloseableHttpClient.execute(CloseableHttpClient.java:82)
	at org.apache.http.impl.client.CloseableHttpClient.execute(CloseableHttpClient.java:55)
	at org.apache.solr.client.solrj.impl.HttpSolrClient.executeMethod(HttpSolrClient.java:511)
	... 53 more
Caused by: java.net.ConnectException: Connection refused
	at java.net.PlainSocketImpl.socketConnect(Native Method)
	at java.net.AbstractPlainSocketImpl.doConnect(AbstractPlainSocketImpl.java:350)
	at java.net.AbstractPlainSocketImpl.connectToAddress(AbstractPlainSocketImpl.java:206)
	at java.net.AbstractPlainSocketImpl.connect(AbstractPlainSocketImpl.java:188)
	at java.net.SocksSocketImpl.connect(SocksSocketImpl.java:392)
	at java.net.Socket.connect(Socket.java:589)
	at org.apache.http.conn.socket.PlainConnectionSocketFactory.connectSocket(PlainConnectionSocketFactory.java:74)
	at org.apache.http.impl.conn.DefaultHttpClientConnectionOperator.connect(DefaultHttpClientConnectionOperator.java:134)
	... 63 more




Build Log:
[...truncated 12020 lines...]
   [junit4] Suite: org.apache.solr.cloud.LeaderFailoverAfterPartitionTest
   [junit4]   2> Creating dataDir: /home/jenkins/workspace/Lucene-Solr-master-Linux/solr/build/solr-core/test/J2/temp/solr.cloud.LeaderFailoverAfterPartitionTest_8769F97AB91D583A-001/init-core-data-001
   [junit4]   2> 1469002 INFO  (SUITE-LeaderFailoverAfterPartitionTest-seed#[8769F97AB91D583A]-worker) [    ] o.a.s.SolrTestCaseJ4 Randomized ssl (false) and clientAuth (false) via: @org.apache.solr.SolrTestCaseJ4$SuppressSSL(bugUrl=https://issues.apache.org/jira/browse/SOLR-5776)
   [junit4]   2> 1469002 INFO  (SUITE-LeaderFailoverAfterPartitionTest-seed#[8769F97AB91D583A]-worker) [    ] o.a.s.BaseDistributedSearchTestCase Setting hostContext system property: /
   [junit4]   2> 1469003 INFO  (TEST-LeaderFailoverAfterPartitionTest.test-seed#[8769F97AB91D583A]) [    ] o.a.s.c.ZkTestServer STARTING ZK TEST SERVER
   [junit4]   2> 1469003 INFO  (Thread-3950) [    ] o.a.s.c.ZkTestServer client port:0.0.0.0/0.0.0.0:0
   [junit4]   2> 1469003 INFO  (Thread-3950) [    ] o.a.s.c.ZkTestServer Starting server
   [junit4]   2> 1469103 INFO  (TEST-LeaderFailoverAfterPartitionTest.test-seed#[8769F97AB91D583A]) [    ] o.a.s.c.ZkTestServer start zk server on port:37238
   [junit4]   2> 1469103 INFO  (TEST-LeaderFailoverAfterPartitionTest.test-seed#[8769F97AB91D583A]) [    ] o.a.s.c.c.SolrZkClient Using default ZkCredentialsProvider
   [junit4]   2> 1469104 INFO  (TEST-LeaderFailoverAfterPartitionTest.test-seed#[8769F97AB91D583A]) [    ] o.a.s.c.c.ConnectionManager Waiting for client to connect to ZooKeeper
   [junit4]   2> 1469105 INFO  (zkCallback-2084-thread-1) [    ] o.a.s.c.c.ConnectionManager Watcher org.apache.solr.common.cloud.ConnectionManager@490b775d name:ZooKeeperConnection Watcher:127.0.0.1:37238 got event WatchedEvent state:SyncConnected type:None path:null path:null type:None
   [junit4]   2> 1469105 INFO  (TEST-LeaderFailoverAfterPartitionTest.test-seed#[8769F97AB91D583A]) [    ] o.a.s.c.c.ConnectionManager Client is connected to ZooKeeper
   [junit4]   2> 1469105 INFO  (TEST-LeaderFailoverAfterPartitionTest.test-seed#[8769F97AB91D583A]) [    ] o.a.s.c.c.SolrZkClient Using default ZkACLProvider
   [junit4]   2> 1469105 INFO  (TEST-LeaderFailoverAfterPartitionTest.test-seed#[8769F97AB91D583A]) [    ] o.a.s.c.c.SolrZkClient makePath: /solr
   [junit4]   2> 1469107 INFO  (TEST-LeaderFailoverAfterPartitionTest.test-seed#[8769F97AB91D583A]) [    ] o.a.s.c.c.SolrZkClient Using default ZkCredentialsProvider
   [junit4]   2> 1469107 INFO  (TEST-LeaderFailoverAfterPartitionTest.test-seed#[8769F97AB91D583A]) [    ] o.a.s.c.c.ConnectionManager Waiting for client to connect to ZooKeeper
   [junit4]   2> 1469107 INFO  (zkCallback-2085-thread-1) [    ] o.a.s.c.c.ConnectionManager Watcher org.apache.solr.common.cloud.ConnectionManager@20e48863 name:ZooKeeperConnection Watcher:127.0.0.1:37238/solr got event WatchedEvent state:SyncConnected type:None path:null path:null type:None
   [junit4]   2> 1469107 INFO  (TEST-LeaderFailoverAfterPartitionTest.test-seed#[8769F97AB91D583A]) [    ] o.a.s.c.c.ConnectionManager Client is connected to ZooKeeper
   [junit4]   2> 1469108 INFO  (TEST-LeaderFailoverAfterPartitionTest.test-seed#[8769F97AB91D583A]) [    ] o.a.s.c.c.SolrZkClient Using default ZkACLProvider
   [junit4]   2> 1469108 INFO  (TEST-LeaderFailoverAfterPartitionTest.test-seed#[8769F97AB91D583A]) [    ] o.a.s.c.c.SolrZkClient makePath: /collections/collection1
   [junit4]   2> 1469108 INFO  (TEST-LeaderFailoverAfterPartitionTest.test-seed#[8769F97AB91D583A]) [    ] o.a.s.c.c.SolrZkClient makePath: /collections/collection1/shards
   [junit4]   2> 1469109 INFO  (TEST-LeaderFailoverAfterPartitionTest.test-seed#[8769F97AB91D583A]) [    ] o.a.s.c.c.SolrZkClient makePath: /collections/control_collection
   [junit4]   2> 1469109 INFO  (TEST-LeaderFailoverAfterPartitionTest.test-seed#[8769F97AB91D583A]) [    ] o.a.s.c.c.SolrZkClient makePath: /collections/control_collection/shards
   [junit4]   2> 1469110 INFO  (TEST-LeaderFailoverAfterPartitionTest.test-seed#[8769F97AB91D583A]) [    ] o.a.s.c.AbstractZkTestCase put /home/jenkins/workspace/Lucene-Solr-master-Linux/solr/core/src/test-files/solr/collection1/conf/solrconfig-tlog.xml to /configs/conf1/solrconfig.xml
   [junit4]   2> 1469110 INFO  (TEST-LeaderFailoverAfterPartitionTest.test-seed#[8769F97AB91D583A]) [    ] o.a.s.c.c.SolrZkClient makePath: /configs/conf1/solrconfig.xml
   [junit4]   2> 1469111 INFO  (TEST-LeaderFailoverAfterPartitionTest.test-seed#[8769F97AB91D583A]) [    ] o.a.s.c.AbstractZkTestCase put /home/jenkins/workspace/Lucene-Solr-master-Linux/solr/core/src/test-files/solr/collection1/conf/schema.xml to /configs/conf1/schema.xml
   [junit4]   2> 1469111 INFO  (TEST-LeaderFailoverAfterPartitionTest.test-seed#[8769F97AB91D583A]) [    ] o.a.s.c.c.SolrZkClient makePath: /configs/conf1/schema.xml
   [junit4]   2> 1469111 INFO  (TEST-LeaderFailoverAfterPartitionTest.test-seed#[8769F97AB91D583A]) [    ] o.a.s.c.AbstractZkTestCase put /home/jenkins/workspace/Lucene-Solr-master-Linux/solr/core/src/test-files/solr/collection1/conf/solrconfig.snippet.randomindexconfig.xml to /configs/conf1/solrconfig.snippet.randomindexconfig.xml
   [junit4]   2> 1469111 INFO  (TEST-LeaderFailoverAfterPartitionTest.test-seed#[8769F97AB91D583A]) [    ] o.a.s.c.c.SolrZkClient makePath: /configs/conf1/solrconfig.snippet.randomindexconfig.xml
   [junit4]   2> 1469112 INFO  (TEST-LeaderFailoverAfterPartitionTest.test-seed#[8769F97AB91D583A]) [    ] o.a.s.c.AbstractZkTestCase put /home/jenkins/workspace/Lucene-Solr-master-Linux/solr/core/src/test-files/solr/collection1/conf/stopwords.txt to /configs/conf1/stopwords.txt
   [junit4]   2> 1469112 INFO  (TEST-LeaderFailoverAfterPartitionTest.test-seed#[8769F97AB91D583A]) [    ] o.a.s.c.c.SolrZkClient makePath: /configs/conf1/stopwords.txt
   [junit4]   2> 1469112 INFO  (TEST-LeaderFailoverAfterPartitionTest.test-seed#[8769F97AB91D583A]) [    ] o.a.s.c.AbstractZkTestCase put /home/jenkins/workspace/Lucene-Solr-master-Linux/solr/core/src/test-files/solr/collection1/conf/protwords.txt to /configs/conf1/protwords.txt
   [junit4]   2> 1469112 INFO  (TEST-LeaderFailoverAfterPartitionTest.test-seed#[8769F97AB91D583A]) [    ] o.a.s.c.c.SolrZkClient makePath: /configs/conf1/protwords.txt
   [junit4]   2> 1469113 INFO  (TEST-LeaderFailoverAfterPartitionTest.test-seed#[8769F97AB91D583A]) [    ] o.a.s.c.AbstractZkTestCase put /home/jenkins/workspace/Lucene-Solr-master-Linux/solr/core/src/test-files/solr/collection1/conf/currency.xml to /configs/conf1/currency.xml
   [junit4]   2> 1469113 INFO  (TEST-LeaderFailoverAfterPartitionTest.test-seed#[8769F97AB91D583A]) [    ] o.a.s.c.c.SolrZkClient makePath: /configs/conf1/currency.xml
   [junit4]   2> 1469113 INFO  (TEST-LeaderFailoverAfterPartitionTest.test-seed#[8769F97AB91D583A]) [    ] o.a.s.c.AbstractZkTestCase put /home/jenkins/workspace/Lucene-Solr-master-Linux/solr/core/src/test-files/solr/collection1/conf/enumsConfig.xml to /configs/conf1/enumsConfig.xml
   [junit4]   2> 1469113 INFO  (TEST-LeaderFailoverAfterPartitionTest.test-seed#[8769F97AB91D583A]) [    ] o.a.s.c.c.SolrZkClient makePath: /configs/conf1/enumsConfig.xml
   [junit4]   2> 1469114 INFO  (TEST-LeaderFailoverAfterPartitionTest.test-seed#[8769F97AB91D583A]) [    ] o.a.s.c.AbstractZkTestCase put /home/jenkins/workspace/Lucene-Solr-master-Linux/solr/core/src/test-files/solr/collection1/conf/open-exchange-rates.json to /configs/conf1/open-exchange-rates.json
   [junit4]   2> 1469114 INFO  (TEST-LeaderFailoverAfterPartitionTest.test-seed#[8769F97AB91D583A]) [    ] o.a.s.c.c.SolrZkClient makePath: /configs/conf1/open-exchange-rates.json
   [junit4]   2> 1469114 INFO  (TEST-LeaderFailoverAfterPartitionTest.test-seed#[8769F97AB91D583A]) [    ] o.a.s.c.AbstractZkTestCase put /home/jenkins/workspace/Lucene-Solr-master-Linux/solr/core/src/test-files/solr/collection1/conf/mapping-ISOLatin1Accent.txt to /configs/conf1/mapping-ISOLatin1Accent.txt
   [junit4]   2> 1469115 INFO  (TEST-LeaderFailoverAfterPartitionTest.test-seed#[8769F97AB91D583A]) [    ] o.a.s.c.c.SolrZkClient makePath: /configs/conf1/mapping-ISOLatin1Accent.txt
   [junit4]   2> 1469115 INFO  (TEST-LeaderFailoverAfterPartitionTest.test-seed#[8769F97AB91D583A]) [    ] o.a.s.c.AbstractZkTestCase put /home/jenkins/workspace/Lucene-Solr-master-Linux/solr/core/src/test-files/solr/collection1/conf/old_synonyms.txt to /configs/conf1/old_synonyms.txt
   [junit4]   2> 1469115 INFO  (TEST-LeaderFailoverAfterPartitionTest.test-seed#[8769F97AB91D583A]) [    ] o.a.s.c.c.SolrZkClient makePath: /configs/conf1/old_synonyms.txt
   [junit4]   2> 1469116 INFO  (TEST-LeaderFailoverAfterPartitionTest.test-seed#[8769F97AB91D583A]) [    ] o.a.s.c.AbstractZkTestCase put /home/jenkins/workspace/Lucene-Solr-master-Linux/solr/core/src/test-files/solr/collection1/conf/synonyms.txt to /configs/conf1/synonyms.txt
   [junit4]   2> 1469116 INFO  (TEST-LeaderFailoverAfterPartitionTest.test-seed#[8769F97AB91D583A]) [    ] o.a.s.c.c.SolrZkClient makePath: /configs/conf1/synonyms.txt
   [junit4]   2> 1469169 INFO  (TEST-LeaderFailoverAfterPartitionTest.test-seed#[8769F97AB91D583A]) [    ] o.a.s.SolrTestCaseJ4 Writing core.properties file to /home/jenkins/workspace/Lucene-Solr-master-Linux/solr/build/solr-core/test/J2/temp/solr.cloud.LeaderFailoverAfterPartitionTest_8769F97AB91D583A-001/control-001/cores/collection1
   [junit4]   2> 1469170 INFO  (TEST-LeaderFailoverAfterPartitionTest.test-seed#[8769F97AB91D583A]) [    ] o.e.j.s.Server jetty-9.3.8.v20160314
   [junit4]   2> 1469171 INFO  (TEST-LeaderFailoverAfterPartitionTest.test-seed#[8769F97AB91D583A]) [    ] o.e.j.s.h.ContextHandler Started o.e.j.s.ServletContextHandler@3dc0c441{/,null,AVAILABLE}
   [junit4]   2> 1469172 INFO  (TEST-LeaderFailoverAfterPartitionTest.test-seed#[8769F97AB91D583A]) [    ] o.e.j.s.ServerConnector Started ServerConnector@4d21b935{HTTP/1.1,[http/1.1]}{127.0.0.1:42201}
   [junit4]   2> 1469172 INFO  (TEST-LeaderFailoverAfterPartitionTest.test-seed#[8769F97AB91D583A]) [    ] o.e.j.s.Server Started @1471024ms
   [junit4]   2> 1469172 INFO  (TEST-LeaderFailoverAfterPartitionTest.test-seed#[8769F97AB91D583A]) [    ] o.a.s.c.s.e.JettySolrRunner Jetty properties: {solr.data.dir=/home/jenkins/workspace/Lucene-Solr-master-Linux/solr/build/solr-core/test/J2/temp/solr.cloud.LeaderFailoverAfterPartitionTest_8769F97AB91D583A-001/tempDir-001/control/data, hostContext=/, hostPort=36543, coreRootDirectory=/home/jenkins/workspace/Lucene-Solr-master-Linux/solr/build/solr-core/test/J2/temp/solr.cloud.LeaderFailoverAfterPartitionTest_8769F97AB91D583A-001/control-001/cores}
   [junit4]   2> 1469172 INFO  (TEST-LeaderFailoverAfterPartitionTest.test-seed#[8769F97AB91D583A]) [    ] o.a.s.s.SolrDispatchFilter SolrDispatchFilter.init(): sun.misc.Launcher$AppClassLoader@73d16e93
   [junit4]   2> 1469172 INFO  (TEST-LeaderFailoverAfterPartitionTest.test-seed#[8769F97AB91D583A]) [    ] o.a.s.c.SolrResourceLoader new SolrResourceLoader for directory: '/home/jenkins/workspace/Lucene-Solr-master-Linux/solr/build/solr-core/test/J2/temp/solr.cloud.LeaderFailoverAfterPartitionTest_8769F97AB91D583A-001/control-001'
   [junit4]   2> 1469172 INFO  (TEST-LeaderFailoverAfterPartitionTest.test-seed#[8769F97AB91D583A]) [    ] o.a.s.c.SolrResourceLoader JNDI not configured for solr (NoInitialContextEx)
   [junit4]   2> 1469172 INFO  (TEST-LeaderFailoverAfterPartitionTest.test-seed#[8769F97AB91D583A]) [    ] o.a.s.c.SolrResourceLoader solr home defaulted to 'solr/' (could not find system property or JNDI)
   [junit4]   2> 1469172 INFO  (TEST-LeaderFailoverAfterPartitionTest.test-seed#[8769F97AB91D583A]) [    ] o.a.s.c.c.SolrZkClient Using default ZkCredentialsProvider
   [junit4]   2> 1469173 INFO  (TEST-LeaderFailoverAfterPartitionTest.test-seed#[8769F97AB91D583A]) [    ] o.a.s.c.c.ConnectionManager Waiting for client to connect to ZooKeeper
   [junit4]   2> 1469173 INFO  (zkCallback-2086-thread-1) [    ] o.a.s.c.c.ConnectionManager Watcher org.apache.solr.common.cloud.ConnectionManager@5befe0df name:ZooKeeperConnection Watcher:127.0.0.1:37238/solr got event WatchedEvent state:SyncConnected type:None path:null path:null type:None
   [junit4]   2> 1469173 INFO  (TEST-LeaderFailoverAfterPartitionTest.test-seed#[8769F97AB91D583A]) [    ] o.a.s.c.c.ConnectionManager Client is connected to ZooKeeper
   [junit4]   2> 1469174 INFO  (TEST-LeaderFailoverAfterPartitionTest.test-seed#[8769F97AB91D583A]) [    ] o.a.s.c.c.SolrZkClient Using default ZkACLProvider
   [junit4]   2> 1469174 INFO  (TEST-LeaderFailoverAfterPartitionTest.test-seed#[8769F97AB91D583A]) [    ] o.a.s.s.SolrDispatchFilter Loading solr.xml from SolrHome (not found in ZooKeeper)
   [junit4]   2> 1469174 INFO  (TEST-LeaderFailoverAfterPartitionTest.test-seed#[8769F97AB91D583A]) [    ] o.a.s.c.SolrXmlConfig Loading container configuration from /home/jenkins/workspace/Lucene-Solr-master-Linux/solr/build/solr-core/test/J2/temp/solr.cloud.LeaderFailoverAfterPartitionTest_8769F97AB91D583A-001/control-001/solr.xml
   [junit4]   2> 1469177 INFO  (TEST-LeaderFailoverAfterPartitionTest.test-seed#[8769F97AB91D583A]) [    ] o.a.s.c.CorePropertiesLocator Config-defined core root directory: /home/jenkins/workspace/Lucene-Solr-master-Linux/solr/build/solr-core/test/J2/temp/solr.cloud.LeaderFailoverAfterPartitionTest_8769F97AB91D583A-001/control-001/cores
   [junit4]   2> 1469177 INFO  (TEST-LeaderFailoverAfterPartitionTest.test-seed#[8769F97AB91D583A]) [    ] o.a.s.c.CoreContainer New CoreContainer 1530695495
   [junit4]   2> 1469177 INFO  (TEST-LeaderFailoverAfterPartitionTest.test-seed#[8769F97AB91D583A]) [    ] o.a.s.c.CoreContainer Loading cores into CoreContainer [instanceDir=/home/jenkins/workspace/Lucene-Solr-master-Linux/solr/build/solr-core/test/J2/temp/solr.cloud.LeaderFailoverAfterPartitionTest_8769F97AB91D583A-001/control-001]
   [junit4]   2> 1469178 WARN  (TEST-LeaderFailoverAfterPartitionTest.test-seed#[8769F97AB91D583A]) [    ] o.a.s.c.CoreContainer Couldn't add files from /home/jenkins/workspace/Lucene-Solr-master-Linux/solr/build/solr-core/test/J2/temp/solr.cloud.LeaderFailoverAfterPartitionTest_8769F97AB91D583A-001/control-001/lib to classpath: /home/jenkins/workspace/Lucene-Solr-master-Linux/solr/build/solr-core/test/J2/temp/solr.cloud.LeaderFailoverAfterPartitionTest_8769F97AB91D583A-001/control-001/lib
   [junit4]   2> 1469178 INFO  (TEST-LeaderFailoverAfterPartitionTest.test-seed#[8769F97AB91D583A]) [    ] o.a.s.h.c.HttpShardHandlerFactory created with socketTimeout : 90000,urlScheme : ,connTimeout : 15000,maxConnectionsPerHost : 20,maxConnections : 10000,corePoolSize : 0,maximumPoolSize : 2147483647,maxThreadIdleTime : 5,sizeOfQueue : -1,fairnessPolicy : false,
   [junit4]   2> 1469180 INFO  (TEST-LeaderFailoverAfterPartitionTest.test-seed#[8769F97AB91D583A]) [    ] o.a.s.u.UpdateShardHandler Created UpdateShardHandler HTTP client with params: socketTimeout=340000&connTimeout=45000&maxConnections=100000&maxConnectionsPerHost=100000
   [junit4]   2> 1469180 INFO  (TEST-LeaderFailoverAfterPartitionTest.test-seed#[8769F97AB91D583A]) [    ] o.a.s.l.LogWatcher SLF4J impl is org.slf4j.impl.Log4jLoggerFactory
   [junit4]   2> 1469180 INFO  (TEST-LeaderFailoverAfterPartitionTest.test-seed#[8769F97AB91D583A]) [    ] o.a.s.l.LogWatcher Registering Log Listener [Log4j (org.slf4j.impl.Log4jLoggerFactory)]
   [junit4]   2> 1469180 INFO  (TEST-LeaderFailoverAfterPartitionTest.test-seed#[8769F97AB91D583A]) [    ] o.a.s.c.ZkContainer Zookeeper client=127.0.0.1:37238/solr
   [junit4]   2> 1469180 INFO  (TEST-LeaderFailoverAfterPartitionTest.test-seed#[8769F97AB91D583A]) [    ] o.a.s.c.ZkController zkHost includes chroot
   [junit4]   2> 1469180 INFO  (TEST-LeaderFailoverAfterPartitionTest.test-seed#[8769F97AB91D583A]) [    ] o.a.s.c.c.SolrZkClient Using default ZkCredentialsProvider
   [junit4]   2> 1469180 INFO  (TEST-LeaderFailoverAfterPartitionTest.test-seed#[8769F97AB91D583A]) [    ] o.a.s.c.c.ConnectionManager Waiting for client to connect to ZooKeeper
   [junit4]   2> 1469181 INFO  (zkCallback-2089-thread-1) [    ] o.a.s.c.c.ConnectionManager Watcher org.apache.solr.common.cloud.ConnectionManager@3879759 name:ZooKeeperConnection Watcher:127.0.0.1:37238 got event WatchedEvent state:SyncConnected type:None path:null path:null type:None
   [junit4]   2> 1469181 INFO  (TEST-LeaderFailoverAfterPartitionTest.test-seed#[8769F97AB91D583A]) [    ] o.a.s.c.c.ConnectionManager Client is connected to ZooKeeper
   [junit4]   2> 1469181 INFO  (TEST-LeaderFailoverAfterPartitionTest.test-seed#[8769F97AB91D583A]) [    ] o.a.s.c.c.SolrZkClient Using default ZkACLProvider
   [junit4]   2> 1469181 INFO  (TEST-LeaderFailoverAfterPartitionTest.test-seed#[8769F97AB91D583A]) [n:127.0.0.1:36543_    ] o.a.s.c.ZkController Added new OnReconnect listener org.apache.solr.cloud.ZkController$$Lambda$13/1229278796@3c50008e
   [junit4]   2> 1469182 INFO  (TEST-LeaderFailoverAfterPartitionTest.test-seed#[8769F97AB91D583A]) [n:127.0.0.1:36543_    ] o.a.s.c.c.ConnectionManager Waiting for client to connect to ZooKeeper
   [junit4]   2> 1469182 INFO  (zkCallback-2090-thread-1-processing-n:127.0.0.1:36543_) [n:127.0.0.1:36543_    ] o.a.s.c.c.ConnectionManager Watcher org.apache.solr.common.cloud.ConnectionManager@31aa8a3c name:ZooKeeperConnection Watcher:127.0.0.1:37238/solr got event WatchedEvent state:SyncConnected type:None path:null path:null type:None
   [junit4]   2> 1469182 INFO  (TEST-LeaderFailoverAfterPartitionTest.test-seed#[8769F97AB91D583A]) [n:127.0.0.1:36543_    ] o.a.s.c.c.ConnectionManager Client is connected to ZooKeeper
   [junit4]   2> 1469183 INFO  (TEST-LeaderFailoverAfterPartitionTest.test-seed#[8769F97AB91D583A]) [n:127.0.0.1:36543_    ] o.a.s.c.c.SolrZkClient makePath: /overseer/queue
   [junit4]   2> 1469183 INFO  (TEST-LeaderFailoverAfterPartitionTest.test-seed#[8769F97AB91D583A]) [n:127.0.0.1:36543_    ] o.a.s.c.c.SolrZkClient makePath: /overseer/collection-queue-work
   [junit4]   2> 1469184 INFO  (TEST-LeaderFailoverAfterPartitionTest.test-seed#[8769F97AB91D583A]) [n:127.0.0.1:36543_    ] o.a.s.c.c.SolrZkClient makePath: /overseer/collection-map-running
   [junit4]   2> 1469184 INFO  (TEST-LeaderFailoverAfterPartitionTest.test-seed#[8769F97AB91D583A]) [n:127.0.0.1:36543_    ] o.a.s.c.c.SolrZkClient makePath: /overseer/collection-map-completed
   [junit4]   2> 1469185 INFO  (TEST-LeaderFailoverAfterPartitionTest.test-seed#[8769F97AB91D583A]) [n:127.0.0.1:36543_    ] o.a.s.c.c.SolrZkClient makePath: /overseer/collection-map-failure
   [junit4]   2> 1469185 INFO  (TEST-LeaderFailoverAfterPartitionTest.test-seed#[8769F97AB91D583A]) [n:127.0.0.1:36543_    ] o.a.s.c.c.SolrZkClient makePath: /live_nodes
   [junit4]   2> 1469186 INFO  (TEST-LeaderFailoverAfterPartitionTest.test-seed#[8769F97AB91D583A]) [n:127.0.0.1:36543_    ] o.a.s.c.c.SolrZkClient makePath: /aliases.json
   [junit4]   2> 1469186 INFO  (TEST-LeaderFailoverAfterPartitionTest.test-seed#[8769F97AB91D583A]) [n:127.0.0.1:36543_    ] o.a.s.c.c.SolrZkClient makePath: /clusterstate.json
   [junit4]   2> 1469186 INFO  (TEST-LeaderFailoverAfterPartitionTest.test-seed#[8769F97AB91D583A]) [n:127.0.0.1:36543_    ] o.a.s.c.c.SolrZkClient makePath: /security.json
   [junit4]   2> 1469186 INFO  (TEST-LeaderFailoverAfterPartitionTest.test-seed#[8769F97AB91D583A]) [n:127.0.0.1:36543_    ] o.a.s.c.c.ZkStateReader Updating cluster state from ZooKeeper... 
   [junit4]   2> 1469187 INFO  (TEST-LeaderFailoverAfterPartitionTest.test-seed#[8769F97AB91D583A]) [n:127.0.0.1:36543_    ] o.a.s.c.c.ZkStateReader Loaded empty cluster properties
   [junit4]   2> 1469187 INFO  (TEST-LeaderFailoverAfterPartitionTest.test-seed#[8769F97AB91D583A]) [n:127.0.0.1:36543_    ] o.a.s.c.c.ZkStateReader Updated live nodes from ZooKeeper... (0) -> (0)
   [junit4]   2> 1469187 INFO  (TEST-LeaderFailoverAfterPartitionTest.test-seed#[8769F97AB91D583A]) [n:127.0.0.1:36543_    ] o.a.s.c.c.SolrZkClient makePath: /overseer_elect
   [junit4]   2> 1469188 INFO  (TEST-LeaderFailoverAfterPartitionTest.test-seed#[8769F97AB91D583A]) [n:127.0.0.1:36543_    ] o.a.s.c.c.SolrZkClient makePath: /overseer_elect/election
   [junit4]   2> 1469188 INFO  (TEST-LeaderFailoverAfterPartitionTest.test-seed#[8769F97AB91D583A]) [n:127.0.0.1:36543_    ] o.a.s.c.Overseer Overseer (id=null) closing
   [junit4]   2> 1469188 INFO  (TEST-LeaderFailoverAfterPartitionTest.test-seed#[8769F97AB91D583A]) [n:127.0.0.1:36543_    ] o.a.s.c.LeaderElector Joined leadership election with path: /overseer_elect/election/96219950768979972-127.0.0.1:36543_-n_0000000000
   [junit4]   2> 1469188 INFO  (TEST-LeaderFailoverAfterPartitionTest.test-seed#[8769F97AB91D583A]) [n:127.0.0.1:36543_    ] o.a.s.c.OverseerElectionContext I am going to be the leader 127.0.0.1:36543_
   [junit4]   2> 1469188 INFO  (TEST-LeaderFailoverAfterPartitionTest.test-seed#[8769F97AB91D583A]) [n:127.0.0.1:36543_    ] o.a.s.c.c.SolrZkClient makePath: /overseer_elect/leader
   [junit4]   2> 1469189 INFO  (TEST-LeaderFailoverAfterPartitionTest.test-seed#[8769F97AB91D583A]) [n:127.0.0.1:36543_    ] o.a.s.c.Overseer Overseer (id=96219950768979972-127.0.0.1:36543_-n_0000000000) starting
   [junit4]   2> 1469189 INFO  (TEST-LeaderFailoverAfterPartitionTest.test-seed#[8769F97AB91D583A]) [n:127.0.0.1:36543_    ] o.a.s.c.c.SolrZkClient makePath: /overseer/queue-work
   [junit4]   2> 1469191 INFO  (TEST-LeaderFailoverAfterPartitionTest.test-seed#[8769F97AB91D583A]) [n:127.0.0.1:36543_    ] o.a.s.c.OverseerAutoReplicaFailoverThread Starting OverseerAutoReplicaFailoverThread autoReplicaFailoverWorkLoopDelay=10000 autoReplicaFailoverWaitAfterExpiration=10000 autoReplicaFailoverBadNodeExpiration=60000
   [junit4]   2> 1469191 INFO  (OverseerCollectionConfigSetProcessor-96219950768979972-127.0.0.1:36543_-n_0000000000) [n:127.0.0.1:36543_    ] o.a.s.c.OverseerTaskProcessor Process current queue of overseer operations
   [junit4]   2> 1469192 INFO  (TEST-LeaderFailoverAfterPartitionTest.test-seed#[8769F97AB91D583A]) [n:127.0.0.1:36543_    ] o.a.s.c.ZkController Register node as live in ZooKeeper:/live_nodes/127.0.0.1:36543_
   [junit4]   2> 1469192 INFO  (TEST-LeaderFailoverAfterPartitionTest.test-seed#[8769F97AB91D583A]) [n:127.0.0.1:36543_    ] o.a.s.c.c.SolrZkClient makePath: /live_nodes/127.0.0.1:36543_
   [junit4]   2> 1469192 INFO  (OverseerStateUpdate-96219950768979972-127.0.0.1:36543_-n_0000000000) [n:127.0.0.1:36543_    ] o.a.s.c.Overseer Starting to work on the main queue
   [junit4]   2> 1469192 INFO  (zkCallback-2090-thread-1-processing-n:127.0.0.1:36543_) [n:127.0.0.1:36543_    ] o.a.s.c.c.ZkStateReader A live node change: [WatchedEvent state:SyncConnected type:NodeChildrenChanged path:/live_nodes], has occurred - updating... (live nodes size: [0])
   [junit4]   2> 1469192 INFO  (OverseerStateUpdate-96219950768979972-127.0.0.1:36543_-n_0000000000) [n:127.0.0.1:36543_    ] o.a.s.c.c.ZkStateReader Updated live nodes from ZooKeeper... (0) -> (1)
   [junit4]   2> 1469192 INFO  (zkCallback-2090-thread-1-processing-n:127.0.0.1:36543_) [n:127.0.0.1:36543_    ] o.a.s.c.c.ZkStateReader Updated live nodes from ZooKeeper... (1) -> (1)
   [junit4]   2> 1469199 INFO  (TEST-LeaderFailoverAfterPartitionTest.test-seed#[8769F97AB91D583A]) [n:127.0.0.1:36543_    ] o.a.s.c.CoreContainer Security conf doesn't exist. Skipping setup for authorization module.
   [junit4]   2> 1469199 INFO  (TEST-LeaderFailoverAfterPartitionTest.test-seed#[8769F97AB91D583A]) [n:127.0.0.1:36543_    ] o.a.s.c.CoreContainer No authentication plugin used.
   [junit4]   2> 1469199 INFO  (TEST-LeaderFailoverAfterPartitionTest.test-seed#[8769F97AB91D583A]) [n:127.0.0.1:36543_    ] o.a.s.c.CorePropertiesLocator Looking for core definitions underneath /home/jenkins/workspace/Lucene-Solr-master-Linux/solr/build/solr-core/test/J2/temp/solr.cloud.LeaderFailoverAfterPartitionTest_8769F97AB91D583A-001/control-001/cores
   [junit4]   2> 1469200 INFO  (TEST-LeaderFailoverAfterPartitionTest.test-seed#[8769F97AB91D583A]) [n:127.0.0.1:36543_    ] o.a.s.c.CoreDescriptor Created CoreDescriptor: {name=collection1, config=solrconfig.xml, transient=false, schema=schema.xml, loadOnStartup=true, configSetProperties=configsetprops.json, collection=control_collection, coreNodeName=, dataDir=data/, shard=}
   [junit4]   2> 1469200 INFO  (TEST-LeaderFailoverAfterPartitionTest.test-seed#[8769F97AB91D583A]) [n:127.0.0.1:36543_    ] o.a.s.c.CorePropertiesLocator Found core collection1 in /home/jenkins/workspace/Lucene-Solr-master-Linux/solr/build/solr-core/test/J2/temp/solr.cloud.LeaderFailoverAfterPartitionTest_8769F97AB91D583A-001/control-001/cores/collection1
   [junit4]   2> 1469200 INFO  (TEST-LeaderFailoverAfterPartitionTest.test-seed#[8769F97AB91D583A]) [n:127.0.0.1:36543_    ] o.a.s.c.CorePropertiesLocator Found 1 core definitions
   [junit4]   2> 1469200 INFO  (coreLoadExecutor-5664-thread-1-processing-n:127.0.0.1:36543_) [n:127.0.0.1:36543_ c:control_collection   x:collection1] o.a.s.c.ZkController publishing state=down
   [junit4]   2> 1469200 INFO  (coreLoadExecutor-5664-thread-1-processing-n:127.0.0.1:36543_) [n:127.0.0.1:36543_ c:control_collection   x:collection1] o.a.s.c.ZkController numShards not found on descriptor - reading it from system property
   [junit4]   2> 1469200 INFO  (TEST-LeaderFailoverAfterPartitionTest.test-seed#[8769F97AB91D583A]) [n:127.0.0.1:36543_    ] o.a.s.s.SolrDispatchFilter user.dir=/home/jenkins/workspace/Lucene-Solr-master-Linux/solr/build/solr-core/test/J2
   [junit4]   2> 1469200 INFO  (TEST-LeaderFailoverAfterPartitionTest.test-seed#[8769F97AB91D583A]) [n:127.0.0.1:36543_    ] o.a.s.s.SolrDispatchFilter SolrDispatchFilter.init() done
   [junit4]   2> 1469201 INFO  (coreLoadExecutor-5664-thread-1-processing-n:127.0.0.1:36543_) [n:127.0.0.1:36543_ c:control_collection   x:collection1] o.a.s.c.ZkController Collection control_collection not visible yet, but flagging it so a watch is registered when it becomes visible
   [junit4]   2> 1469201 INFO  (OverseerStateUpdate-96219950768979972-127.0.0.1:36543_-n_0000000000) [n:127.0.0.1:36543_    ] o.a.s.c.Overseer processMessage: queueSize: 1, message = {
   [junit4]   2>   "core":"collection1",
   [junit4]   2>   "roles":null,
   [junit4]   2>   "base_url":"http://127.0.0.1:36543",
   [junit4]   2>   "node_name":"127.0.0.1:36543_",
   [junit4]   2>   "numShards":"1",
   [junit4]   2>   "state":"down",
   [junit4]   2>   "shard":null,
   [junit4]   2>   "collection":"control_collection",
   [junit4]   2>   "operation":"state"} current state version: 0
   [junit4]   2> 1469201 INFO  (OverseerStateUpdate-96219950768979972-127.0.0.1:36543_-n_0000000000) [n:127.0.0.1:36543_    ] o.a.s.c.o.ReplicaMutator Update state numShards=1 message={
   [junit4]   2>   "core":"collection1",
   [junit4]   2>   "roles":null,
   [junit4]   2>   "base_url":"http://127.0.0.1:36543",
   [junit4]   2>   "node_name":"127.0.0.1:36543_",
   [junit4]   2>   "numShards":"1",
   [junit4]   2>   "state":"down",
   [junit4]   2>   "shard":null,
   [junit4]   2>   "collection":"control_collection",
   [junit4]   2>   "operation":"state"}
   [junit4]   2> 1469201 INFO  (coreLoadExecutor-5664-thread-1-processing-n:127.0.0.1:36543_) [n:127.0.0.1:36543_ c:control_collection   x:collection1] o.a.s.c.c.ZkStateReader Deleting data for [control_collection]
   [junit4]   2> 1469201 INFO  (OverseerStateUpdate-96219950768979972-127.0.0.1:36543_-n_0000000000) [n:127.0.0.1:36543_    ] o.a.s.c.o.ClusterStateMutator building a new cName: control_collection
   [junit4]   2> 1469201 INFO  (OverseerStateUpdate-96219950768979972-127.0.0.1:36543_-n_0000000000) [n:127.0.0.1:36543_    ] o.a.s.c.o.ReplicaMutator Assigning new node to shard shard=shard1
   [junit4]   2> 1469201 INFO  (coreLoadExecutor-5664-thread-1-processing-n:127.0.0.1:36543_) [n:127.0.0.1:36543_ c:control_collection   x:collection1] o.a.s.c.ZkController look for our core node name
   [junit4]   2> 1469202 INFO  (zkCallback-2090-thread-1-processing-n:127.0.0.1:36543_) [n:127.0.0.1:36543_    ] o.a.s.c.c.ZkStateReader A cluster state change: [WatchedEvent state:SyncConnected type:NodeDataChanged path:/clusterstate.json], has occurred - updating... (live nodes size: [1])
   [junit4]   2> 1470202 INFO  (coreLoadExecutor-5664-thread-1-processing-n:127.0.0.1:36543_) [n:127.0.0.1:36543_ c:control_collection   x:collection1] o.a.s.c.ZkController waiting to find shard id in clusterstate for collection1
   [junit4]   2> 1470202 INFO  (coreLoadExecutor-5664-thread-1-processing-n:127.0.0.1:36543_) [n:127.0.0.1:36543_ c:control_collection   x:collection1] o.a.s.c.ZkController Check for collection zkNode:control_collection
   [junit4]   2> 1470202 INFO  (coreLoadExecutor-5664-thread-1-processing-n:127.0.0.1:36543_) [n:127.0.0.1:36543_ c:control_collection   x:collection1] o.a.s.c.ZkController Collection zkNode exists
   [junit4]   2> 1470202 INFO  (coreLoadExecutor-5664-thread-1-processing-n:127.0.0.1:36543_) [n:127.0.0.1:36543_ c:control_collection   x:collection1] o.a.s.c.c.ZkStateReader Load collection config from: [/collections/control_collection]
   [junit4]   2> 1470202 INFO  (coreLoadExecutor-5664-thread-1-processing-n:127.0.0.1:36543_) [n:127.0.0.1:36543_ c:control_collection   x:collection1] o.a.s.c.c.ZkStateReader path=[/collections/control_collection] [configName]=[conf1] specified config exists in ZooKeeper
   [junit4]   2> 1470202 INFO  (coreLoadExecutor-5664-thread-1-processing-n:127.0.0.1:36543_) [n:127.0.0.1:36543_ c:control_collection   x:collection1] o.a.s.c.SolrResourceLoader new SolrResourceLoader for directory: '/home/jenkins/workspace/Lucene-Solr-master-Linux/solr/build/solr-core/test/J2/temp/solr.cloud.LeaderFailoverAfterPartitionTest_8769F97AB91D583A-001/control-001/cores/collection1'
   [junit4]   2> 1470202 INFO  (coreLoadExecutor-5664-thread-1-processing-n:127.0.0.1:36543_) [n:127.0.0.1:36543_ c:control_collection   x:collection1] o.a.s.c.SolrResourceLoader JNDI not configured for solr (NoInitialContextEx)
   [junit4]   2> 1470202 INFO  (coreLoadExecutor-5664-thread-1-processing-n:127.0.0.1:36543_) [n:127.0.0.1:36543_ c:control_collection   x:collection1] o.a.s.c.SolrResourceLoader solr home defaulted to 'solr/' (could not find system property or JNDI)
   [junit4]   2> 1470203 INFO  (coreLoadExecutor-5664-thread-1-processing-n:127.0.0.1:36543_) [n:127.0.0.1:36543_ c:control_collection   x:collection1] o.a.s.c.Config loaded config solrconfig.xml with version 0 
   [junit4]   2> 1470206 INFO  (coreLoadExecutor-5664-thread-1-processing-n:127.0.0.1:36543_) [n:127.0.0.1:36543_ c:control_collection   x:collection1] o.a.s.c.SolrConfig current version of requestparams : -1
   [junit4]   2> 1470209 WARN  (coreLoadExecutor-5664-thread-1-processing-n:127.0.0.1:36543_) [n:127.0.0.1:36543_ c:control_collection   x:collection1] o.a.s.c.Config Beginning with Solr 5.5, <mergePolicy> is deprecated, use <mergePolicyFactory> instead.
   [junit4]   2> 1470209 INFO  (coreLoadExecutor-5664-thread-1-processing-n:127.0.0.1:36543_) [n:127.0.0.1:36543_ c:control_collection   x:collection1] o.a.s.c.SolrConfig Using Lucene MatchVersion: 7.0.0
   [junit4]   2> 1470216 INFO  (coreLoadExecutor-5664-thread-1-processing-n:127.0.0.1:36543_) [n:127.0.0.1:36543_ c:control_collection   x:collection1] o.a.s.c.SolrConfig Loaded SolrConfig: solrconfig.xml
   [junit4]   2> 1470232 INFO  (coreLoadExecutor-5664-thread-1-processing-n:127.0.0.1:36543_) [n:127.0.0.1:36543_ c:control_collection   x:collection1] o.a.s.s.IndexSchema [collection1] Schema name=test
   [junit4]   2> 1470289 INFO  (coreLoadExecutor-5664-thread-1-processing-n:127.0.0.1:36543_) [n:127.0.0.1:36543_ c:control_collection   x:collection1] o.a.s.s.OpenExchangeRatesOrgProvider Initialized with rates=open-exchange-rates.json, refreshInterval=1440.
   [junit4]   2> 1470292 INFO  (coreLoadExecutor-5664-thread-1-processing-n:127.0.0.1:36543_) [n:127.0.0.1:36543_ c:control_collection   x:collection1] o.a.s.s.IndexSchema default search field in schema is text
   [junit4]   2> 1470293 INFO  (coreLoadExecutor-5664-thread-1-processing-n:127.0.0.1:36543_) [n:127.0.0.1:36543_ c:control_collection   x:collection1] o.a.s.s.IndexSchema unique key field: id
   [junit4]   2> 1470296 INFO  (coreLoadExecutor-5664-thread-1-processing-n:127.0.0.1:36543_) [n:127.0.0.1:36543_ c:control_collection   x:collection1] o.a.s.s.FileExchangeRateProvider Reloading exchange rates from file currency.xml
   [junit4]   2> 1470298 INFO  (coreLoadExecutor-5664-thread-1-processing-n:127.0.0.1:36543_) [n:127.0.0.1:36543_ c:control_collection   x:collection1] o.a.s.s.FileExchangeRateProvider Reloading exchange rates from file currency.xml
   [junit4]   2> 1470299 INFO  (coreLoadExecutor-5664-thread-1-processing-n:127.0.0.1:36543_) [n:127.0.0.1:36543_ c:control_collection   x:collection1] o.a.s.s.OpenExchangeRatesOrgProvider Reloading exchange rates from open-exchange-rates.json
   [junit4]   2> 1470299 INFO  (coreLoadExecutor-5664-thread-1-processing-n:127.0.0.1:36543_) [n:127.0.0.1:36543_ c:control_collection   x:collection1] o.a.s.s.OpenExchangeRatesOrgProvider Reloading exchange rates from open-exchange-rates.json
   [junit4]   2> 1470300 INFO  (coreLoadExecutor-5664-thread-1-processing-n:127.0.0.1:36543_) [n:127.0.0.1:36543_ c:control_collection   x:collection1] o.a.s.c.ConfigSetProperties Did not find ConfigSet properties, assuming default properties: Can't find resource 'configsetprops.json' in classpath or '/configs/conf1', cwd=/home/jenkins/workspace/Lucene-Solr-master-Linux/solr/build/solr-core/test/J2
   [junit4]   2> 1470300 INFO  (coreLoadExecutor-5664-thread-1-processing-n:127.0.0.1:36543_) [n:127.0.0.1:36543_ c:control_collection   x:collection1] o.a.s.c.CoreContainer Creating SolrCore 'collection1' using configuration from collection control_collection
   [junit4]   2> 1470300 INFO  (coreLoadExecutor-5664-thread-1-processing-n:127.0.0.1:36543_) [n:127.0.0.1:36543_ c:control_collection s:shard1 r:core_node1 x:collection1] o.a.s.c.SolrCore org.apache.solr.core.MockDirectoryFactory
   [junit4]   2> 1470300 INFO  (coreLoadExecutor-5664-thread-1-processing-n:127.0.0.1:36543_) [n:127.0.0.1:36543_ c:control_collection s:shard1 r:core_node1 x:collection1] o.a.s.c.SolrCore [[collection1] ] Opening new SolrCore at [/home/jenkins/workspace/Lucene-Solr-master-Linux/solr/build/solr-core/test/J2/temp/solr.cloud.LeaderFailoverAfterPartitionTest_8769F97AB91D583A-001/control-001/cores/collection1], dataDir=[/home/jenkins/workspace/Lucene-Solr-master-Linux/solr/build/solr-core/test/J2/temp/solr.cloud.LeaderFailoverAfterPartitionTest_8769F97AB91D583A-001/control-001/cores/collection1/data/]
   [junit4]   2> 1470300 INFO  (coreLoadExecutor-5664-thread-1-processing-n:127.0.0.1:36543_) [n:127.0.0.1:36543_ c:control_collection s:shard1 r:core_node1 x:collection1] o.a.s.c.JmxMonitoredMap JMX monitoring is enabled. Adding Solr mbeans to JMX Server: com.sun.jmx.mbeanserver.JmxMBeanServer@33501c1c
   [junit4]   2> 1470300 INFO  (coreLoadExecutor-5664-thread-1-processing-n:127.0.0.1:36543_) [n:127.0.0.1:36543_ c:control_collection s:shard1 r:core_node1 x:collection1] o.a.s.c.CachingDirectoryFactory return new directory for /home/jenkins/workspace/Lucene-Solr-master-Linux/solr/build/solr-core/test/J2/temp/solr.cloud.LeaderFailoverAfterPartitionTest_8769F97AB91D583A-001/control-001/cores/collection1/data
   [junit4]   2> 1470300 INFO  (coreLoadExecutor-5664-thread-1-processing-n:127.0.0.1:36543_) [n:127.0.0.1:36543_ c:control_collection s:shard1 r:core_node1 x:collection1] o.a.s.c.SolrCore New index directory detected: old=null new=/home/jenkins/workspace/Lucene-Solr-master-Linux/solr/build/solr-core/test/J2/temp/solr.cloud.LeaderFailoverAfterPartitionTest_8769F97AB91D583A-001/control-001/cores/collection1/data/index/
   [junit4]   2> 1470300 WARN  (coreLoadExecutor-5664-thread-1-processing-n:127.0.0.1:36543_) [n:127.0.0.1:36543_ c:control_collection s:shard1 r:core_node1 x:collection1] o.a.s.c.SolrCore [collection1] Solr index directory '/home/jenkins/workspace/Lucene-Solr-master-Linux/solr/build/solr-core/test/J2/temp/solr.cloud.LeaderFailoverAfterPartitionTest_8769F97AB91D583A-001/control-001/cores/collection1/data/index' doesn't exist. Creating new index...
   [junit4]   2> 1470301 INFO  (coreLoadExecutor-5664-thread-1-processing-n:127.0.0.1:36543_) [n:127.0.0.1:36543_ c:control_collection s:shard1 r:core_node1 x:collection1] o.a.s.c.CachingDirectoryFactory return new directory for /home/jenkins/workspace/Lucene-Solr-master-Linux/solr/build/solr-core/test/J2/temp/solr.cloud.LeaderFailoverAfterPartitionTest_8769F97AB91D583A-001/control-001/cores/collection1/data/index
   [junit4]   2> 1470301 INFO  (coreLoadExecutor-5664-thread-1-processing-n:127.0.0.1:36543_) [n:127.0.0.1:36543_ c:control_collection s:shard1 r:core_node1 x:collection1] o.a.s.u.RandomMergePolicy RandomMergePolicy wrapping class org.apache.lucene.index.TieredMergePolicy: [TieredMergePolicy: maxMergeAtOnce=15, maxMergeAtOnceExplicit=36, maxMergedSegmentMB=99.0439453125, floorSegmentMB=1.8603515625, forceMergeDeletesPctAllowed=17.796281055343098, segmentsPerTier=50.0, maxCFSSegmentSizeMB=8.796093022207999E12, noCFSRatio=0.7916605598876311
   [junit4]   2> 1470301 INFO  (coreLoadExecutor-5664-thread-1-processing-n:127.0.0.1:36543_) [n:127.0.0.1:36543_ c:control_collection s:shard1 r:core_node1 x:collection1] o.a.s.c.SolrDeletionPolicy SolrDeletionPolicy.onCommit: commits: num=1
   [junit4]   2> 	commit{dir=MockDirectoryWrapper(RAMDirectory@f8f11f0 lockFactory=org.apache.lucene.store.SingleInstanceLockFactory@2911098e),segFN=segments_1,generation=1}
   [junit4]   2> 1470301 INFO  (coreLoadExecutor-5664-thread-1-processing-n:127.0.0.1:36543_) [n:127.0.0.1:36543_ c:control_collection s:shard1 r:core_node1 x:collection1] o.a.s.c.SolrDeletionPolicy newest commit generation = 1
   [junit4]   2> 1470301 INFO  (OldIndexDirectoryCleanupThreadForCore-collection1) [n:127.0.0.1:36543_ c:control_collection s:shard1 r:core_node1 x:collection1] o.a.s.c.SolrCore Looking for old index directories to cleanup for core collection1 in /home/jenkins/workspace/Lucene-Solr-master-Linux/solr/build/solr-core/test/J2/temp/solr.cloud.LeaderFailoverAfterPartitionTest_8769F97AB91D583A-001/control-001/cores/collection1/data/
   [junit4]   2> 1470301 WARN  (OldIndexDirectoryCleanupThreadForCore-collection1) [n:127.0.0.1:36543_ c:control_collection s:shard1 r:core_node1 x:collection1] o.a.s.c.DirectoryFactory /home/jenkins/workspace/Lucene-Solr-master-Linux/solr/build/solr-core/test/J2/temp/solr.cloud.LeaderFailoverAfterPartitionTest_8769F97AB91D583A-001/control-001/cores/collection1/data/ does not point to a valid data directory; skipping clean-up of old index directories.
   [junit4]   2> 1470303 INFO  (coreLoadExecutor-5664-thread-1-processing-n:127.0.0.1:36543_) [n:127.0.0.1:36543_ c:control_collection s:shard1 r:core_node1 x:collection1] o.a.s.u.p.UpdateRequestProcessorChain creating updateRequestProcessorChain "nodistrib"
   [junit4]   2> 1470303 INFO  (coreLoadExecutor-5664-thread-1-processing-n:127.0.0.1:36543_) [n:127.0.0.1:36543_ c:control_collection s:shard1 r:core_node1 x:collection1] o.a.s.u.p.UpdateRequestProcessorChain creating updateRequestProcessorChain "dedupe"
   [junit4]   2> 1470303 INFO  (coreLoadExecutor-5664-thread-1-processing-n:127.0.0.1:36543_) [n:127.0.0.1:36543_ c:control_collection s:shard1 r:core_node1 x:collection1] o.a.s.u.p.UpdateRequestProcessorChain inserting DistributedUpdateProcessorFactory into updateRequestProcessorChain "dedupe"
   [junit4]   2> 1470303 INFO  (coreLoadExecutor-5664-thread-1-processing-n:127.0.0.1:36543_) [n:127.0.0.1:36543_ c:control_collection s:shard1 r:core_node1 x:collection1] o.a.s.u.p.UpdateRequestProcessorChain creating updateRequestProcessorChain "stored_sig"
   [junit4]   2> 1470303 INFO  (coreLoadExecutor-5664-thread-1-processing-n:127.0.0.1:36543_) [n:127.0.0.1:36543_ c:control_collection s:shard1 r:core_node1 x:collection1] o.a.s.u.p.UpdateRequestProcessorChain inserting DistributedUpdateProcessorFactory into updateRequestProcessorChain "stored_sig"
   [junit4]   2> 1470303 INFO  (coreLoadExecutor-5664-thread-1-processing-n:127.0.0.1:36543_) [n:127.0.0.1:36543_ c:control_collection s:shard1 r:core_node1 x:collection1] o.a.s.u.p.UpdateRequestProcessorChain creating updateRequestProcessorChain "distrib-dup-test-chain-explicit"
   [junit4]   2> 1470303 INFO  (coreLoadExecutor-5664-thread-1-processing-n:127.0.0.1:36543_) [n:127.0.0.1:36543_ c:control_collection s:shard1 r:core_node1 x:collection1] o.a.s.u.p.UpdateRequestProcessorChain creating updateRequestProcessorChain "distrib-dup-test-chain-implicit"
   [junit4]   2> 1470303 INFO  (coreLoadExecutor-5664-thread-1-processing-n:127.0.0.1:36543_) [n:127.0.0.1:36543_ c:control_collection s:shard1 r:core_node1 x:collection1] o.a.s.u.p.UpdateRequestProcessorChain inserting DistributedUpdateProcessorFactory into updateRequestProcessorChain "distrib-dup-test-chain-implicit"
   [junit4]   2> 1470303 INFO  (coreLoadExecutor-5664-thread-1-processing-n:127.0.0.1:36543_) [n:127.0.0.1:36543_ c:control_collection s:shard1 r:core_node1 x:collection1] o.a.s.c.SolrCore no updateRequestProcessorChain defined as default, creating implicit default
   [junit4]   2> 1470303 WARN  (coreLoadExecutor-5664-thread-1-processing-n:127.0.0.1:36543_) [n:127.0.0.1:36543_ c:control_collection s:shard1 r:core_node1 x:collection1] o.a.s.c.RequestHandlers INVALID paramSet a in requestHandler {type = requestHandler,name = /dump,class = DumpRequestHandler,args = {defaults={a=A,b=B}}}
   [junit4]   2> 1470304 INFO  (coreLoadExecutor-5664-thread-1-processing-n:127.0.0.1:36543_) [n:127.0.0.1:36543_ c:control_collection s:shard1 r:core_node1 x:collection1] o.a.s.h.l.XMLLoader xsltCacheLifetimeSeconds=60
   [junit4]   2> 1470305 INFO  (coreLoadExecutor-5664-thread-1-processing-n:127.0.0.1:36543_) [n:127.0.0.1:36543_ c:control_collection s:shard1 r:core_node1 x:collection1] o.a.s.h.l.XMLLoader xsltCacheLifetimeSeconds=60
   [junit4]   2> 1470305 INFO  (coreLoadExecutor-5664-thread-1-processing-n:127.0.0.1:36543_) [n:127.0.0.1:36543_ c:control_collection s:shard1 r:core_node1 x:collection1] o.a.s.h.l.XMLLoader xsltCacheLifetimeSeconds=60
   [junit4]   2> 1470306 INFO  (coreLoadExecutor-5664-thread-1-processing-n:127.0.0.1:36543_) [n:127.0.0.1:36543_ c:control_collection s:shard1 r:core_node1 x:collection1] o.a.s.h.l.XMLLoader xsltCacheLifetimeSeconds=60
   [junit4]   2> 1470307 INFO  (coreLoadExecutor-5664-thread-1-processing-n:127.0.0.1:36543_) [n:127.0.0.1:36543_ c:control_collection s:shard1 r:core_node1 x:collection1] o.a.s.c.RequestHandlers Registered paths: /admin/mbeans,standard,/update/json/docs,/admin/luke,/export,/get,/admin/properties,/update/json,/admin/threads,/dump,/update/csv,/sql,/graph,/admin/segments,/admin/system,/replication,/config,/stream,/schema,/admin/plugins,/admin/logging,/admin/ping,/update,/admin/file,/terms
   [junit4]   2> 1470308 INFO  (coreLoadExecutor-5664-thread-1-processing-n:127.0.0.1:36543_) [n:127.0.0.1:36543_ c:control_collection s:shard1 r:core_node1 x:collection1] o.a.s.c.SolrCore Using default statsCache cache: org.apache.solr.search.stats.LocalStatsCache
   [junit4]   2> 1470308 INFO  (coreLoadExecutor-5664-thread-1-processing-n:127.0.0.1:36543_) [n:127.0.0.1:36543_ c:control_collection s:shard1 r:core_node1 x:collection1] o.a.s.u.UpdateHandler Using UpdateLog implementation: org.apache.solr.update.UpdateLog
   [junit4]   2> 1470308 INFO  (coreLoadExecutor-5664-thread-1-processing-n:127.0.0.1:36543_) [n:127.0.0.1:36543_ c:control_collection s:shard1 r:core_node1 x:collection1] o.a.s.u.UpdateLog Initializing UpdateLog: dataDir= defaultSyncLevel=FLUSH numRecordsToKeep=100 maxNumLogsToKeep=10 numVersionBuckets=65536
   [junit4]   2> 1470308 INFO  (coreLoadExecutor-5664-thread-1-processing-n:127.0.0.1:36543_) [n:127.0.0.1:36543_ c:control_collection s:shard1 r:core_node1 x:collection1] o.a.s.u.CommitTracker Hard AutoCommit: disabled
   [junit4]   2> 1470308 INFO  (coreLoadExecutor-5664-thread-1-processing-n:127.0.0.1:36543_) [n:127.0.0.1:36543_ c:control_collection s:shard1 r:core_node1 x:collection1] o.a.s.u.CommitTracker Soft AutoCommit: disabled
   [junit4]   2> 1470309 INFO  (coreLoadExecutor-5664-thread-1-processing-n:127.0.0.1:36543_) [n:127.0.0.1:36543_ c:control_collection s:shard1 r:core_node1 x:collection1] o.a.s.u.RandomMergePolicy RandomMergePolicy wrapping class org.apache.lucene.index.TieredMergePolicy: [TieredMergePolicy: maxMergeAtOnce=44, maxMergeAtOnceExplicit=17, maxMergedSegmentMB=0.2099609375, floorSegmentMB=0.9365234375, forceMergeDeletesPctAllowed=18.01654154229447, segmentsPerTier=38.0, maxCFSSegmentSizeMB=8.796093022207999E12, noCFSRatio=0.0
   [junit4]   2> 1470309 INFO  (coreLoadExecutor-5664-thread-1-processing-n:127.0.0.1:36543_) [n:127.0.0.1:36543_ c:control_collection s:shard1 r:core_node1 x:collection1] o.a.s.c.SolrDeletionPolicy SolrDeletionPolicy.onInit: commits: num=1
   [junit4]   2> 	commit{dir=MockDirectoryWrapper(RAMDirectory@f8f11f0 lockFactory=org.apache.lucene.store.SingleInstanceLockFactory@2911098e),segFN=segments_1,generation=1}
   [junit4]   2> 1470309 INFO  (coreLoadExecutor-5664-thread-1-processing-n:127.0.0.1:36543_) [n:127.0.0.1:36543_ c:control_collection s:shard1 r:core_node1 x:collection1] o.a.s.c.SolrDeletionPolicy newest commit generation = 1
   [junit4]   2> 1470309 INFO  (coreLoadExecutor-5664-thread-1-processing-n:127.0.0.1:36543_) [n:127.0.0.1:36543_ c:control_collection s:shard1 r:core_node1 x:collection1] o.a.s.s.SolrIndexSearcher Opening [Searcher@3d3fc0d1[collection1] main]
   [junit4]   2> 1470309 INFO  (coreLoadExecutor-5664-thread-1-processing-n:127.0.0.1:36543_) [n:127.0.0.1:36543_ c:control_collection s:shard1 r:core_node1 x:collection1] o.a.s.c.c.ZkStateReader Load collection config from: [/collections/control_collection]
   [junit4]   2> 1470309 INFO  (coreLoadExecutor-5664-thread-1-processing-n:127.0.0.1:36543_) [n:127.0.0.1:36543_ c:control_collection s:shard1 r:core_node1 x:collection1] o.a.s.c.c.ZkStateReader path=[/collections/control_collection] [configName]=[conf1] specified config exists in ZooKeeper
   [junit4]   2> 1470309 INFO  (coreLoadExecutor-5664-thread-1-processing-n:127.0.0.1:36543_) [n:127.0.0.1:36543_ c:control_collection s:shard1 r:core_node1 x:collection1] o.a.s.r.ManagedResourceStorage Setting up ZooKeeper-based storage for the RestManager with znodeBase: /configs/conf1
   [junit4]   2> 1470310 INFO  (coreLoadExecutor-5664-thread-1-processing-n:127.0.0.1:36543_) [n:127.0.0.1:36543_ c:control_collection s:shard1 r:core_node1 x:collection1] o.a.s.r.ManagedResourceStorage Configured ZooKeeperStorageIO with znodeBase: /configs/conf1
   [junit4]   2> 1470310 INFO  (coreLoadExecutor-5664-thread-1-processing-n:127.0.0.1:36543_) [n:127.0.0.1:36543_ c:control_collection s:shard1 r:core_node1 x:collection1] o.a.s.r.RestManager Initializing RestManager with initArgs: {}
   [junit4]   2> 1470310 INFO  (coreLoadExecutor-5664-thread-1-processing-n:127.0.0.1:36543_) [n:127.0.0.1:36543_ c:control_collection s:shard1 r:core_node1 x:collection1] o.a.s.r.ManagedResourceStorage Reading _rest_managed.json using ZooKeeperStorageIO:path=/configs/conf1
   [junit4]   2> 1470310 INFO  (coreLoadExecutor-5664-thread-1-processing-n:127.0.0.1:36543_) [n:127.0.0.1:36543_ c:control_collection s:shard1 r:core_node1 x:collection1] o.a.s.r.ManagedResourceStorage No data found for znode /configs/conf1/_rest_managed.json
   [junit4]   2> 1470310 INFO  (coreLoadExecutor-5664-thread-1-processing-n:127.0.0.1:36543_) [n:127.0.0.1:36543_ c:control_collection s:shard1 r:core_node1 x:collection1] o.a.s.r.ManagedResourceStorage Loaded null at path _rest_managed.json using ZooKeeperStorageIO:path=/configs/conf1
   [junit4]   2> 1470310 INFO  (coreLoadExecutor-5664-thread-1-processing-n:127.0.0.1:36543_) [n:127.0.0.1:36543_ c:control_collection s:shard1 r:core_node1 x:collection1] o.a.s.r.RestManager Initializing 0 registered ManagedResources
   [junit4]   2> 1470310 INFO  (coreLoadExecutor-5664-thread-1-processing-n:127.0.0.1:36543_) [n:127.0.0.1:36543_ c:control_collection s:shard1 r:core_node1 x:collection1] o.a.s.h.ReplicationHandler Commits will be reserved for  10000
   [junit4]   2> 1470311 INFO  (searcherExecutor-5665-thread-1-processing-n:127.0.0.1:36543_ x:collection1 s:shard1 c:control_collection r:core_node1) [n:127.0.0.1:36543_ c:control_collection s:shard1 r:core_node1 x:collection1] o.a.s.c.SolrCore [collection1] Registered new searcher Searcher@3d3fc0d1[collection1] main{ExitableDirectoryReader(UninvertingDirectoryReader())}
   [junit4]   2> 1470311 INFO  (coreLoadExecutor-5664-thread-1-processing-n:127.0.0.1:36543_) [n:127.0.0.1:36543_ c:control_collection s:shard1 r:core_node1 x:collection1] o.a.s.u.UpdateLog Looking up max value of version field to seed version buckets
   [junit4]   2> 1470311 INFO  (coreLoadExecutor-5664-thread-1-processing-n:127.0.0.1:36543_) [n:127.0.0.1:36543_ c:control_collection s:shard1 r:core_node1 x:collection1] o.a.s.u.VersionInfo Refreshing highest value of _version_ for 65536 version buckets from index
   [junit4]   2> 1470311 INFO  (coreLoadExecutor-5664-thread-1-processing-n:127.0.0.1:36543_) [n:127.0.0.1:36543_ c:control_collection s:shard1 r:core_node1 x:collection1] o.a.s.u.VersionInfo No terms found for _version_, cannot seed version bucket highest value from index
   [junit4]   2> 1470311 INFO  (coreLoadExecutor-5664-thread-1-processing-n:127.0.0.1:36543_) [n:127.0.0.1:36543_ c:control_collection s:shard1 r:core_node1 x:collection1] o.a.s.u.UpdateLog Could not find max version in index or recent updates, using new clock 1539519213674168320
   [junit4]   2> 1470313 INFO  (coreLoadExecutor-5664-thread-1-processing-n:127.0.0.1:36543_) [n:127.0.0.1:36543_ c:control_collection s:shard1 r:core_node1 x:collection1] o.a.s.u.UpdateLog Took 1.0ms to seed version buckets with highest version 1539519213674168320
   [junit4]   2> 1470313 INFO  (coreLoadExecutor-5664-thread-1-processing-n:127.0.0.1:36543_) [n:127.0.0.1:36543_ c:control_collection s:shard1 r:core_node1 x:collection1] o.a.s.c.ZkController watch zkdir /configs/conf1
   [junit4]   2> 1470313 INFO  (coreLoadExecutor-5664-thread-1-processing-n:127.0.0.1:36543_) [n:127.0.0.1:36543_ c:control_collection s:shard1 r:core_node1 x:collection1] o.a.s.c.CoreContainer registering core: collection1
   [junit4]   2> 1470313 INFO  (coreZkRegister-5658-thread-1-processing-n:127.0.0.1:36543_ x:collection1 s:shard1 c:control_collection r:core_node1) [n:127.0.0.1:36543_ c:control_collection s:shard1 r:core_node1 x:collection1] o.a.s.c.ZkController Register replica - core:collection1 address:http://127.0.0.1:36543 collection:control_collection shard:shard1
   [junit4]   2> 1470314 INFO  (coreZkRegister-5658-thread-1-processing-n:127.0.0.1:36543_ x:collection1 s:shard1 c:control_collection r:core_node1) [n:127.0.0.1:36543_ c:control_collection s:shard1 r:core_node1 x:collection1] o.a.s.c.c.SolrZkClient makePath: /collections/control_collection/leader_elect/shard1/election
   [junit4]   2> 1470314 INFO  (coreZkRegister-5658-thread-1-processing-n:127.0.0.1:36543_ x:collection1 s:shard1 c:control_collection r:core_node1) [n:127.0.0.1:36543_ c:control_collection s:shard1 r:core_node1 x:collection1] o.a.s.c.LeaderElector Joined leadership election with path: /collections/control_collection/leader_elect/shard1/election/96219950768979972-core_node1-n_0000000000
   [junit4]   2> 1470315 INFO  (coreZkRegister-5658-thread-1-processing-n:127.0.0.1:36543_ x:collection1 s:shard1 c:control_collection r:core_node1) [n:127.0.0.1:36543_ c:control_collection s:shard1 r:core_node1 x:collection1] o.a.s.c.ShardLeaderElectionContext Running the leader process for shard=shard1 and weAreReplacement=false and leaderVoteWait=10000
   [junit4]   2> 1470315 INFO  (coreZkRegister-5658-thread-1-processing-n:127.0.0.1:36543_ x:collection1 s:shard1 c:control_collection r:core_node1) [n:127.0.0.1:36543_ c:control_collection s:shard1 r:core_node1 x:collection1] o.a.s.c.ShardLeaderElectionContext Enough replicas found to continue.
   [junit4]   2> 1470315 INFO  (coreZkRegister-5658-thread-1-processing-n:127.0.0.1:36543_ x:collection1 s:shard1 c:control_collection r:core_node1) [n:127.0.0.1:36543_ c:control_collection s:shard1 r:core_node1 x:collection1] o.a.s.c.ShardLeaderElectionContext I may be the new leader - try and sync
   [junit4]   2> 1470315 INFO  (coreZkRegister-5658-thread-1-processing-n:127.0.0.1:36543_ x:collection1 s:shard1 c:control_collection r:core_node1) [n:127.0.0.1:36543_ c:control_collection s:shard1 r:core_node1 x:collection1] o.a.s.c.SyncStrategy Sync replicas to http://127.0.0.1:36543/collection1/
   [junit4]   2> 1470315 INFO  (coreZkRegister-5658-thread-1-processing-n:127.0.0.1:36543_ x:collection1 s:shard1 c:control_collection r:core_node1) [n:127.0.0.1:36543_ c:control_collection s:shard1 r:core_node1 x:collection1] o.a.s.c.SyncStrategy Sync Success - now sync replicas to me
   [junit4]   2> 1470315 INFO  (OverseerStateUpdate-96219950768979972-127.0.0.1:36543_-n_0000000000) [n:127.0.0.1:36543_    ] o.a.s.c.Overseer processMessage: queueSize: 1, message = {
   [junit4]   2>   "operation":"leader",
   [junit4]   2>   "shard":"shard1",
   [junit4]   2>   "collection":"control_collection"} current state version: 1
   [junit4]   2> 1470315 INFO  (coreZkRegister-5658-thread-1-processing-n:127.0.0.1:36543_ x:collection1 s:shard1 c:control_collection r:core_node1) [n:127.0.0.1:36543_ c:control_collection s:shard1 r:core_node1 x:collection1] o.a.s.c.SyncStrategy http://127.0.0.1:36543/collection1/ has no replicas
   [junit4]   2> 1470316 INFO  (coreZkRegister-5658-thread-1-processing-n:127.0.0.1:36543_ x:collection1 s:shard1 c:control_collection r:core_node1) [n:127.0.0.1:36543_ c:control_collection s:shard1 r:core_node1 x:collection1] o.a.s.c.c.SolrZkClient makePath: /collections/control_collection/leaders/shard1
   [junit4]   2> 1470316 INFO  (coreZkRegister-5658-thread-1-processing-n:127.0.0.1:36543_ x:collection1 s:shard1 c:control_collection r:core_node1) [n:127.0.0.1:36543_ c:control_collection s:shard1 r:core_node1 x:collection1] o.a.s.c.ShardLeaderElectionContextBase Creating leader registration node /collections/control_collection/leaders/shard1/leader after winning as /collections/control_collection/leader_elect/shard1/election/96219950768979972-core_node1-n_0000000000
   [junit4]   2> 1470317 INFO  (coreZkRegister-5658-thread-1-processing-n:127.0.0.1:36543_ x:collection1 s:shard1 c:control_collection r:core_node1) [n:127.0.0.1:36543_ c:control_collection s:shard1 r:core_node1 x:collection1] o.a.s.c.ShardLeaderElectionContext I am the new leader: http://127.0.0.1:36543/collection1/ shard1
   [junit4]   2> 1470317 INFO  (OverseerStateUpdate-96219950768979972-127.0.0.1:36543_-n_0000000000) [n:127.0.0.1:36543_    ] o.a.s.c.Overseer processMessage: queueSize: 1, message = {
   [junit4]   2>   "operation":"leader",
   [junit4]   2>   "shard":"shard1",
   [junit4]   2>   "collection":"control_collection",
   [junit4]   2>   "base_url":"http://127.0.0.1:36543",
   [junit4]   2>   "core":"collection1",
   [junit4]   2>   "state":"active"} current state version: 1
   [junit4]   2> 1470418 INFO  (zkCallback-2090-thread-1-processing-n:127.0.0.1:36543_) [n:127.0.0.1:36543_    ] o.a.s.c.c.ZkStateReader A cluster state change: [WatchedEvent state:SyncConnected type:NodeDataChanged path:/clusterstate.json], has occurred - updating... (live nodes size: [1])
   [junit4]   2> 1470467 INFO  (coreZkRegister-5658-thread-1-processing-n:127.0.0.1:36543_ x:collection1 s:shard1 c:control_collection r:core_node1) [n:127.0.0.1:36543_ c:control_collection s:shard1 r:core_node1 x:collection1] o.a.s.c.ZkController We are http://127.0.0.1:36543/collection1/ and leader is http://127.0.0.1:36543/collection1/
   [junit4]   2> 1470468 INFO  (coreZkRegister-5658-thread-1-processing-n:127.0.0.1:36543_ x:collection1 s:shard1 c:control_collection r:core_node1) [n:127.0.0.1:36543_ c:control_collection s:shard1 r:core_node1 x:collection1] o.a.s.c.ZkController No LogReplay needed for core=collection1 baseURL=http://127.0.0.1:36543
   [junit4]   2> 1470468 INFO  (coreZkRegister-5658-thread-1-processing-n:127.0.0.1:36543_ x:collection1 s:shard1 c:control_collection r:core_node1) [n:127.0.0.1:36543_ c:control_collection s:shard1 r:core_node1 x:collection1] o.a.s.c.ZkController I am the leader, no recovery necessary
   [junit4]   2> 1470468 INFO  (coreZkRegister-5658-thread-1-processing-n:127.0.0.1:36543_ x:collection1 s:shard1 c:control_collection r:core_node1) [n:127.0.0.1:36543_ c:control_collection s:shard1 r:core_node1 x:collection1] o.a.s.c.ZkController publishing state=active
   [junit4]   2> 1470468 INFO  (coreZkRegister-5658-thread-1-processing-n:127.0.0.1:36543_ x:collection1 s:shard1 c:control_collection r:core_node1) [n:127.0.0.1:36543_ c:control_collection s:shard1 r:core_node1 x:collection1] o.a.s.c.ZkController numShards not found on descriptor - reading it from system property
   [junit4]   2> 1470468 INFO  (coreZkRegister-5658-thread-1-processing-n:127.0.0.1:36543_ x:collection1 s:shard1 c:control_collection r:core_node1) [n:127.0.0.1:36543_ c:control_collection s:shard1 r:core_node1 x:collection1] o.a.s.c.c.ZkStateReader Checking legacy cluster state for collection control_collection
   [junit4]   2> 1470469 INFO  (OverseerStateUpdate-96219950768979972-127.0.0.1:36543_-n_0000000000) [n:127.0.0.1:36543_    ] o.a.s.c.Overseer processMessage: queueSize: 1, message = {
   [junit4]   2>   "core":"collection1",
   [junit4]   2>   "core_node_name":"core_node1",
   [junit4]   2>   "roles":null,
   [junit4]   2>   "base_url":"http://127.0.0.1:36543",
   [junit4]   2>   "node_name":"127.0.0.1:36543_",
   [junit4]   2>   "numShards":"1",
   [junit4]   2>   "state":"active",
   [junit4]   2>   "shard":"shard1",
   [junit4]   2>   "collection":"control_collection",
   [junit4]   2>   "operation":"state"} current state version: 2
   [junit4]   2> 1470469 INFO  (OverseerStateUpdate-96219950768979972-127.0.0.1:36543_-n_0000000000) [n:127.0.0.1:36543_    ] o.a.s.c.o.ReplicaMutator Update state numShards=1 message={
   [junit4]   2>   "core":"collection1",
   [junit4]   2>   "core_node_name":"core_node1",
   [junit4]   2>   "roles":null,
   [junit4]   2>   "base_url":"http://127.0.0.1:36543",
   [junit4]   2>   "node_name":"127.0.0.1:36543_",
   [junit4]   2>   "numShards":"1",
   [junit4]   2>   "state":"active",
   [junit4]   2>   "shard":"shard1",
   [junit4]   2>   "collection":"control_collection",
   [junit4]   2>   "operation":"state"}
   [junit4]   2> 1470570 INFO  (zkCallback-2090-thread-2-processing-n:127.0.0.1:36543_) [n:127.0.0.1:36543_    ] o.a.s.c.c.ZkStateReader A cluster state change: [WatchedEvent state:SyncConnected type:NodeDataChanged path:/clusterstate.json], has occurred - updating... (live nodes size: [1])
   [junit4]   2> 1470704 INFO  (TEST-LeaderFailoverAfterPartitionTest.test-seed#[8769F97AB91D583A]) [    ] o.a.s.c.c.SolrZkClient Using default ZkCredentialsProvider
   [junit4]   2> 1470704 INFO  (TEST-LeaderFailoverAfterPartitionTest.test-seed#[8769F97AB91D583A]) [    ] o.a.s.c.c.ConnectionManager Waiting for client to connect to ZooKeeper
   [junit4]   2> 1470704 INFO  (zkCallback-2094-thread-1) [    ] o.a.s.c.c.ConnectionManager Watcher org.apache.solr.common.cloud.ConnectionManager@57b66b00 name:ZooKeeperConnection Watcher:127.0.0.1:37238/solr got event WatchedEvent state:SyncConnected type:None path:null path:null type:None
   [junit4]   2> 1470704 INFO  (TEST-LeaderFailoverAfterPartitionTest.test-seed#[8769F97AB91D583A]) [    ] o.a.s.c.c.ConnectionManager Client is connected to ZooKeeper
   [junit4]   2> 1470705 INFO  (TEST-LeaderFailoverAfterPartitionTest.test-seed#[8769F97AB91D583A]) [    ] o.a.s.c.c.SolrZkClient Using default ZkACLProvider
   [junit4]   2> 1470705 INFO  (TEST-LeaderFailoverAfterPartitionTest.test-seed#[8769F97AB91D583A]) [    ] o.a.s.c.c.ZkStateReader Updating cluster state from ZooKeeper... 
   [junit4]   2> 1470705 INFO  (TEST-LeaderFailoverAfterPartitionTest.test-seed#[8769F97AB91D583A]) [    ] o.a.s.c.c.ZkStateReader Loaded empty cluster properties
   [junit4]   2> 1470705 INFO  (TEST-LeaderFailoverAfterPartitionTest.test-seed#[8769F97AB91D583A]) [    ] o.a.s.c.c.ZkStateReader Updated live nodes from ZooKeeper... (0) -> (1)
   [junit4]   2> 1470706 INFO  (TEST-LeaderFailoverAfterPartitionTest.test-seed#[8769F97AB91D583A]) [    ] o.a.s.c.ChaosMonkey monkey: init - expire sessions:false cause connection loss:false
   [junit4]   2> 1470706 INFO  (TEST-LeaderFailoverAfterPartitionTest.test-seed#[8769F97AB91D583A]) [    ] o.a.s.c.AbstractFullDistribZkTestBase Creating collection1 with stateFormat=2
   [junit4]   2> 1470706 INFO  (TEST-LeaderFailoverAfterPartitionTest.test-seed#[8769F97AB91D583A]) [    ] o.a.s.c.c.SolrZkClient Using default ZkCredentialsProvider
   [junit4]   2> 1470706 INFO  (TEST-LeaderFailoverAfterPartitionTest.test-seed#[8769F97AB91D583A]) [    ] o.a.s.c.c.ConnectionManager Waiting for client to connect to ZooKeeper
   [junit4]   2> 1470706 INFO  (zkCallback-2095-thread-1) [    ] o.a.s.c.c.ConnectionManager Watcher org.apache.solr.common.cloud.ConnectionManager@43b756d5 name:ZooKeeperConnection Watcher:127.0.0.1:37238/solr got event WatchedEvent state:SyncConnected type:None path:null path:null type:None
   [junit4]   2> 1470706 INFO  (TEST-LeaderFailoverAfterPartitionTest.test-seed#[8769F97AB91D583A]) [    ] o.a.s.c.c.ConnectionManager Client is connected to ZooKeeper
   [junit4]   2> 1470707 INFO  (TEST-LeaderFailoverAfterPartitionTest.test-seed#[8769F97AB91D583A]) [    ] o.a.s.c.c.SolrZkClient Using default ZkACLProvider
   [junit4]   2> 1470707 INFO  (OverseerStateUpdate-96219950768979972-127.0.0.1:36543_-n_0000000000) [n:127.0.0.1:36543_    ] o.a.s.c.Overseer processMessage: queueSize: 1, message = {
   [junit4]   2>   "operation":"create",
   [junit4]   2>   "name":"collection1",
   [junit4]   2>   "numShards":"2",
   [junit4]   2>   "stateFormat":"2"} current state version: 3
   [junit4]   2> 1470707 INFO  (OverseerStateUpdate-96219950768979972-127.0.0.1:36543_-n_0000000000) [n:127.0.0.1:36543_    ] o.a.s.c.o.ClusterStateMutator building a new cName: collection1
   [junit4]   2> 1470765 INFO  (TEST-LeaderFailoverAfterPartitionTest.test-seed#[8769F97AB91D583A]) [    ] o.a.s.SolrTestCaseJ4 Writing core.properties file to /home/jenkins/workspace/Lucene-Solr-master-Linux/solr/build/solr-core/test/J2/temp/solr.cloud.LeaderFailoverAfterPartitionTest_8769F97AB91D583A-001/shard-1-001/cores/collection1
   [junit4]   2> 1470765 INFO  (TEST-LeaderFailoverAfterPartitionTest.test-seed#[8769F97AB91D583A]) [    ] o.a.s.c.AbstractFullDistribZkTestBase create jetty 1 in directory /home/jenkins/workspace/Lucene-Solr-master-Linux/solr/build/solr-core/test/J2/temp/solr.cloud.LeaderFailoverAfterPartitionTest_8769F97AB91D583A-001/shard-1-001
   [junit4]   2> 1470766 INFO  (TEST-LeaderFailoverAfterPartitionTest.test-seed#[8769F97AB91D583A]) [    ] o.e.j.s.Server jetty-9.3.8.v20160314
   [junit4]   2> 1470767 INFO  (TEST-LeaderFailoverAfterPartitionTest.test-seed#[8769F97AB91D583A]) [    ] o.e.j.s.h.ContextHandler Started o.e.j.s.ServletContextHandler@6152fa7e{/,null,AVAILABLE}
   [junit4]   2> 1470767 INFO  (TEST-LeaderFailoverAfterPartitionTest.test-seed#[8769F97AB91D583A]) [    ] o.e.j.s.ServerConnector Started ServerConnector@588a12b5{HTTP/1.1,[http/1.1]}{127.0.0.1:37349}
   [junit4]   2> 1470767 INFO  (TEST-LeaderFailoverAfterPartitionTest.test-seed#[8769F97AB91D583A]) [    ] o.e.j.s.Server Started @1472619ms
   [junit4]   2> 1470767 INFO  (TEST-LeaderFailoverAfterPartitionTest.test-seed#[8769F97AB91D583A]) [    ] o.a.s.c.s.e.JettySolrRunner Jetty properties: {solr.data.dir=/home/jenkins/workspace/Lucene-Solr-master-Linux/solr/build/solr-core/test/J2/temp/solr.cloud.LeaderFailoverAfterPartitionTest_8769F97AB91D583A-001/tempDir-001/jetty1, solrconfig=solrconfig.xml, hostContext=/, hostPort=43097, coreRootDirectory=/home/jenkins/workspace/Lucene-Solr-master-Linux/solr/build/solr-core/test/J2/temp/solr.cloud.LeaderFailoverAfterPartitionTest_8769F97AB91D583A-001/shard-1-001/cores}
   [junit4]   2> 1470767 INFO  (TEST-LeaderFailoverAfterPartitionTest.test-seed#[8769F97AB91D583A]) [    ] o.a.s.s.SolrDispatchFilter SolrDispatchFilter.init(): sun.misc.Launcher$AppClassLoader@73d16e93
   [junit4]   2> 1470768 INFO  (TEST-LeaderFailoverAfterPartitionTest.test-seed#[8769F97AB91D583A]) [    ] o.a.s.c.SolrResourceLoader new SolrResourceLoader for directory: '/home/jenkins/workspace/Lucene-Solr-master-Linux/solr/build/solr-core/test/J2/temp/solr.cloud.LeaderFailoverAfterPartitionTest_8769F97AB91D583A-001/shard-1-001'
   [junit4]   2> 1470768 INFO  (TEST-LeaderFailoverAfterPartitionTest.test-seed#[8769F97AB91D583A]) [    ] o.a.s.c.SolrResourceLoader JNDI not configured for solr (NoInitialContextEx)
   [junit4]   2> 1470768 INFO  (TEST-LeaderFailoverAfterPartitionTest.test-seed#[8769F97AB91D583A]) [    ] o.a.s.c.SolrResourceLoader solr home defaulted to 'solr/' (could not find system property or JNDI)
   [junit4]   2> 1470768 INFO  (TEST-LeaderFailoverAfterPartitionTest.test-seed#[8769F97AB91D583A]) [    ] o.a.s.c.c.SolrZkClient Using default ZkCredentialsProvider
   [junit4]   2> 1470768 INFO  (TEST-LeaderFailoverAfterPartitionTest.test-seed#[8769F97AB91D583A]) [    ] o.a.s.c.c.ConnectionManager Waiting for client to connect to ZooKeeper
   [junit4]   2> 1470769 INFO  (zkCallback-2096-thread-1) [    ] o.a.s.c.c.ConnectionManager Watcher org.apache.solr.common.cloud.ConnectionManager@2be848c1 name:ZooKeeperConnection Watcher:127.0.0.1:37238/solr got event WatchedEvent state:SyncConnected type:None path:null path:null type:None
   [junit4]   2> 1470769 INFO  (TEST-LeaderFailoverAfterPartitionTest.test-seed#[8769F97AB91D583A]) [    ] o.a.s.c.c.ConnectionManager Client is connected to ZooKeeper
   [junit4]   2> 1470769 INFO  (TEST-LeaderFailoverAfterPartitionTest.test-seed#[8769F97AB91D583A]) [    ] o.a.s.c.c.SolrZkClient Using default ZkACLProvider
   [junit4]   2> 1470769 INFO  (TEST-LeaderFailoverAfterPartitionTest.test-seed#[8769F97AB91D583A]) [    ] o.a.s.s.SolrDispatchFilter Loading solr.xml from SolrHome (not found in ZooKeeper)
   [junit4]   2> 1470769 INFO  (TEST-LeaderFailoverAfterPartitionTest.test-seed#[8769F97AB91D583A]) [    ] o.a.s.c.SolrXmlConfig Loading container configuration from /home/jenkins/workspace/Lucene-Solr-master-Linux/solr/build/solr-core/test/J2/temp/solr.cloud.LeaderFailoverAfterPartitionTest_8769F97AB91D583A-001/shard-1-001/solr.xml
   [junit4]   2> 1470773 INFO  (TEST-LeaderFailoverAfterPartitionTest.test-seed#[8769F97AB91D583A]) [    ] o.a.s.c.CorePropertiesLocator Config-defined core root directory: /home/jenkins/workspace/Lucene-Solr-master-Linux/solr/build/solr-core/test/J2/temp/solr.cloud.LeaderFailoverAfterPartitionTest_8769F97AB91D583A-001/shard-1-001/cores
   [junit4]   2> 1470773 INFO  (TEST-LeaderFailoverAfterPartitionTest.test-seed#[8769F97AB91D583A]) [    ] o.a.s.c.CoreContainer New CoreContainer 2131954508
   [junit4]   2> 1470773 INFO  (TEST-LeaderFailoverAfterPartitionTest.test-seed#[8769F97AB91D583A]) [    ] o.a.s.c.CoreContainer Loading cores into CoreContainer [instanceDir=/home/jenkins/workspace/Lucene-Solr-master-Linux/solr/build/solr-core/test/J2/temp/solr.cloud.LeaderFailoverAfterPartitionTest_8769F97AB91D583A-001/shard-1-001]
   [junit4]   2> 1470773 WARN  (TEST-LeaderFailoverAfterPartitionTest.test-seed#[8769F97AB91D583A]) [    ] o.a.s.c.CoreContainer Couldn't add files from /home/jenkins/workspace/Lucene-Solr-master-Linux/solr/build/solr-core/test/J2/temp/solr.cloud.LeaderFailoverAfterPartitionTest_8769F97AB91D583A-001/shard-1-001/lib to classpath: /home/jenkins/workspace/Lucene-Solr-master-Linux/solr/build/solr-core/test/J2/temp/solr.cloud.LeaderFailoverAfterPartitionTest_8769F97AB91D583A-001/shard-1-001/lib
   [junit4]   2> 1470773 INFO  (TEST-LeaderFailoverAfterPartitionTest.test-seed#[8769F97AB91D583A]) [    ] o.a.s.h.c.HttpShardHandlerFactory created with socketTimeout : 90000,urlScheme : ,connTimeout : 15000,maxConnectionsPerHost : 20,maxConnections : 10000,corePoolSize : 0,maximumPoolSize : 2147483647,maxThreadIdleTime : 5,sizeOfQueue : -1,fairnessPolicy : false,
   [junit4]   2> 1470775 INFO  (TEST-LeaderFailoverAfterPartitionTest.test-seed#[8769F97AB91D583A]) [    ] o.a.s.u.UpdateShardHandler Created UpdateShardHandler HTTP client with params: socketTimeout=340000&connTimeout=45000&maxConnections=100000&maxConnectionsPerHost=100000
   [junit4]   2> 1470775 INFO  (TEST-LeaderFailoverAfterPartitionTest.test-seed#[8769F97AB91D583A]) [    ] o.a.s.l.LogWatcher SLF4J impl is org.slf4j.impl.Log4jLoggerFactory
   [junit4]   2> 1470775 INFO  (TEST-LeaderFailoverAfterPartitionTest.test-seed#[8769F97AB91D583A]) [    ] o.a.s.l.LogWatcher Registering Log Listener [Log4j (org.slf4j.impl.Log4jLoggerFactory)]
   [junit4]   2> 1470775 INFO  (TEST-LeaderFailoverAfterPartitionTest.test-seed#[8769F97AB91D583A]) [    ] o.a.s.c.ZkContainer Zookeeper client=127.0.0.1:37238/solr
   [junit4]   2> 1470775 INFO  (TEST-LeaderFailoverAfterPartitionTest.test-seed#[8769F97AB91D583A]) [    ] o.a.s.c.ZkController zkHost includes chroot
   [junit4]   2> 1470775 INFO  (TEST-LeaderFailoverAfterPartitionTest.test-seed#[8769F97AB91D583A]) [    ] o.a.s.c.c.SolrZkClient Using default ZkCredentialsProvider
   [junit4]   2> 1470776 INFO  (TEST-LeaderFailoverAfterPartitionTest.test-seed#[8769F97AB91D583A]) [    ] o.a.s.c.c.ConnectionManager Waiting for client to connect to ZooKeeper
   [junit4]   2> 1470776 INFO  (zkCallback-2099-thread-1) [    ] o.a.s.c.c.ConnectionManager Watcher org.apache.solr.common.cloud.ConnectionManager@31ddd1c8 name:ZooKeeperConnection Watcher:127.0.0.1:37238 got event WatchedEvent state:SyncConnected type:None path:null path:null type:None
   [junit4]   2> 1470776 INFO  (TEST-LeaderFailoverAfterPartitionTest.test-seed#[8769F97AB91D583A]) [    ] o.a.s.c.c.ConnectionManager Client is connected to ZooKeeper
   [junit4]   2> 1470777 INFO  (TEST-LeaderFailoverAfterPartitionTest.test-seed#[8769F97AB91D583A]) [    ] o.a.s.c.c.SolrZkClient Using default ZkACLProvider
   [junit4]   2> 1470777 INFO  (TEST-LeaderFailoverAfterPartitionTest.test-seed#[8769F97AB91D583A]) [n:127.0.0.1:43097_    ] o.a.s.c.ZkController Added new OnReconnect listener org.apache.solr.cloud.ZkController$$Lambda$13/1229278796@5365ed9a
   [junit4]   2> 1470777 INFO  (TEST-LeaderFailoverAfterPartitionTest.test-seed#[8769F97AB91D583A]) [n:127.0.0.1:43097_    ] o.a.s.c.c.ConnectionManager Waiting for client to connect to ZooKeeper
   [junit4]   2> 1470778 INFO  (zkCallback-2100-thread-1-processing-n:127.0.0.1:43097_) [n:127.0.0.1:43097_    ] o.a.s.c.c.ConnectionManager Watcher org.apache.solr.common.cloud.ConnectionManager@34de6ba name:ZooKeeperConnection Watcher:127.0.0.1:37238/solr got event WatchedEvent state:SyncConnected type:None path:null path:null type:None
   [junit4]   2> 1470778 INFO  (TEST-LeaderFailoverAfterPartitionTest.test-seed#[8769F97AB91D583A]) [n:127.0.0.1:43097_    ] o.a.s.c.c.ConnectionManager Client is connected to ZooKeeper
   [junit4]   2> 1470779 INFO  (TEST-LeaderFailoverAfterPartitionTest.test-seed#[8769F97AB91D583A]) [n:127.0.0.1:43097_    ] o.a.s.c.c.ZkStateReader Updating cluster state from ZooKeeper... 
   [junit4]   2> 1470779 INFO  (TEST-LeaderFailoverAfterPartitionTest.test-seed#[8769F97AB91D583A]) [n:127.0.0.1:43097_    ] o.a.s.c.c.ZkStateReader Loaded empty cluster properties
   [junit4]   2> 1470780 INFO  (TEST-LeaderFailoverAfterPartitionTest.test-seed#[8769F97AB91D583A]) [n:127.0.0.1:43097_    ] o.a.s.c.c.ZkStateReader Updated live nodes from ZooKeeper... (0) -> (1)
   [junit4]   2> 1470780 INFO  (TEST-LeaderFailoverAfterPartitionTest.test-seed#[8769F97AB91D583A]) [n:127.0.0.1:43097_    ] o.a.s.c.Overseer Overseer (id=null) closing
   [junit4]   2> 1470780 INFO  (TEST-LeaderFailoverAfterPartitionTest.test-seed#[8769F97AB91D583A]) [n:127.0.0.1:43097_    ] o.a.s.c.LeaderElector Joined leadership election with path: /overseer_elect/election/96219950768979977-127.0.0.1:43097_-n_0000000001
   [junit4]   2> 1470781 INFO  (TEST-LeaderFailoverAfterPartitionTest.test-seed#[8769F97AB91D583A]) [n:127.0.0.1:43097_    ] o.a.s.c.LeaderElector Watching path /overseer_elect/election/96219950768979972-127.0.0.1:36543_-n_0000000000 to know if I could be the leader
   [junit4]   2> 1470781 INFO  (TEST-LeaderFailoverAfterPartitionTest.test-seed#[8769F97AB91D583A]) [n:127.0.0.1:43097_    ] o.a.s.c.ZkController Publish node=127.0.0.1:43097_ as DOWN
   [junit4]   2> 1470781 INFO  (TEST-LeaderFailoverAfterPartitionTest.test-seed#[8769F97AB91D583A]) [n:127.0.0.1:43097_    ] o.a.s.c.ZkController Register node as live in ZooKeeper:/live_nodes/127.0.0.1:43097_
   [junit4]   2> 1470781 INFO  (TEST-LeaderFailoverAfterPartitionTest.test-seed#[8769F97AB91D583A]) [n:127.0.0.1:43097_    ] o.a.s.c.c.SolrZkClient makePath: /live_nodes/127.0.0.1:43097_
   [junit4]   2> 1470782 INFO  (OverseerStateUpdate-96219950768979972-127.0.0.1:36543_-n_0000000000) [n:127.0.0.1:36543_    ] o.a.s.c.Overseer processMessage: queueSize: 1, message = {
   [junit4]   2>   "operation":"downnode",
   [junit4]   2>   "node_name":"127.0.0.1:43097_"} current state version: 3
   [junit4]   2> 1470782 INFO  (zkCallback-2094-thread-1) [    ] o.a.s.c.c.ZkStateReader A live node change: [WatchedEvent state:SyncConnected type:NodeChildrenChanged path:/live_nodes], has occurred - updating... (live nodes size: [1])
   [junit4]   2> 1470782 INFO  (zkCallback-2090-thread-2-processing-n:127.0.0.1:36543_) [n:127.0.0.1:36543_    ] o.a.s.c.c.ZkStateReader A live node change: [WatchedEvent state:SyncConnected type:NodeChildrenChanged path:/live_nodes], has occurred - updating... (live nodes size: [1])
   [junit4]   2> 1470782 INFO  (OverseerStateUpdate-96219950768979972-127.0.0.1:36543_-n_0000000000) [n:127.0.0.1:36543_    ] o.a.s.c.o.NodeMutator DownNode state invoked for node: 127.0.0.1:43097_
   [junit4]   2> 1470782 INFO  (zkCallback-2094-thread-1) [    ] o.a.s.c.c.ZkStateReader Updated live nodes from ZooKeeper... (1) -> (2)
   [junit4]   2> 1470782 INFO  (zkCallback-2100-thread-1-processing-n:127.0.0.1:43097_) [n:127.0.0.1:43097_    ] o.a.s.c.c.ZkStateReader A live node change: [WatchedEvent state:SyncConnected type:NodeChildrenChanged path:/live_nodes], has occurred - updating... (live nodes size: [1])
   [junit4]   2> 1470782 INFO  (zkCallback-2090-thread-2-processing-n:127.0.0.1:36543_) [n:127.0.0.1:36543_    ] o.a.s.c.c.ZkStateReader Updated live nodes from ZooKeeper... (1) -> (2)
   [junit4]   2> 1470782 INFO  (OverseerStateUpdate-96219950768979972-127.0.0.1:36543_-n_0000000000) [n:127.0.0.1:36543_    ] o.a.s.c.o.ZkStateWriter going to create_collection /collections/collection1/state.json
   [junit4]   2> 1470782 INFO  (zkCallback-2100-thread-1-processing-n:127.0.0.1:43097_) [n:127.0.0.1:43097_    ] o.a.s.c.c.ZkStateReader Updated live nodes from ZooKeeper... (1) -> (2)
   [junit4]   2> 1470783 INFO  (zkCallback-2090-thread-2-processing-n:127.0.0.1:36543_) [n:127.0.0.1:36543_    ] o.a.s.c.c.ZkStateReader A cluster state change: [WatchedEvent state:SyncConnected type:NodeDataChanged path:/clusterstate.json], has occurred - updating... (live nodes size: [2])
   [junit4]   2> 1470783 INFO  (zkCallback-2100-thread-1-processing-n:127.0.0.1:43097_) [n:127.0.0.1:43097_    ] o.a.s.c.c.ZkStateReader A cluster state change: [WatchedEvent state:SyncConnected type:NodeDataChanged path:/clusterstate.json], has occurred - updating... (live nodes size: [2])
   [junit4]   2> 1470783 INFO  (zkCallback-2094-thread-1) [    ] o.a.s.c.c.ZkStateReader A cluster state change: [WatchedEvent state:SyncConnected type:NodeDataChanged path:/clusterstate.json], has occurred - updating... (live nodes size: [2])
   [junit4]   2> 1470793 INFO  (TEST-LeaderFailoverAfterPartitionTest.test-seed#[8769F97AB91D583A]) [n:127.0.0.1:43097_    ] o.a.s.c.CoreContainer Security conf doesn't exist. Skipping setup for authorization module.
   [junit4]   2> 1470793 INFO  (TEST-LeaderFailoverAfterPartitionTest.test-seed#[8769F97AB91D583A]) [n:127.0.0.1:43097_    ] o.a.s.c.CoreContainer No authentication plugin used.
   [junit4]   2> 1470794 INFO  (TEST-LeaderFailoverAfterPartitionTest.test-seed#[8769F97AB91D583A]) [n:127.0.0.1:43097_    ] o.a.s.c.CorePropertiesLocator Looking for core definitions underneath /home/jenkins/workspace/Lucene-Solr-master-Linux/solr/build/solr-core/test/J2/temp/solr.cloud.LeaderFailoverAfterPartitionTest_8769F97AB91D583A-001/shard-1-001/cores
   [junit4]   2> 1470794 INFO  (TEST-LeaderFailoverAfterPartitionTest.test-seed#[8769F97AB91D583A]) [n:127.0.0.1:43097_    ] o.a.s.c.CoreDescriptor Created CoreDescriptor: {name=collection1, config=solrconfig.xml, transient=false, schema=schema.xml, loadOnStartup=true, configSetProperties=configsetprops.json, collection=collection1, coreNodeName=, dataDir=data/, shard=}
   [junit4]   2> 1470794 INFO  (TEST-LeaderFailoverAfterPartitionTest.test-seed#[8769F97AB91D583A]) [n:127.0.0.1:43097_    ] o.a.s.c.CorePropertiesLocator Found core collection1 in /home/jenkins/workspace/Lucene-Solr-master-Linux/solr/build/solr-core/test/J2/temp/solr.cloud.LeaderFailoverAfterPartitionTest_8769F97AB91D583A-001/shard-1-001/cores/collection1
   [junit4]   2> 1470794 INFO  (TEST-LeaderFailoverAfterPartitionTest.test-seed#[8769F97AB91D583A]) [n:127.0.0.1:43097_    ] o.a.s.c.CorePropertiesLocator Found 1 core definitions
   [junit4]   2> 1470795 INFO  (TEST-LeaderFailoverAfterPartitionTest.test-seed#[8769F97AB91D583A]) [n:127.0.0.1:43097_    ] o.a.s.s.SolrDispatchFilter user.dir=/home/jenkins/workspace/Lucene-Solr-master-Linux/solr/build/solr-core/test/J2
   [junit4]   2> 1470795 INFO  (TEST-LeaderFailoverAfterPartitionTest.test-seed#[8769F97AB91D583A]) [n:127.0.0.1:43097_    ] o.a.s.s.SolrDispatchFilter SolrDispatchFilter.init() done
   [junit4]   2> 1470795 INFO  (coreLoadExecutor-5675-thread-1-processing-n:127.0.0.1:43097_) [n:127.0.0.1:43097_ c:collection1   x:collection1] o.a.s.c.ZkController publishing state=down
   [junit4]   2> 1470795 INFO  (coreLoadExecutor-5675-thread-1-processing-n:127.0.0.1:43097_) [n:127.0.0.1:43097_ c:collection1   x:collection1] o.a.s.c.ZkController numShards not found on descriptor - reading it from system property
   [junit4]   2> 1470795 INFO  (coreLoadExecutor-5675-thread-1-processing-n:127.0.0.1:43097_) [n:127.0.0.1:43097_ c:collection1   x:collection1] o.a.s.c.ZkController Registering watch for collection collection1
   [junit4]   2> 1470795 INFO  (coreLoadExecutor-5675-thread-1-processing-n:127.0.0.1:43097_) [n:127.0.0.1:43097_ c:collection1   x:collection1] o.a.s.c.c.ZkStateReader Add data for [collection1] ver [0]
   [junit4]   2> 1470796 INFO  (OverseerStateUpdate-96219950768979972-127.0.0.1:36543_-n_0000000000) [n:127.0.0.1:36543_    ] o.a.s.c.Overseer processMessage: queueSize: 1, message = {
   [junit4]   2>   "core":"collection1",
   [junit4]   2>   "roles":null,
   [junit4]   2>   "base_url":"http://127.0.0.1:43097",
   [junit4]   2>   "node_name":"127.0.0.1:43097_",
   [junit4]   2>   "numShards":"2",
   [junit4]   2>   "state":"down",
   [junit4]   2>   "shard":null,
   [junit4]   2>   "collection":"collection1",
   [junit4]   2>   "operation":"state"} current state version: 4
   [junit4]   2> 1470796 INFO  (OverseerStateUpdate-96219950768979972-127.0.0.1:36543_-n_0000000000) [n:127.0.0.1:36543_    ] o.a.s.c.o.ReplicaMutator Update state numShards=2 message={
   [junit4]   2>   "core":"collection1",
   [junit4]   2>   "roles":null,
   [junit4]   2>   "base_url":"http://127.0.0.1:43097",
   [junit4]   2>   "node_name":"127.0.0.1:43097_",
   [junit4]   2>   "numShards":"2",
   [junit4]   2>   "state":"down",
   [junit4]   2>   "shard":null,
   [junit4]   2>   "collection":"collection1",
   [junit4]   2>   "operation":"state"}
   [junit4]   2> 1470796 INFO  (coreLoadExecutor-5675-thread-1-processing-n:127.0.0.1:43097_) [n:127.0.0.1:43097_ c:collection1   x:collection1] o.a.s.c.ZkController look for our core node name
   [junit4]   2> 1470796 INFO  (OverseerStateUpdate-96219950768979972-127.0.0.1:36543_-n_0000000000) [n:127.0.0.1:36543_    ] o.a.s.c.o.ReplicaMutator Collection already exists with numShards=2
   [junit4]   2> 1470796 INFO  (OverseerStateUpdate-96219950768979972-127.0.0.1:36543_-n_0000000000) [n:127.0.0.1:36543_    ] o.a.s.c.o.ReplicaMutator Assigning new node to shard shard=shard2
   [junit4]   2> 1470897 INFO  (OverseerStateUpdate-96219950768979972-127.0.0.1:36543_-n_0000000000) [n:127.0.0.1:36543_    ] o.a.s.c.o.ZkStateWriter going to update_collection /collections/collection1/state.json version: 2147483647
   [junit4]   2> 1470897 WARN  (OverseerStateUpdate-96219950768979972-127.0.0.1:36543_-n_0000000000) [n:127.0.0.1:36543_    ] o.a.s.c.Overseer Bad version writing to ZK using compare-and-set, will force refresh cluster state
   [junit4]   2> org.apache.zookeeper.KeeperException$BadVersionException: KeeperErrorCode = BadVersion for /collections/collection1/state.json
   [junit4]   2> 	at org.apache.zookeeper.KeeperException.create(KeeperException.java:115)
   [junit4]   2> 	at org.apache.zookeeper.KeeperException.create(KeeperException.java:51)
   [junit4]   2> 	at org.apache.zooke

[...truncated too long message...]

.solr.cloud.AbstractFullDistribZkTestBase.sendDocsWithRetry(AbstractFullDistribZkTestBase.java:741)
   [junit4]    > 	at org.apache.solr.cloud.LeaderFailoverAfterPartitionTest.testRf3WithLeaderFailover(LeaderFailoverAfterPartitionTest.java:178)
   [junit4]    > 	at org.apache.solr.cloud.LeaderFailoverAfterPartitionTest.test(LeaderFailoverAfterPartitionTest.java:57)
   [junit4]    > 	at org.apache.solr.BaseDistributedSearchTestCase$ShardsRepeatRule$ShardsFixedStatement.callStatement(BaseDistributedSearchTestCase.java:985)
   [junit4]    > 	at org.apache.solr.BaseDistributedSearchTestCase$ShardsRepeatRule$ShardsStatement.evaluate(BaseDistributedSearchTestCase.java:960)
   [junit4]    > 	at java.lang.Thread.run(Thread.java:745)
   [junit4]    > Caused by: org.apache.solr.client.solrj.SolrServerException: No live SolrServers available to handle this request:[http://127.0.0.1:41265/c8n_1x3_lf_shard1_replica2]
   [junit4]    > 	at org.apache.solr.client.solrj.impl.LBHttpSolrClient.request(LBHttpSolrClient.java:393)
   [junit4]    > 	at org.apache.solr.client.solrj.impl.CloudSolrClient.directUpdate(CloudSolrClient.java:747)
   [junit4]    > 	... 48 more
   [junit4]    > Caused by: org.apache.solr.client.solrj.SolrServerException: Server refused connection at: http://127.0.0.1:41265/c8n_1x3_lf_shard1_replica2
   [junit4]    > 	at org.apache.solr.client.solrj.impl.HttpSolrClient.executeMethod(HttpSolrClient.java:613)
   [junit4]    > 	at org.apache.solr.client.solrj.impl.HttpSolrClient.request(HttpSolrClient.java:259)
   [junit4]    > 	at org.apache.solr.client.solrj.impl.HttpSolrClient.request(HttpSolrClient.java:248)
   [junit4]    > 	at org.apache.solr.client.solrj.impl.LBHttpSolrClient.doRequest(LBHttpSolrClient.java:413)
   [junit4]    > 	at org.apache.solr.client.solrj.impl.LBHttpSolrClient.request(LBHttpSolrClient.java:382)
   [junit4]    > 	... 49 more
   [junit4]    > Caused by: org.apache.http.conn.HttpHostConnectException: Connect to 127.0.0.1:41265 [/127.0.0.1] failed: Connection refused
   [junit4]    > 	at org.apache.http.impl.conn.DefaultHttpClientConnectionOperator.connect(DefaultHttpClientConnectionOperator.java:151)
   [junit4]    > 	at org.apache.http.impl.conn.PoolingHttpClientConnectionManager.connect(PoolingHttpClientConnectionManager.java:353)
   [junit4]    > 	at org.apache.http.impl.execchain.MainClientExec.establishRoute(MainClientExec.java:380)
   [junit4]    > 	at org.apache.http.impl.execchain.MainClientExec.execute(MainClientExec.java:236)
   [junit4]    > 	at org.apache.http.impl.execchain.ProtocolExec.execute(ProtocolExec.java:184)
   [junit4]    > 	at org.apache.http.impl.execchain.RetryExec.execute(RetryExec.java:88)
   [junit4]    > 	at org.apache.http.impl.execchain.RedirectExec.execute(RedirectExec.java:110)
   [junit4]    > 	at org.apache.http.impl.client.InternalHttpClient.doExecute(InternalHttpClient.java:184)
   [junit4]    > 	at org.apache.http.impl.client.CloseableHttpClient.execute(CloseableHttpClient.java:82)
   [junit4]    > 	at org.apache.http.impl.client.CloseableHttpClient.execute(CloseableHttpClient.java:55)
   [junit4]    > 	at org.apache.solr.client.solrj.impl.HttpSolrClient.executeMethod(HttpSolrClient.java:511)
   [junit4]    > 	... 53 more
   [junit4]    > Caused by: java.net.ConnectException: Connection refused
   [junit4]    > 	at java.net.PlainSocketImpl.socketConnect(Native Method)
   [junit4]    > 	at java.net.AbstractPlainSocketImpl.doConnect(AbstractPlainSocketImpl.java:350)
   [junit4]    > 	at java.net.AbstractPlainSocketImpl.connectToAddress(AbstractPlainSocketImpl.java:206)
   [junit4]    > 	at java.net.AbstractPlainSocketImpl.connect(AbstractPlainSocketImpl.java:188)
   [junit4]    > 	at java.net.SocksSocketImpl.connect(SocksSocketImpl.java:392)
   [junit4]    > 	at java.net.Socket.connect(Socket.java:589)
   [junit4]    > 	at org.apache.http.conn.socket.PlainConnectionSocketFactory.connectSocket(PlainConnectionSocketFactory.java:74)
   [junit4]    > 	at org.apache.http.impl.conn.DefaultHttpClientConnectionOperator.connect(DefaultHttpClientConnectionOperator.java:134)
   [junit4]    > 	... 63 more
   [junit4]   2> 1534020 INFO  (SUITE-LeaderFailoverAfterPartitionTest-seed#[8769F97AB91D583A]-worker) [    ] o.a.s.SolrTestCaseJ4 ###deleteCore
   [junit4]   2> NOTE: leaving temporary files on disk at: /home/jenkins/workspace/Lucene-Solr-master-Linux/solr/build/solr-core/test/J2/temp/solr.cloud.LeaderFailoverAfterPartitionTest_8769F97AB91D583A-001
   [junit4]   2> Jul 11, 2016 1:19:57 AM com.carrotsearch.randomizedtesting.ThreadLeakControl checkThreadLeaks
   [junit4]   2> WARNING: Will linger awaiting termination of 3 leaked thread(s).
   [junit4]   2> NOTE: test params are: codec=Asserting(Lucene62): {range_facet_l_dv=PostingsFormat(name=Memory doPackFST= false), _version_=BlockTreeOrds(blocksize=128), multiDefault=PostingsFormat(name=Direct), a_t=BlockTreeOrds(blocksize=128), intDefault=BlockTreeOrds(blocksize=128), id=PostingsFormat(name=Memory doPackFST= false), range_facet_i_dv=BlockTreeOrds(blocksize=128), text=PostingsFormat(name=Asserting), range_facet_l=BlockTreeOrds(blocksize=128), timestamp=BlockTreeOrds(blocksize=128)}, docValues:{range_facet_l_dv=DocValuesFormat(name=Asserting), range_facet_i_dv=DocValuesFormat(name=Direct), timestamp=DocValuesFormat(name=Direct)}, maxPointsInLeafNode=378, maxMBSortInHeap=7.980870574285662, sim=RandomSimilarity(queryNorm=false): {}, locale=ja, timezone=CST6CDT
   [junit4]   2> NOTE: Linux 4.4.0-28-generic amd64/Oracle Corporation 1.8.0_92 (64-bit)/cpus=12,threads=1,free=272044584,total=518979584
   [junit4]   2> NOTE: All tests run in this JVM: [HdfsThreadLeakTest, HdfsRecoveryZkTest, SolrCloudExampleTest, TestSolrIndexConfig, SuggesterTest, HdfsLockFactoryTest, TestHdfsCloudBackupRestore, AutoCommitTest, TestLegacyFieldCache, TestAuthorizationFramework, RuleEngineTest, QueryParsingTest, RecoveryZkTest, TestDistribDocBasedVersion, CleanupOldIndexTest, TestPostingsSolrHighlighter, TestRecovery, ScriptEngineTest, DirectSolrConnectionTest, TestSolrConfigHandler, TestSha256AuthenticationProvider, SegmentsInfoRequestHandlerTest, TestDistribIDF, TestIndexingPerformance, ConnectionManagerTest, TestJsonRequest, TestTolerantUpdateProcessorCloud, RegexBoostProcessorTest, TestUtils, OverseerRolesTest, RankQueryTest, TestLocalFSCloudBackupRestore, TestDistributedStatsComponentCardinality, DeleteShardTest, TestConfigSetsAPIExclusivity, TestTestInjection, TestPerFieldSimilarity, TestSolrQueryParser, SaslZkACLProviderTest, AnalyticsQueryTest, TestSubQueryTransformerDistrib, TestDistributedMissingSort, SuggesterWFSTTest, BlockJoinFacetDistribTest, SearchHandlerTest, TestFieldCacheReopen, TestLRUStatsCache, TestCopyFieldCollectionResource, TestXmlQParser, TestZkChroot, TestTrackingShardHandlerFactory, TestCustomSort, SampleTest, HdfsWriteToMultipleCollectionsTest, HighlighterConfigTest, SpatialRPTFieldTypeTest, TestDynamicFieldResource, TestCSVResponseWriter, TestOrdValues, TestJettySolrRunner, TestRestoreCore, NoCacheHeaderTest, TestNRTOpen, UnloadDistributedZkTest, TestXIncludeConfig, TestImplicitCoreProperties, TestExceedMaxTermLength, TestMaxScoreQueryParser, BasicDistributedZk2Test, CircularListTest, SimpleFacetsTest, OverriddenZkACLAndCredentialsProvidersTest, OverseerTest, FieldAnalysisRequestHandlerTest, TestSolrDeletionPolicy1, FullSolrCloudDistribCmdsTest, BinaryUpdateRequestHandlerTest, TestSolrCloudWithKerberosAlt, TestSort, TestRestManager, TermVectorComponentDistributedTest, LukeRequestHandlerTest, TestObjectReleaseTracker, TestMiniSolrCloudClusterBase, TestReload, TestBackupRepositoryFactory, StatelessScriptUpdateProcessorFactoryTest, TestStressRecovery, TestExtendedDismaxParser, TestSerializedLuceneMatchVersion, TestIndexSearcher, BadIndexSchemaTest, TestSolrConfigHandlerConcurrent, AssignTest, TestGraphTermsQParserPlugin, DebugComponentTest, TestManagedSchema, BasicDistributedZkTest, CollectionsAPIDistributedZkTest, OpenCloseCoreStressTest, ShardRoutingTest, TestRandomFaceting, DistributedSpellCheckComponentTest, ZkControllerTest, TestRealTimeGet, TestStressReorder, HardAutoCommitTest, StatsComponentTest, TestGroupingSearch, TestFiltering, TestElisionMultitermQuery, TestFuzzyAnalyzedSuggestions, TestCharFilters, TestSweetSpotSimilarityFactory, TestBM25SimilarityFactory, TestFastWriter, TimeZoneUtilsTest, OpenExchangeRatesOrgProviderTest, TestFastLRUCache, ChaosMonkeyNothingIsSafeTest, CollectionStateFormat2Test, CollectionsAPIAsyncDistributedZkTest, ConcurrentDeleteAndCreateCollectionTest, ConfigSetsAPITest, CreateCollectionCleanupTest, DeleteReplicaTest, LeaderFailoverAfterPartitionTest]
   [junit4] Completed [462/620 (1!)] on J2 in 65.79s, 1 test, 1 error <<< FAILURES!

[...truncated 571 lines...]
BUILD FAILED
/home/jenkins/workspace/Lucene-Solr-master-Linux/build.xml:740: The following error occurred while executing this line:
/home/jenkins/workspace/Lucene-Solr-master-Linux/build.xml:684: The following error occurred while executing this line:
/home/jenkins/workspace/Lucene-Solr-master-Linux/build.xml:59: The following error occurred while executing this line:
/home/jenkins/workspace/Lucene-Solr-master-Linux/solr/build.xml:233: The following error occurred while executing this line:
/home/jenkins/workspace/Lucene-Solr-master-Linux/solr/common-build.xml:530: The following error occurred while executing this line:
/home/jenkins/workspace/Lucene-Solr-master-Linux/lucene/common-build.xml:1443: The following error occurred while executing this line:
/home/jenkins/workspace/Lucene-Solr-master-Linux/lucene/common-build.xml:984: There were test failures: 620 suites (10 ignored), 2635 tests, 1 error, 134 ignored (88 assumptions) [seed: 8769F97AB91D583A]

Total time: 73 minutes 0 seconds
Build step 'Invoke Ant' marked build as failure
Archiving artifacts
[WARNINGS] Skipping publisher since build result is FAILURE
Recording test results
Email was triggered for: Failure - Any
Sending email for trigger: Failure - Any