You are viewing a plain text version of this content. The canonical link for it is here.
Posted to commits@phoenix.apache.org by Apache Jenkins Server <je...@builds.apache.org> on 2014/08/21 05:25:03 UTC

Build failed in Jenkins: Phoenix | 4.0 | Hadoop2 #54

See <https://builds.apache.org/job/Phoenix-4.0-hadoop2/54/changes>

Changes:

[jyates] PHOENIX-1187 Enable tracing on server

------------------------------------------
[...truncated 488 lines...]
Running org.apache.phoenix.end2end.IsNullIT
Tests run: 48, Failures: 0, Errors: 0, Skipped: 0, Time elapsed: 37.481 sec - in org.apache.phoenix.end2end.ArrayIT
Running org.apache.phoenix.end2end.ToCharFunctionIT
Tests run: 2, Failures: 0, Errors: 0, Skipped: 0, Time elapsed: 6.406 sec - in org.apache.phoenix.end2end.IsNullIT
Running org.apache.phoenix.end2end.FunkyNamesIT
Tests run: 33, Failures: 0, Errors: 0, Skipped: 0, Time elapsed: 41.082 sec - in org.apache.phoenix.end2end.RowValueConstructorIT
Tests run: 10, Failures: 0, Errors: 0, Skipped: 0, Time elapsed: 6.103 sec - in org.apache.phoenix.end2end.ToCharFunctionIT
Running org.apache.phoenix.end2end.salted.SaltedTableIT
Tests run: 3, Failures: 0, Errors: 0, Skipped: 0, Time elapsed: 3.152 sec - in org.apache.phoenix.end2end.FunkyNamesIT
Running org.apache.phoenix.end2end.salted.SaltedTableVarLengthRowKeyIT
Running org.apache.phoenix.end2end.NativeHBaseTypesIT
Tests run: 7, Failures: 0, Errors: 0, Skipped: 0, Time elapsed: 3.682 sec - in org.apache.phoenix.end2end.NativeHBaseTypesIT
Tests run: 1, Failures: 0, Errors: 0, Skipped: 0, Time elapsed: 5.953 sec - in org.apache.phoenix.end2end.salted.SaltedTableVarLengthRowKeyIT
Running org.apache.phoenix.end2end.CompareDecimalToLongIT
Tests run: 8, Failures: 0, Errors: 0, Skipped: 0, Time elapsed: 8.391 sec - in org.apache.phoenix.end2end.salted.SaltedTableIT
Running org.apache.phoenix.end2end.TruncateFunctionIT
Running org.apache.phoenix.end2end.StatsManagerIT
Tests run: 1, Failures: 0, Errors: 0, Skipped: 0, Time elapsed: 4.107 sec - in org.apache.phoenix.end2end.TruncateFunctionIT
Tests run: 8, Failures: 0, Errors: 0, Skipped: 0, Time elapsed: 5.445 sec - in org.apache.phoenix.end2end.CompareDecimalToLongIT
Running org.apache.phoenix.end2end.QueryDatabaseMetaDataIT
Running org.apache.phoenix.end2end.SkipRangeParallelIteratorRegionSplitterIT
Tests run: 8, Failures: 0, Errors: 0, Skipped: 0, Time elapsed: 9.045 sec - in org.apache.phoenix.end2end.SkipRangeParallelIteratorRegionSplitterIT
Running org.apache.phoenix.end2end.PercentileIT
Tests run: 1, Failures: 0, Errors: 0, Skipped: 0, Time elapsed: 18.831 sec - in org.apache.phoenix.end2end.StatsManagerIT
Running org.apache.phoenix.end2end.ToNumberFunctionIT
Tests run: 18, Failures: 0, Errors: 0, Skipped: 0, Time elapsed: 12.832 sec - in org.apache.phoenix.end2end.ToNumberFunctionIT
Tests run: 17, Failures: 0, Errors: 0, Skipped: 0, Time elapsed: 18.847 sec - in org.apache.phoenix.end2end.PercentileIT
Running org.apache.phoenix.end2end.OrderByIT
Running org.apache.phoenix.end2end.GroupByCaseIT
Tests run: 3, Failures: 0, Errors: 0, Skipped: 0, Time elapsed: 4.262 sec - in org.apache.phoenix.end2end.GroupByCaseIT
Tests run: 3, Failures: 0, Errors: 0, Skipped: 1, Time elapsed: 5.087 sec - in org.apache.phoenix.end2end.OrderByIT
Tests run: 15, Failures: 0, Errors: 0, Skipped: 0, Time elapsed: 60.521 sec - in org.apache.phoenix.end2end.QueryDatabaseMetaDataIT
Tests run: 119, Failures: 0, Errors: 0, Skipped: 0, Time elapsed: 175.264 sec - in org.apache.phoenix.end2end.ScanQueryIT
Tests run: 91, Failures: 0, Errors: 0, Skipped: 0, Time elapsed: 152.94 sec - in org.apache.phoenix.end2end.GroupByIT
Tests run: 203, Failures: 0, Errors: 0, Skipped: 0, Time elapsed: 267.22 sec - in org.apache.phoenix.end2end.ClientTimeArithmeticQueryIT
Tests run: 182, Failures: 0, Errors: 0, Skipped: 0, Time elapsed: 299.947 sec - in org.apache.phoenix.end2end.QueryIT

Results :

Tests run: 1268, Failures: 0, Errors: 0, Skipped: 3

[INFO] 
[INFO] --- maven-failsafe-plugin:2.17:integration-test (HBaseManagedTimeTests) @ phoenix-core ---
[INFO] Failsafe report directory: <https://builds.apache.org/job/Phoenix-4.0-hadoop2/ws/phoenix-core/target/failsafe-reports>
[INFO] parallel='none', perCoreThreadCount=true, threadCount=0, useUnlimitedThreads=false, threadCountSuites=0, threadCountClasses=0, threadCountMethods=0, parallelOptimized=true

-------------------------------------------------------
 T E S T S
-------------------------------------------------------

-------------------------------------------------------
 T E S T S
-------------------------------------------------------
Running org.apache.phoenix.end2end.EncodeFunctionIT
Running org.apache.phoenix.trace.PhoenixTableMetricsWriterIT
Running org.apache.phoenix.end2end.AutoCommitIT
Running org.apache.phoenix.trace.PhoenixTraceReaderIT
Running org.apache.phoenix.end2end.ModulusExpressionIT
Running org.apache.phoenix.end2end.DeleteIT
Tests run: 6, Failures: 0, Errors: 0, Skipped: 0, Time elapsed: 12.158 sec - in org.apache.phoenix.end2end.EncodeFunctionIT
Tests run: 1, Failures: 0, Errors: 0, Skipped: 0, Time elapsed: 3.66 sec - in org.apache.phoenix.end2end.AutoCommitIT
Running org.apache.phoenix.end2end.QueryExecWithoutSCNIT
Running org.apache.phoenix.end2end.LastValueFunctionIT
Tests run: 2, Failures: 0, Errors: 0, Skipped: 0, Time elapsed: 5.555 sec - in org.apache.phoenix.trace.PhoenixTraceReaderIT
Tests run: 2, Failures: 0, Errors: 0, Skipped: 0, Time elapsed: 7.598 sec - in org.apache.phoenix.trace.PhoenixTableMetricsWriterIT
Running org.apache.phoenix.end2end.QueryMoreIT
Running org.apache.phoenix.end2end.PhoenixEncodeDecodeIT
Tests run: 1, Failures: 0, Errors: 0, Skipped: 0, Time elapsed: 6.451 sec - in org.apache.phoenix.end2end.QueryExecWithoutSCNIT
Tests run: 11, Failures: 0, Errors: 0, Skipped: 0, Time elapsed: 10.927 sec - in org.apache.phoenix.end2end.ModulusExpressionIT
Running org.apache.phoenix.end2end.StatementHintsIT
Running org.apache.phoenix.end2end.ReverseFunctionIT
Tests run: 11, Failures: 0, Errors: 0, Skipped: 0, Time elapsed: 8.793 sec - in org.apache.phoenix.end2end.LastValueFunctionIT
Running org.apache.phoenix.end2end.ViewIT
Tests run: 2, Failures: 0, Errors: 0, Skipped: 0, Time elapsed: 4.403 sec - in org.apache.phoenix.end2end.StatementHintsIT
Running org.apache.phoenix.end2end.ArithmeticQueryIT
Tests run: 1, Failures: 0, Errors: 1, Skipped: 0, Time elapsed: -158,674.253 sec <<< FAILURE! - in org.apache.phoenix.trace.PhoenixTracingEndToEndIT
org.apache.phoenix.trace.PhoenixTracingEndToEndIT  Time elapsed: -158,674.254 sec  <<< ERROR!
java.lang.RuntimeException: Could not create  interface org.apache.phoenix.trace.TestableMetricsWriter Is the hadoop compatibility jar on the classpath?
	at java.util.ServiceLoader.fail(ServiceLoader.java:231)
	at java.util.ServiceLoader.access$300(ServiceLoader.java:181)
	at java.util.ServiceLoader$LazyIterator.next(ServiceLoader.java:365)
	at java.util.ServiceLoader$1.next(ServiceLoader.java:445)
	at org.apache.hadoop.hbase.CompatibilityFactory.getInstance(CompatibilityFactory.java:46)
	at org.apache.phoenix.metrics.TracingTestCompat.newTraceMetricSink(TracingTestCompat.java:33)
	at org.apache.phoenix.metrics.TracingTestCompat.registerSink(TracingTestCompat.java:41)
	at org.apache.phoenix.trace.PhoenixTracingEndToEndIT.setupMetrics(PhoenixTracingEndToEndIT.java:77)

Tests run: 5, Failures: 0, Errors: 0, Skipped: 0, Time elapsed: 5.142 sec - in org.apache.phoenix.end2end.ReverseFunctionIT
Running org.apache.phoenix.end2end.index.LocalIndexIT
Running org.apache.phoenix.end2end.index.ViewIndexIT
Tests run: 5, Failures: 0, Errors: 0, Skipped: 0, Time elapsed: 16.609 sec - in org.apache.phoenix.end2end.PhoenixEncodeDecodeIT
Running org.apache.phoenix.end2end.index.IndexMetadataIT
Tests run: 1, Failures: 0, Errors: 0, Skipped: 0, Time elapsed: 11.2 sec - in org.apache.phoenix.end2end.index.ViewIndexIT
Running org.apache.phoenix.end2end.index.DropViewIT
Tests run: 8, Failures: 0, Errors: 0, Skipped: 0, Time elapsed: 19.296 sec - in org.apache.phoenix.end2end.ViewIT
Running org.apache.phoenix.end2end.index.SaltedIndexIT
Tests run: 1, Failures: 0, Errors: 0, Skipped: 0, Time elapsed: 6.989 sec - in org.apache.phoenix.end2end.index.DropViewIT
Tests run: 19, Failures: 0, Errors: 0, Skipped: 0, Time elapsed: 38.642 sec - in org.apache.phoenix.end2end.DeleteIT
Running org.apache.phoenix.end2end.index.MutableIndexIT
Running org.apache.phoenix.end2end.index.ImmutableIndexIT
Tests run: 20, Failures: 0, Errors: 0, Skipped: 0, Time elapsed: 24.77 sec - in org.apache.phoenix.end2end.ArithmeticQueryIT
Running org.apache.phoenix.end2end.RoundFloorCeilFunctionsEnd2EndIT
Tests run: 30, Failures: 0, Errors: 0, Skipped: 0, Time elapsed: 9.649 sec - in org.apache.phoenix.end2end.RoundFloorCeilFunctionsEnd2EndIT
Running org.apache.phoenix.end2end.UpsertBigValuesIT
Tests run: 4, Failures: 0, Errors: 0, Skipped: 0, Time elapsed: 27.984 sec - in org.apache.phoenix.end2end.index.IndexMetadataIT
Running org.apache.phoenix.end2end.TenantSpecificViewIndexSaltedIT
Tests run: 7, Failures: 0, Errors: 0, Skipped: 0, Time elapsed: 16.139 sec - in org.apache.phoenix.end2end.index.ImmutableIndexIT
Running org.apache.phoenix.end2end.DynamicFamilyIT
Tests run: 4, Failures: 0, Errors: 0, Skipped: 0, Time elapsed: 11.306 sec - in org.apache.phoenix.end2end.UpsertBigValuesIT
Tests run: 3, Failures: 0, Errors: 0, Skipped: 0, Time elapsed: 29.073 sec - in org.apache.phoenix.end2end.index.SaltedIndexIT
Running org.apache.phoenix.end2end.CSVCommonsLoaderIT
Running org.apache.phoenix.end2end.ReadOnlyIT
Tests run: 4, Failures: 0, Errors: 0, Skipped: 0, Time elapsed: 7.896 sec - in org.apache.phoenix.end2end.DynamicFamilyIT
Running org.apache.phoenix.end2end.SortOrderFIT
Tests run: 1, Failures: 0, Errors: 0, Skipped: 0, Time elapsed: 3.347 sec - in org.apache.phoenix.end2end.ReadOnlyIT
Running org.apache.phoenix.end2end.FirstValueFunctionIT
Tests run: 4, Failures: 0, Errors: 0, Skipped: 0, Time elapsed: 65.781 sec - in org.apache.phoenix.end2end.QueryMoreIT
Tests run: 4, Failures: 0, Errors: 0, Skipped: 0, Time elapsed: 18.33 sec - in org.apache.phoenix.end2end.TenantSpecificViewIndexSaltedIT
Running org.apache.phoenix.end2end.TimezoneOffsetFunctionIT
Running org.apache.phoenix.end2end.InListIT
Tests run: 7, Failures: 0, Errors: 0, Skipped: 0, Time elapsed: 5.069 sec - in org.apache.phoenix.end2end.FirstValueFunctionIT
Running org.apache.phoenix.end2end.NthValueFunctionIT
Tests run: 13, Failures: 0, Errors: 0, Skipped: 0, Time elapsed: 13.478 sec - in org.apache.phoenix.end2end.CSVCommonsLoaderIT
Running org.apache.phoenix.end2end.SaltedViewIT
Tests run: 6, Failures: 0, Errors: 0, Skipped: 0, Time elapsed: 6.4 sec - in org.apache.phoenix.end2end.TimezoneOffsetFunctionIT
Running org.apache.phoenix.end2end.UpsertSelectAutoCommitIT
Tests run: 30, Failures: 0, Errors: 0, Skipped: 0, Time elapsed: 17.024 sec - in org.apache.phoenix.end2end.SortOrderFIT
Tests run: 5, Failures: 0, Errors: 0, Skipped: 0, Time elapsed: 7.225 sec - in org.apache.phoenix.end2end.NthValueFunctionIT
Running org.apache.phoenix.end2end.SpillableGroupByIT
Running org.apache.phoenix.end2end.BinaryRowKeyIT
Tests run: 3, Failures: 0, Errors: 0, Skipped: 0, Time elapsed: 4.35 sec - in org.apache.phoenix.end2end.BinaryRowKeyIT
Running org.apache.phoenix.end2end.salted.SaltedTableUpsertSelectIT
Tests run: 2, Failures: 0, Errors: 0, Skipped: 0, Time elapsed: 12.095 sec - in org.apache.phoenix.end2end.SaltedViewIT
Running org.apache.phoenix.end2end.AlterTableIT
Tests run: 2, Failures: 0, Errors: 0, Skipped: 0, Time elapsed: 13.62 sec - in org.apache.phoenix.end2end.UpsertSelectAutoCommitIT
Tests run: 1, Failures: 0, Errors: 0, Skipped: 0, Time elapsed: 11.301 sec - in org.apache.phoenix.end2end.SpillableGroupByIT
Running org.apache.phoenix.end2end.MD5FunctionIT
Running org.apache.phoenix.end2end.HashJoinIT
Tests run: 5, Failures: 0, Errors: 0, Skipped: 0, Time elapsed: 9.205 sec - in org.apache.phoenix.end2end.salted.SaltedTableUpsertSelectIT
Running org.apache.phoenix.end2end.TenantSpecificViewIndexIT
Tests run: 2, Failures: 0, Errors: 0, Skipped: 0, Time elapsed: 5.666 sec - in org.apache.phoenix.end2end.MD5FunctionIT
Running org.apache.phoenix.end2end.DecodeFunctionIT
Tests run: 6, Failures: 0, Errors: 0, Skipped: 0, Time elapsed: 4.104 sec - in org.apache.phoenix.end2end.DecodeFunctionIT
Running org.apache.phoenix.end2end.ServerExceptionIT
Tests run: 1, Failures: 0, Errors: 0, Skipped: 0, Time elapsed: 3.777 sec - in org.apache.phoenix.end2end.ServerExceptionIT
Running org.apache.phoenix.end2end.ExecuteStatementsIT
Tests run: 6, Failures: 0, Errors: 0, Skipped: 0, Time elapsed: 20.509 sec - in org.apache.phoenix.end2end.TenantSpecificViewIndexIT
Running org.apache.phoenix.end2end.SkipScanAfterManualSplitIT
Tests run: 2, Failures: 0, Errors: 0, Skipped: 0, Time elapsed: 16.373 sec - in org.apache.phoenix.end2end.ExecuteStatementsIT
Running org.apache.phoenix.end2end.ConvertTimezoneFunctionIT
Tests run: 6, Failures: 0, Errors: 0, Skipped: 0, Time elapsed: 3.533 sec - in org.apache.phoenix.end2end.ConvertTimezoneFunctionIT
Running org.apache.phoenix.end2end.SkipScanQueryIT
Tests run: 15, Failures: 0, Errors: 0, Skipped: 0, Time elapsed: 47.59 sec - in org.apache.phoenix.end2end.AlterTableIT
Running org.apache.phoenix.end2end.QueryPlanIT
Tests run: 8, Failures: 0, Errors: 0, Skipped: 0, Time elapsed: 17.336 sec - in org.apache.phoenix.end2end.SkipScanQueryIT
Tests run: 1, Failures: 0, Errors: 0, Skipped: 0, Time elapsed: 11.752 sec - in org.apache.phoenix.end2end.QueryPlanIT
Running org.apache.phoenix.end2end.LpadFunctionIT
Tests run: 10, Failures: 0, Errors: 0, Skipped: 0, Time elapsed: 11.277 sec - in org.apache.phoenix.end2end.LpadFunctionIT
Tests run: 2, Failures: 0, Errors: 0, Skipped: 0, Time elapsed: 45.067 sec - in org.apache.phoenix.end2end.SkipScanAfterManualSplitIT
Tests run: 16, Failures: 0, Errors: 0, Skipped: 0, Time elapsed: 156.688 sec - in org.apache.phoenix.end2end.index.LocalIndexIT
Tests run: 25, Failures: 0, Errors: 0, Skipped: 0, Time elapsed: 115.241 sec - in org.apache.phoenix.end2end.InListIT
Tests run: 26, Failures: 0, Errors: 0, Skipped: 0, Time elapsed: 171.99 sec - in org.apache.phoenix.end2end.index.MutableIndexIT
Tests run: 93, Failures: 0, Errors: 0, Skipped: 0, Time elapsed: 169.066 sec - in org.apache.phoenix.end2end.HashJoinIT

Results :

Tests in error: 
  PhoenixTracingEndToEndIT.setupMetrics:77 ? Runtime Could not create  interface...

Tests run: 450, Failures: 0, Errors: 1, Skipped: 0

[INFO] 
[INFO] --- maven-failsafe-plugin:2.17:integration-test (NeedTheirOwnClusterTests) @ phoenix-core ---
[INFO] Failsafe report directory: <https://builds.apache.org/job/Phoenix-4.0-hadoop2/ws/phoenix-core/target/failsafe-reports>
[INFO] parallel='none', perCoreThreadCount=true, threadCount=0, useUnlimitedThreads=false, threadCountSuites=0, threadCountClasses=0, threadCountMethods=0, parallelOptimized=true

-------------------------------------------------------
 T E S T S
-------------------------------------------------------

-------------------------------------------------------
 T E S T S
-------------------------------------------------------
Running org.apache.phoenix.hbase.index.FailForUnsupportedHBaseVersionsIT
Running org.apache.phoenix.end2end.index.MutableIndexFailureIT
Running org.apache.phoenix.hbase.index.covered.EndToEndCoveredColumnsIndexBuilderIT
Tests run: 2, Failures: 0, Errors: 0, Skipped: 0, Time elapsed: 41.186 sec - in org.apache.phoenix.hbase.index.FailForUnsupportedHBaseVersionsIT
Running org.apache.phoenix.hbase.index.covered.example.EndToEndCoveredIndexingIT
Running org.apache.phoenix.hbase.index.covered.example.FailWithoutRetriesIT
Running org.apache.phoenix.hbase.index.covered.example.EndtoEndIndexingWithCompressionIT
Running org.apache.phoenix.hbase.index.balancer.IndexLoadBalancerIT
Tests run: 1, Failures: 0, Errors: 0, Skipped: 0, Time elapsed: 5.46 sec - in org.apache.phoenix.hbase.index.covered.example.FailWithoutRetriesIT
Tests run: 2, Failures: 0, Errors: 0, Skipped: 0, Time elapsed: 16.672 sec - in org.apache.phoenix.hbase.index.covered.EndToEndCoveredColumnsIndexBuilderIT
Running org.apache.phoenix.end2end.ContextClassloaderIT
Tests run: 3, Failures: 0, Errors: 0, Skipped: 0, Time elapsed: 11.476 sec - in org.apache.phoenix.end2end.ContextClassloaderIT
Running org.apache.phoenix.mapreduce.CsvBulkLoadToolIT
Tests run: 11, Failures: 0, Errors: 0, Skipped: 0, Time elapsed: 75.225 sec - in org.apache.phoenix.hbase.index.covered.example.EndToEndCoveredIndexingIT
Tests run: 11, Failures: 0, Errors: 0, Skipped: 0, Time elapsed: 75.512 sec - in org.apache.phoenix.hbase.index.covered.example.EndtoEndIndexingWithCompressionIT
Tests run: 2, Failures: 0, Errors: 0, Skipped: 0, Time elapsed: 172.406 sec - in org.apache.phoenix.end2end.index.MutableIndexFailureIT
Tests run: 9, Failures: 0, Errors: 0, Skipped: 0, Time elapsed: 217.387 sec - in org.apache.phoenix.hbase.index.balancer.IndexLoadBalancerIT
Tests run: 4, Failures: 0, Errors: 0, Skipped: 0, Time elapsed: 268.34 sec - in org.apache.phoenix.mapreduce.CsvBulkLoadToolIT

Results :

Tests run: 45, Failures: 0, Errors: 0, Skipped: 0

[INFO] 
[INFO] --- maven-failsafe-plugin:2.17:verify (ClientManagedTimeTests) @ phoenix-core ---
[INFO] Failsafe report directory: <https://builds.apache.org/job/Phoenix-4.0-hadoop2/ws/phoenix-core/target/failsafe-reports>
[INFO] ------------------------------------------------------------------------
[INFO] Reactor Summary:
[INFO] 
[INFO] Apache Phoenix .................................... SUCCESS [8.970s]
[INFO] Phoenix Hadoop Compatibility ...................... SUCCESS [6.141s]
[INFO] Phoenix Hadoop2 Compatibility ..................... SUCCESS [12.573s]
[INFO] Phoenix Core ...................................... FAILURE [22:45.071s]
[INFO] Phoenix - Flume ................................... SKIPPED
[INFO] Phoenix - Pig ..................................... SKIPPED
[INFO] Phoenix Assembly .................................. SKIPPED
[INFO] ------------------------------------------------------------------------
[INFO] BUILD FAILURE
[INFO] ------------------------------------------------------------------------
[INFO] Total time: 23:14.775s
[INFO] Finished at: Thu Aug 21 03:20:29 UTC 2014
[INFO] Final Memory: 36M/443M
[INFO] ------------------------------------------------------------------------
[ERROR] Failed to execute goal org.apache.maven.plugins:maven-failsafe-plugin:2.17:verify (ClientManagedTimeTests) on project phoenix-core: There are test failures.
[ERROR] 
[ERROR] Please refer to <https://builds.apache.org/job/Phoenix-4.0-hadoop2/ws/phoenix-core/target/failsafe-reports> for the individual test results.
[ERROR] -> [Help 1]
[ERROR] 
[ERROR] To see the full stack trace of the errors, re-run Maven with the -e switch.
[ERROR] Re-run Maven using the -X switch to enable full debug logging.
[ERROR] 
[ERROR] For more information about the errors and possible solutions, please read the following articles:
[ERROR] [Help 1] http://cwiki.apache.org/confluence/display/MAVEN/MojoFailureException
[ERROR] 
[ERROR] After correcting the problems, you can resume the build with the command
[ERROR]   mvn <goals> -rf :phoenix-core
Build step 'Invoke top-level Maven targets' marked build as failure
Archiving artifacts
Sending artifact delta relative to Phoenix | 4.0 | Hadoop2 #53
Archived 685 artifacts
Archive block size is 32768
Received 5144 blocks and 222483215 bytes
Compression is 43.1%
Took 2 min 38 sec
Recording test results
Updating PHOENIX-1187

Jenkins build is back to normal : Phoenix | 4.0 | Hadoop2 #56

Posted by Apache Jenkins Server <je...@builds.apache.org>.
See <https://builds.apache.org/job/Phoenix-4.0-hadoop2/56/changes>


Build failed in Jenkins: Phoenix | 4.0 | Hadoop2 #55

Posted by Apache Jenkins Server <je...@builds.apache.org>.
See <https://builds.apache.org/job/Phoenix-4.0-hadoop2/55/changes>

Changes:

[jtaylor] PHOENIX-1192 Re-enable reverse scan to prevent order by

[jtaylor] PHOENIX-1188 Performance regression for non-aggregate queries

------------------------------------------
[...truncated 491 lines...]
Tests run: 10, Failures: 0, Errors: 0, Skipped: 0, Time elapsed: 4.245 sec - in org.apache.phoenix.end2end.ToCharFunctionIT
Tests run: 2, Failures: 0, Errors: 0, Skipped: 0, Time elapsed: 7.128 sec - in org.apache.phoenix.end2end.IsNullIT
Running org.apache.phoenix.end2end.FunkyNamesIT
Tests run: 48, Failures: 0, Errors: 0, Skipped: 0, Time elapsed: 45.384 sec - in org.apache.phoenix.end2end.ArrayIT
Running org.apache.phoenix.end2end.salted.SaltedTableIT
Tests run: 3, Failures: 0, Errors: 0, Skipped: 0, Time elapsed: 3.011 sec - in org.apache.phoenix.end2end.FunkyNamesIT
Running org.apache.phoenix.end2end.salted.SaltedTableVarLengthRowKeyIT
Running org.apache.phoenix.end2end.NativeHBaseTypesIT
Tests run: 1, Failures: 0, Errors: 0, Skipped: 0, Time elapsed: 4.015 sec - in org.apache.phoenix.end2end.salted.SaltedTableVarLengthRowKeyIT
Running org.apache.phoenix.end2end.CompareDecimalToLongIT
Tests run: 7, Failures: 0, Errors: 0, Skipped: 0, Time elapsed: 3.503 sec - in org.apache.phoenix.end2end.NativeHBaseTypesIT
Running org.apache.phoenix.end2end.TruncateFunctionIT
Tests run: 8, Failures: 0, Errors: 0, Skipped: 0, Time elapsed: 8.824 sec - in org.apache.phoenix.end2end.salted.SaltedTableIT
Tests run: 1, Failures: 0, Errors: 0, Skipped: 0, Time elapsed: 2.643 sec - in org.apache.phoenix.end2end.TruncateFunctionIT
Running org.apache.phoenix.end2end.StatsManagerIT
Running org.apache.phoenix.end2end.QueryDatabaseMetaDataIT
Tests run: 8, Failures: 0, Errors: 0, Skipped: 0, Time elapsed: 6.641 sec - in org.apache.phoenix.end2end.CompareDecimalToLongIT
Running org.apache.phoenix.end2end.SkipRangeParallelIteratorRegionSplitterIT
Tests run: 8, Failures: 0, Errors: 0, Skipped: 0, Time elapsed: 7.844 sec - in org.apache.phoenix.end2end.SkipRangeParallelIteratorRegionSplitterIT
Running org.apache.phoenix.end2end.PercentileIT
Tests run: 1, Failures: 0, Errors: 0, Skipped: 0, Time elapsed: 16.941 sec - in org.apache.phoenix.end2end.StatsManagerIT
Running org.apache.phoenix.end2end.ToNumberFunctionIT
Tests run: 18, Failures: 0, Errors: 0, Skipped: 0, Time elapsed: 6.435 sec - in org.apache.phoenix.end2end.ToNumberFunctionIT
Running org.apache.phoenix.end2end.OrderByIT
Tests run: 17, Failures: 0, Errors: 0, Skipped: 0, Time elapsed: 15.752 sec - in org.apache.phoenix.end2end.PercentileIT
Running org.apache.phoenix.end2end.GroupByCaseIT
Tests run: 2, Failures: 0, Errors: 0, Skipped: 0, Time elapsed: 5.313 sec - in org.apache.phoenix.end2end.OrderByIT
Tests run: 3, Failures: 0, Errors: 0, Skipped: 0, Time elapsed: 3.964 sec - in org.apache.phoenix.end2end.GroupByCaseIT
Tests run: 119, Failures: 0, Errors: 0, Skipped: 0, Time elapsed: 147.955 sec - in org.apache.phoenix.end2end.ScanQueryIT
Tests run: 15, Failures: 0, Errors: 0, Skipped: 0, Time elapsed: 50.537 sec - in org.apache.phoenix.end2end.QueryDatabaseMetaDataIT
Tests run: 91, Failures: 0, Errors: 0, Skipped: 0, Time elapsed: 145.388 sec - in org.apache.phoenix.end2end.GroupByIT
Tests run: 203, Failures: 0, Errors: 0, Skipped: 0, Time elapsed: 251.488 sec - in org.apache.phoenix.end2end.ClientTimeArithmeticQueryIT
Tests run: 182, Failures: 0, Errors: 0, Skipped: 0, Time elapsed: 303.18 sec - in org.apache.phoenix.end2end.QueryIT

Results :

Tests run: 1265, Failures: 0, Errors: 0, Skipped: 0

[INFO] 
[INFO] --- maven-failsafe-plugin:2.17:integration-test (HBaseManagedTimeTests) @ phoenix-core ---
[INFO] Failsafe report directory: <https://builds.apache.org/job/Phoenix-4.0-hadoop2/ws/phoenix-core/target/failsafe-reports>
[INFO] parallel='none', perCoreThreadCount=true, threadCount=0, useUnlimitedThreads=false, threadCountSuites=0, threadCountClasses=0, threadCountMethods=0, parallelOptimized=true

-------------------------------------------------------
 T E S T S
-------------------------------------------------------

-------------------------------------------------------
 T E S T S
-------------------------------------------------------
Running org.apache.phoenix.end2end.AutoCommitIT
Running org.apache.phoenix.end2end.EncodeFunctionIT
Running org.apache.phoenix.trace.PhoenixTraceReaderIT
Running org.apache.phoenix.end2end.DeleteIT
Running org.apache.phoenix.trace.PhoenixTableMetricsWriterIT
Tests run: 1, Failures: 0, Errors: 1, Skipped: 0, Time elapsed: -131,930.645 sec <<< FAILURE! - in org.apache.phoenix.trace.PhoenixTracingEndToEndIT
org.apache.phoenix.trace.PhoenixTracingEndToEndIT  Time elapsed: -131,930.646 sec  <<< ERROR!
java.lang.RuntimeException: Could not create  interface org.apache.phoenix.trace.TestableMetricsWriter Is the hadoop compatibility jar on the classpath?
	at java.util.ServiceLoader.fail(ServiceLoader.java:231)
	at java.util.ServiceLoader.access$300(ServiceLoader.java:181)
	at java.util.ServiceLoader$LazyIterator.next(ServiceLoader.java:365)
	at java.util.ServiceLoader$1.next(ServiceLoader.java:445)
	at org.apache.hadoop.hbase.CompatibilityFactory.getInstance(CompatibilityFactory.java:46)
	at org.apache.phoenix.metrics.TracingTestCompat.newTraceMetricSink(TracingTestCompat.java:33)
	at org.apache.phoenix.metrics.TracingTestCompat.registerSink(TracingTestCompat.java:41)
	at org.apache.phoenix.trace.PhoenixTracingEndToEndIT.setupMetrics(PhoenixTracingEndToEndIT.java:77)

Running org.apache.phoenix.end2end.ModulusExpressionIT
Running org.apache.phoenix.end2end.QueryExecWithoutSCNIT
Tests run: 1, Failures: 0, Errors: 0, Skipped: 0, Time elapsed: 6.207 sec - in org.apache.phoenix.end2end.AutoCommitIT
Tests run: 2, Failures: 0, Errors: 0, Skipped: 0, Time elapsed: 6.891 sec - in org.apache.phoenix.trace.PhoenixTraceReaderIT
Running org.apache.phoenix.end2end.LastValueFunctionIT
Running org.apache.phoenix.end2end.QueryMoreIT
Tests run: 2, Failures: 0, Errors: 0, Skipped: 0, Time elapsed: 11.256 sec - in org.apache.phoenix.trace.PhoenixTableMetricsWriterIT
Running org.apache.phoenix.end2end.PhoenixEncodeDecodeIT
Tests run: 6, Failures: 0, Errors: 0, Skipped: 0, Time elapsed: 14.074 sec - in org.apache.phoenix.end2end.EncodeFunctionIT
Tests run: 1, Failures: 0, Errors: 0, Skipped: 0, Time elapsed: 8.54 sec - in org.apache.phoenix.end2end.QueryExecWithoutSCNIT
Running org.apache.phoenix.end2end.StatementHintsIT
Running org.apache.phoenix.end2end.ReverseFunctionIT
Tests run: 2, Failures: 0, Errors: 0, Skipped: 0, Time elapsed: 4.333 sec - in org.apache.phoenix.end2end.StatementHintsIT
Tests run: 5, Failures: 0, Errors: 0, Skipped: 0, Time elapsed: 4.375 sec - in org.apache.phoenix.end2end.ReverseFunctionIT
Running org.apache.phoenix.end2end.ViewIT
Tests run: 11, Failures: 0, Errors: 0, Skipped: 0, Time elapsed: 16 sec - in org.apache.phoenix.end2end.ModulusExpressionIT
Tests run: 11, Failures: 0, Errors: 0, Skipped: 0, Time elapsed: 13.074 sec - in org.apache.phoenix.end2end.LastValueFunctionIT
Running org.apache.phoenix.end2end.ArithmeticQueryIT
Running org.apache.phoenix.end2end.index.LocalIndexIT
Running org.apache.phoenix.end2end.index.ViewIndexIT
Tests run: 5, Failures: 0, Errors: 0, Skipped: 0, Time elapsed: 12.749 sec - in org.apache.phoenix.end2end.PhoenixEncodeDecodeIT
Running org.apache.phoenix.end2end.index.IndexMetadataIT
Tests run: 1, Failures: 0, Errors: 0, Skipped: 0, Time elapsed: 7.825 sec - in org.apache.phoenix.end2end.index.ViewIndexIT
Running org.apache.phoenix.end2end.index.DropViewIT
Tests run: 1, Failures: 0, Errors: 0, Skipped: 0, Time elapsed: 6.515 sec - in org.apache.phoenix.end2end.index.DropViewIT
Running org.apache.phoenix.end2end.index.SaltedIndexIT
Tests run: 8, Failures: 0, Errors: 0, Skipped: 0, Time elapsed: 18.94 sec - in org.apache.phoenix.end2end.ViewIT
Running org.apache.phoenix.end2end.index.MutableIndexIT
Tests run: 19, Failures: 0, Errors: 0, Skipped: 0, Time elapsed: 40.977 sec - in org.apache.phoenix.end2end.DeleteIT
Running org.apache.phoenix.end2end.index.ImmutableIndexIT
Tests run: 20, Failures: 0, Errors: 0, Skipped: 0, Time elapsed: 25.976 sec - in org.apache.phoenix.end2end.ArithmeticQueryIT
Running org.apache.phoenix.end2end.RoundFloorCeilFunctionsEnd2EndIT
Tests run: 4, Failures: 0, Errors: 0, Skipped: 0, Time elapsed: 28.539 sec - in org.apache.phoenix.end2end.index.IndexMetadataIT
Tests run: 30, Failures: 0, Errors: 0, Skipped: 0, Time elapsed: 8.899 sec - in org.apache.phoenix.end2end.RoundFloorCeilFunctionsEnd2EndIT
Running org.apache.phoenix.end2end.UpsertBigValuesIT
Running org.apache.phoenix.end2end.TenantSpecificViewIndexSaltedIT
Tests run: 3, Failures: 0, Errors: 0, Skipped: 0, Time elapsed: 21.438 sec - in org.apache.phoenix.end2end.index.SaltedIndexIT
Tests run: 7, Failures: 0, Errors: 0, Skipped: 0, Time elapsed: 17.033 sec - in org.apache.phoenix.end2end.index.ImmutableIndexIT
Running org.apache.phoenix.end2end.CSVCommonsLoaderIT
Running org.apache.phoenix.end2end.DynamicFamilyIT
Tests run: 4, Failures: 0, Errors: 0, Skipped: 0, Time elapsed: 55.232 sec - in org.apache.phoenix.end2end.QueryMoreIT
Running org.apache.phoenix.end2end.ReadOnlyIT
Tests run: 1, Failures: 0, Errors: 0, Skipped: 0, Time elapsed: 3.552 sec - in org.apache.phoenix.end2end.ReadOnlyIT
Tests run: 4, Failures: 0, Errors: 0, Skipped: 0, Time elapsed: 11.873 sec - in org.apache.phoenix.end2end.UpsertBigValuesIT
Tests run: 4, Failures: 0, Errors: 0, Skipped: 0, Time elapsed: 7.527 sec - in org.apache.phoenix.end2end.DynamicFamilyIT
Running org.apache.phoenix.end2end.SortOrderFIT
Running org.apache.phoenix.end2end.FirstValueFunctionIT
Running org.apache.phoenix.end2end.TimezoneOffsetFunctionIT
Tests run: 4, Failures: 0, Errors: 0, Skipped: 0, Time elapsed: 15.595 sec - in org.apache.phoenix.end2end.TenantSpecificViewIndexSaltedIT
Running org.apache.phoenix.end2end.InListIT
Tests run: 13, Failures: 0, Errors: 0, Skipped: 0, Time elapsed: 13.803 sec - in org.apache.phoenix.end2end.CSVCommonsLoaderIT
Tests run: 6, Failures: 0, Errors: 0, Skipped: 0, Time elapsed: 5.539 sec - in org.apache.phoenix.end2end.TimezoneOffsetFunctionIT
Running org.apache.phoenix.end2end.NthValueFunctionIT
Tests run: 7, Failures: 0, Errors: 0, Skipped: 0, Time elapsed: 6.858 sec - in org.apache.phoenix.end2end.FirstValueFunctionIT
Running org.apache.phoenix.end2end.SaltedViewIT
Tests run: 30, Failures: 0, Errors: 0, Skipped: 0, Time elapsed: 10.932 sec - in org.apache.phoenix.end2end.SortOrderFIT
Running org.apache.phoenix.end2end.UpsertSelectAutoCommitIT
Tests run: 5, Failures: 0, Errors: 0, Skipped: 0, Time elapsed: 6.972 sec - in org.apache.phoenix.end2end.NthValueFunctionIT
Running org.apache.phoenix.end2end.BinaryRowKeyIT
Tests run: 3, Failures: 0, Errors: 0, Skipped: 0, Time elapsed: 4.565 sec - in org.apache.phoenix.end2end.BinaryRowKeyIT
Running org.apache.phoenix.end2end.SpillableGroupByIT
Tests run: 2, Failures: 0, Errors: 0, Skipped: 0, Time elapsed: 15.52 sec - in org.apache.phoenix.end2end.SaltedViewIT
Running org.apache.phoenix.end2end.salted.SaltedTableUpsertSelectIT
Tests run: 2, Failures: 0, Errors: 0, Skipped: 0, Time elapsed: 14.14 sec - in org.apache.phoenix.end2end.UpsertSelectAutoCommitIT
Tests run: 1, Failures: 0, Errors: 0, Skipped: 0, Time elapsed: 6.606 sec - in org.apache.phoenix.end2end.SpillableGroupByIT
Running org.apache.phoenix.end2end.AlterTableIT
Running org.apache.phoenix.end2end.HashJoinIT
Running org.apache.phoenix.end2end.ReverseScanIT
Tests run: 2, Failures: 0, Errors: 0, Skipped: 0, Time elapsed: 6.112 sec - in org.apache.phoenix.end2end.ReverseScanIT
Running org.apache.phoenix.end2end.MD5FunctionIT
Tests run: 5, Failures: 0, Errors: 0, Skipped: 0, Time elapsed: 12.064 sec - in org.apache.phoenix.end2end.salted.SaltedTableUpsertSelectIT
Running org.apache.phoenix.end2end.TenantSpecificViewIndexIT
Tests run: 2, Failures: 0, Errors: 0, Skipped: 0, Time elapsed: 5.404 sec - in org.apache.phoenix.end2end.MD5FunctionIT
Running org.apache.phoenix.end2end.DecodeFunctionIT
Tests run: 6, Failures: 0, Errors: 0, Skipped: 0, Time elapsed: 4.353 sec - in org.apache.phoenix.end2end.DecodeFunctionIT
Running org.apache.phoenix.end2end.ServerExceptionIT
Tests run: 1, Failures: 0, Errors: 0, Skipped: 0, Time elapsed: 3.024 sec - in org.apache.phoenix.end2end.ServerExceptionIT
Running org.apache.phoenix.end2end.ExecuteStatementsIT
Tests run: 6, Failures: 0, Errors: 0, Skipped: 0, Time elapsed: 24.059 sec - in org.apache.phoenix.end2end.TenantSpecificViewIndexIT
Running org.apache.phoenix.end2end.SkipScanAfterManualSplitIT
Tests run: 2, Failures: 0, Errors: 0, Skipped: 0, Time elapsed: 16.324 sec - in org.apache.phoenix.end2end.ExecuteStatementsIT
Running org.apache.phoenix.end2end.ConvertTimezoneFunctionIT
Tests run: 6, Failures: 0, Errors: 0, Skipped: 0, Time elapsed: 5.273 sec - in org.apache.phoenix.end2end.ConvertTimezoneFunctionIT
Running org.apache.phoenix.end2end.SkipScanQueryIT
Tests run: 15, Failures: 0, Errors: 0, Skipped: 0, Time elapsed: 50.336 sec - in org.apache.phoenix.end2end.AlterTableIT
Running org.apache.phoenix.end2end.QueryPlanIT
Tests run: 8, Failures: 0, Errors: 0, Skipped: 0, Time elapsed: 17.924 sec - in org.apache.phoenix.end2end.SkipScanQueryIT
Tests run: 1, Failures: 0, Errors: 0, Skipped: 0, Time elapsed: 13.133 sec - in org.apache.phoenix.end2end.QueryPlanIT
Running org.apache.phoenix.end2end.LpadFunctionIT
Tests run: 10, Failures: 0, Errors: 0, Skipped: 0, Time elapsed: 14.484 sec - in org.apache.phoenix.end2end.LpadFunctionIT
Tests run: 16, Failures: 0, Errors: 0, Skipped: 0, Time elapsed: 154.196 sec - in org.apache.phoenix.end2end.index.LocalIndexIT
Tests run: 2, Failures: 0, Errors: 0, Skipped: 0, Time elapsed: 49.435 sec - in org.apache.phoenix.end2end.SkipScanAfterManualSplitIT
Tests run: 25, Failures: 0, Errors: 0, Skipped: 0, Time elapsed: 108.453 sec - in org.apache.phoenix.end2end.InListIT
Tests run: 26, Failures: 0, Errors: 0, Skipped: 0, Time elapsed: 150.908 sec - in org.apache.phoenix.end2end.index.MutableIndexIT
Tests run: 93, Failures: 0, Errors: 0, Skipped: 0, Time elapsed: 175.548 sec - in org.apache.phoenix.end2end.HashJoinIT

Results :

Tests in error: 
  PhoenixTracingEndToEndIT.setupMetrics:77 ? Runtime Could not create  interface...

Tests run: 452, Failures: 0, Errors: 1, Skipped: 0

[INFO] 
[INFO] --- maven-failsafe-plugin:2.17:integration-test (NeedTheirOwnClusterTests) @ phoenix-core ---
[INFO] Failsafe report directory: <https://builds.apache.org/job/Phoenix-4.0-hadoop2/ws/phoenix-core/target/failsafe-reports>
[INFO] parallel='none', perCoreThreadCount=true, threadCount=0, useUnlimitedThreads=false, threadCountSuites=0, threadCountClasses=0, threadCountMethods=0, parallelOptimized=true

-------------------------------------------------------
 T E S T S
-------------------------------------------------------

-------------------------------------------------------
 T E S T S
-------------------------------------------------------
Running org.apache.phoenix.hbase.index.FailForUnsupportedHBaseVersionsIT
Running org.apache.phoenix.end2end.index.MutableIndexFailureIT
Running org.apache.phoenix.hbase.index.covered.example.EndtoEndIndexingWithCompressionIT
Running org.apache.phoenix.hbase.index.covered.example.FailWithoutRetriesIT
Running org.apache.phoenix.hbase.index.covered.EndToEndCoveredColumnsIndexBuilderIT
Running org.apache.phoenix.hbase.index.covered.example.EndToEndCoveredIndexingIT
Tests run: 2, Failures: 0, Errors: 0, Skipped: 0, Time elapsed: 44.215 sec - in org.apache.phoenix.hbase.index.FailForUnsupportedHBaseVersionsIT
Tests run: 1, Failures: 0, Errors: 0, Skipped: 0, Time elapsed: 6.611 sec - in org.apache.phoenix.hbase.index.covered.example.FailWithoutRetriesIT
Running org.apache.phoenix.hbase.index.balancer.IndexLoadBalancerIT
Tests run: 2, Failures: 0, Errors: 0, Skipped: 0, Time elapsed: 15.176 sec - in org.apache.phoenix.hbase.index.covered.EndToEndCoveredColumnsIndexBuilderIT
Running org.apache.phoenix.end2end.ContextClassloaderIT
Tests run: 3, Failures: 0, Errors: 0, Skipped: 0, Time elapsed: 3.478 sec - in org.apache.phoenix.end2end.ContextClassloaderIT
Running org.apache.phoenix.mapreduce.CsvBulkLoadToolIT
Tests run: 11, Failures: 0, Errors: 0, Skipped: 0, Time elapsed: 76.164 sec - in org.apache.phoenix.hbase.index.covered.example.EndtoEndIndexingWithCompressionIT
Tests run: 11, Failures: 0, Errors: 0, Skipped: 0, Time elapsed: 75.384 sec - in org.apache.phoenix.hbase.index.covered.example.EndToEndCoveredIndexingIT
Tests run: 2, Failures: 0, Errors: 0, Skipped: 0, Time elapsed: 168.982 sec - in org.apache.phoenix.end2end.index.MutableIndexFailureIT
Tests run: 9, Failures: 0, Errors: 0, Skipped: 0, Time elapsed: 227.788 sec - in org.apache.phoenix.hbase.index.balancer.IndexLoadBalancerIT
Tests run: 4, Failures: 0, Errors: 0, Skipped: 0, Time elapsed: 262.854 sec - in org.apache.phoenix.mapreduce.CsvBulkLoadToolIT

Results :

Tests run: 45, Failures: 0, Errors: 0, Skipped: 0

[INFO] 
[INFO] --- maven-failsafe-plugin:2.17:verify (ClientManagedTimeTests) @ phoenix-core ---
[INFO] Failsafe report directory: <https://builds.apache.org/job/Phoenix-4.0-hadoop2/ws/phoenix-core/target/failsafe-reports>
[INFO] ------------------------------------------------------------------------
[INFO] Reactor Summary:
[INFO] 
[INFO] Apache Phoenix .................................... SUCCESS [5.117s]
[INFO] Phoenix Hadoop Compatibility ...................... SUCCESS [4.368s]
[INFO] Phoenix Hadoop2 Compatibility ..................... SUCCESS [8.599s]
[INFO] Phoenix Core ...................................... FAILURE [21:34.786s]
[INFO] Phoenix - Flume ................................... SKIPPED
[INFO] Phoenix - Pig ..................................... SKIPPED
[INFO] Phoenix Assembly .................................. SKIPPED
[INFO] ------------------------------------------------------------------------
[INFO] BUILD FAILURE
[INFO] ------------------------------------------------------------------------
[INFO] Total time: 21:54.062s
[INFO] Finished at: Thu Aug 21 10:46:17 UTC 2014
[INFO] Final Memory: 37M/421M
[INFO] ------------------------------------------------------------------------
[ERROR] Failed to execute goal org.apache.maven.plugins:maven-failsafe-plugin:2.17:verify (ClientManagedTimeTests) on project phoenix-core: There are test failures.
[ERROR] 
[ERROR] Please refer to <https://builds.apache.org/job/Phoenix-4.0-hadoop2/ws/phoenix-core/target/failsafe-reports> for the individual test results.
[ERROR] -> [Help 1]
[ERROR] 
[ERROR] To see the full stack trace of the errors, re-run Maven with the -e switch.
[ERROR] Re-run Maven using the -X switch to enable full debug logging.
[ERROR] 
[ERROR] For more information about the errors and possible solutions, please read the following articles:
[ERROR] [Help 1] http://cwiki.apache.org/confluence/display/MAVEN/MojoFailureException
[ERROR] 
[ERROR] After correcting the problems, you can resume the build with the command
[ERROR]   mvn <goals> -rf :phoenix-core
Build step 'Invoke top-level Maven targets' marked build as failure
Archiving artifacts
Sending artifact delta relative to Phoenix | 4.0 | Hadoop2 #53
Archived 675 artifacts
Archive block size is 32768
Received 4719 blocks and 222898257 bytes
Compression is 41.0%
Took 2 min 38 sec
Recording test results
Updating PHOENIX-1188
Updating PHOENIX-1192