You are viewing a plain text version of this content. The canonical link for it is here.
Posted to hdfs-dev@hadoop.apache.org by Apache Jenkins Server <hu...@hudson.apache.org> on 2011/05/24 02:06:15 UTC
Hadoop-Hdfs-22-branch - Build # 55 - Still Failing
See https://builds.apache.org/hudson/job/Hadoop-Hdfs-22-branch/55/
###################################################################################
########################## LAST 60 LINES OF THE CONSOLE ###########################
[...truncated 3083 lines...]
[mkdir] Created dir: /grid/0/hudson/hudson-slave/workspace/Hadoop-Hdfs-22-branch/trunk/build-fi/test/cache
[copy] Copying 1 file to /grid/0/hudson/hudson-slave/workspace/Hadoop-Hdfs-22-branch/trunk/build-fi/test/cache
[copy] Copying 1 file to /grid/0/hudson/hudson-slave/workspace/Hadoop-Hdfs-22-branch/trunk/build-fi/test/cache
[copy] Copying 1 file to /grid/0/hudson/hudson-slave/workspace/Hadoop-Hdfs-22-branch/trunk/build-fi/test/cache
[copy] Copying 1 file to /grid/0/hudson/hudson-slave/workspace/Hadoop-Hdfs-22-branch/trunk/build-fi/test/cache
[copy] Copying 1 file to /grid/0/hudson/hudson-slave/workspace/Hadoop-Hdfs-22-branch/trunk/build-fi/test/cache
[copy] Copying 1 file to /grid/0/hudson/hudson-slave/workspace/Hadoop-Hdfs-22-branch/trunk/build-fi/test/cache
[copy] Copying 1 file to /grid/0/hudson/hudson-slave/workspace/Hadoop-Hdfs-22-branch/trunk/build-fi/test/cache
[copy] Copying 1 file to /grid/0/hudson/hudson-slave/workspace/Hadoop-Hdfs-22-branch/trunk/build-fi/test/cache
[copy] Copying 1 file to /grid/0/hudson/hudson-slave/workspace/Hadoop-Hdfs-22-branch/trunk/build-fi/test/cache
[copy] Copying 1 file to /grid/0/hudson/hudson-slave/workspace/Hadoop-Hdfs-22-branch/trunk/build-fi/test/cache
run-test-hdfs-excluding-commit-and-smoke:
[mkdir] Created dir: /grid/0/hudson/hudson-slave/workspace/Hadoop-Hdfs-22-branch/trunk/build-fi/test/data
[mkdir] Created dir: /grid/0/hudson/hudson-slave/workspace/Hadoop-Hdfs-22-branch/trunk/build-fi/test/logs
[copy] Copying 1 file to /grid/0/hudson/hudson-slave/workspace/Hadoop-Hdfs-22-branch/trunk/build-fi/test/extraconf
[copy] Copying 1 file to /grid/0/hudson/hudson-slave/workspace/Hadoop-Hdfs-22-branch/trunk/build-fi/test/extraconf
[junit] WARNING: multiple versions of ant detected in path for junit
[junit] jar:file:/homes/hudson/tools/ant/latest/lib/ant.jar!/org/apache/tools/ant/Project.class
[junit] and jar:file:/homes/hudson/.ivy2/cache/ant/ant/jars/ant-1.6.5.jar!/org/apache/tools/ant/Project.class
[junit] Running org.apache.hadoop.fs.TestFiListPath
[junit] Tests run: 2, Failures: 0, Errors: 0, Time elapsed: 2.239 sec
[junit] Running org.apache.hadoop.fs.TestFiRename
[junit] Tests run: 4, Failures: 0, Errors: 3, Time elapsed: 4.457 sec
[junit] Test org.apache.hadoop.fs.TestFiRename FAILED
[junit] Running org.apache.hadoop.hdfs.TestFiHFlush
[junit] Tests run: 9, Failures: 0, Errors: 0, Time elapsed: 16.004 sec
[junit] Running org.apache.hadoop.hdfs.TestFiHftp
[junit] Tests run: 1, Failures: 0, Errors: 0, Time elapsed: 42.429 sec
[junit] Running org.apache.hadoop.hdfs.TestFiPipelines
[junit] Tests run: 3, Failures: 0, Errors: 0, Time elapsed: 5.155 sec
[junit] Running org.apache.hadoop.hdfs.server.datanode.TestFiDataTransferProtocol
[junit] Tests run: 29, Failures: 0, Errors: 0, Time elapsed: 211.637 sec
[junit] Running org.apache.hadoop.hdfs.server.datanode.TestFiDataTransferProtocol2
[junit] Tests run: 10, Failures: 0, Errors: 0, Time elapsed: 295.755 sec
[junit] Running org.apache.hadoop.hdfs.server.datanode.TestFiPipelineClose
[junit] Tests run: 3, Failures: 0, Errors: 0, Time elapsed: 35.73 sec
checkfailure:
[touch] Creating /grid/0/hudson/hudson-slave/workspace/Hadoop-Hdfs-22-branch/trunk/build-fi/test/testsfailed
BUILD FAILED
/grid/0/hudson/hudson-slave/workspace/Hadoop-Hdfs-22-branch/trunk/build.xml:744: The following error occurred while executing this line:
/grid/0/hudson/hudson-slave/workspace/Hadoop-Hdfs-22-branch/trunk/build.xml:503: The following error occurred while executing this line:
/grid/0/hudson/hudson-slave/workspace/Hadoop-Hdfs-22-branch/trunk/src/test/aop/build/aop.xml:230: The following error occurred while executing this line:
/grid/0/hudson/hudson-slave/workspace/Hadoop-Hdfs-22-branch/trunk/build.xml:685: The following error occurred while executing this line:
/grid/0/hudson/hudson-slave/workspace/Hadoop-Hdfs-22-branch/trunk/build.xml:659: The following error occurred while executing this line:
/grid/0/hudson/hudson-slave/workspace/Hadoop-Hdfs-22-branch/trunk/build.xml:727: Tests failed!
Total time: 92 minutes 43 seconds
[FINDBUGS] Skipping publisher since build result is FAILURE
Publishing Javadoc
Archiving artifacts
Recording test results
Recording fingerprints
Publishing Clover coverage report...
No Clover report will be published due to a Build Failure
Email was triggered for: Failure
Sending email for trigger: Failure
###################################################################################
############################## FAILED TESTS (if any) ##############################
5 tests failed.
REGRESSION: org.apache.hadoop.fs.TestFiRename.testFailureNonExistentDst
Error Message:
Internal error: default blockSize is not a multiple of default bytesPerChecksum
Stack Trace:
java.io.IOException: Internal error: default blockSize is not a multiple of default bytesPerChecksum
at org.apache.hadoop.fs.AbstractFileSystem.create(AbstractFileSystem.java:474)
at org.apache.hadoop.fs.FileContext$2.next(FileContext.java:575)
at org.apache.hadoop.fs.FileContext$2.next(FileContext.java:572)
at org.apache.hadoop.fs.FileContext$FSLinkResolver.resolve(FileContext.java:2196)
at org.apache.hadoop.fs.FileContext.create(FileContext.java:572)
at org.apache.hadoop.fs.TestFiRename.createFile(TestFiRename.java:140)
at org.apache.hadoop.fs.TestFiRename.testFailureNonExistentDst(TestFiRename.java:151)
REGRESSION: org.apache.hadoop.fs.TestFiRename.testFailuresExistingDst
Error Message:
Internal error: default blockSize is not a multiple of default bytesPerChecksum
Stack Trace:
java.io.IOException: Internal error: default blockSize is not a multiple of default bytesPerChecksum
at org.apache.hadoop.fs.AbstractFileSystem.create(AbstractFileSystem.java:474)
at org.apache.hadoop.fs.FileContext$2.next(FileContext.java:575)
at org.apache.hadoop.fs.FileContext$2.next(FileContext.java:572)
at org.apache.hadoop.fs.FileContext$FSLinkResolver.resolve(FileContext.java:2196)
at org.apache.hadoop.fs.FileContext.create(FileContext.java:572)
at org.apache.hadoop.fs.TestFiRename.createFile(TestFiRename.java:140)
at org.apache.hadoop.fs.TestFiRename.testFailuresExistingDst(TestFiRename.java:167)
REGRESSION: org.apache.hadoop.fs.TestFiRename.testDeletionOfDstFile
Error Message:
Internal error: default blockSize is not a multiple of default bytesPerChecksum
Stack Trace:
java.io.IOException: Internal error: default blockSize is not a multiple of default bytesPerChecksum
at org.apache.hadoop.fs.AbstractFileSystem.create(AbstractFileSystem.java:474)
at org.apache.hadoop.fs.FileContext$2.next(FileContext.java:575)
at org.apache.hadoop.fs.FileContext$2.next(FileContext.java:572)
at org.apache.hadoop.fs.FileContext$FSLinkResolver.resolve(FileContext.java:2196)
at org.apache.hadoop.fs.FileContext.create(FileContext.java:572)
at org.apache.hadoop.fs.TestFiRename.createFile(TestFiRename.java:140)
at org.apache.hadoop.fs.TestFiRename.testDeletionOfDstFile(TestFiRename.java:188)
FAILED: org.apache.hadoop.cli.TestHDFSCLI.testAll
Error Message:
Timeout occurred. Please note the time in the report does not reflect the time until the timeout.
Stack Trace:
junit.framework.AssertionFailedError: Timeout occurred. Please note the time in the report does not reflect the time until the timeout.
FAILED: org.apache.hadoop.hdfs.server.datanode.TestBlockRecovery.testErrorReplicas
Error Message:
Timeout occurred. Please note the time in the report does not reflect the time until the timeout.
Stack Trace:
junit.framework.AssertionFailedError: Timeout occurred. Please note the time in the report does not reflect the time until the timeout.
Hadoop-Hdfs-22-branch - Build # 60 - Still Failing
Posted by Apache Jenkins Server <hu...@hudson.apache.org>.
See https://builds.apache.org/hudson/job/Hadoop-Hdfs-22-branch/60/
###################################################################################
########################## LAST 60 LINES OF THE CONSOLE ###########################
[...truncated 3090 lines...]
compile-hdfs-test:
[delete] Deleting directory /grid/0/hudson/hudson-slave/workspace/Hadoop-Hdfs-22-branch/trunk/build-fi/test/cache
[mkdir] Created dir: /grid/0/hudson/hudson-slave/workspace/Hadoop-Hdfs-22-branch/trunk/build-fi/test/cache
[copy] Copying 1 file to /grid/0/hudson/hudson-slave/workspace/Hadoop-Hdfs-22-branch/trunk/build-fi/test/cache
[copy] Copying 1 file to /grid/0/hudson/hudson-slave/workspace/Hadoop-Hdfs-22-branch/trunk/build-fi/test/cache
[copy] Copying 1 file to /grid/0/hudson/hudson-slave/workspace/Hadoop-Hdfs-22-branch/trunk/build-fi/test/cache
[copy] Copying 1 file to /grid/0/hudson/hudson-slave/workspace/Hadoop-Hdfs-22-branch/trunk/build-fi/test/cache
[copy] Copying 1 file to /grid/0/hudson/hudson-slave/workspace/Hadoop-Hdfs-22-branch/trunk/build-fi/test/cache
[copy] Copying 1 file to /grid/0/hudson/hudson-slave/workspace/Hadoop-Hdfs-22-branch/trunk/build-fi/test/cache
[copy] Copying 1 file to /grid/0/hudson/hudson-slave/workspace/Hadoop-Hdfs-22-branch/trunk/build-fi/test/cache
[copy] Copying 1 file to /grid/0/hudson/hudson-slave/workspace/Hadoop-Hdfs-22-branch/trunk/build-fi/test/cache
[copy] Copying 1 file to /grid/0/hudson/hudson-slave/workspace/Hadoop-Hdfs-22-branch/trunk/build-fi/test/cache
[copy] Copying 1 file to /grid/0/hudson/hudson-slave/workspace/Hadoop-Hdfs-22-branch/trunk/build-fi/test/cache
run-test-hdfs-excluding-commit-and-smoke:
[mkdir] Created dir: /grid/0/hudson/hudson-slave/workspace/Hadoop-Hdfs-22-branch/trunk/build-fi/test/data
[mkdir] Created dir: /grid/0/hudson/hudson-slave/workspace/Hadoop-Hdfs-22-branch/trunk/build-fi/test/logs
[copy] Copying 1 file to /grid/0/hudson/hudson-slave/workspace/Hadoop-Hdfs-22-branch/trunk/build-fi/test/extraconf
[copy] Copying 1 file to /grid/0/hudson/hudson-slave/workspace/Hadoop-Hdfs-22-branch/trunk/build-fi/test/extraconf
[junit] WARNING: multiple versions of ant detected in path for junit
[junit] jar:file:/homes/hudson/tools/ant/latest/lib/ant.jar!/org/apache/tools/ant/Project.class
[junit] and jar:file:/homes/hudson/.ivy2/cache/ant/ant/jars/ant-1.6.5.jar!/org/apache/tools/ant/Project.class
[junit] Running org.apache.hadoop.fs.TestFiListPath
[junit] Tests run: 2, Failures: 0, Errors: 0, Time elapsed: 2.078 sec
[junit] Running org.apache.hadoop.fs.TestFiRename
[junit] Tests run: 4, Failures: 0, Errors: 0, Time elapsed: 5.317 sec
[junit] Running org.apache.hadoop.hdfs.TestFiHFlush
[junit] Tests run: 9, Failures: 0, Errors: 0, Time elapsed: 15.973 sec
[junit] Running org.apache.hadoop.hdfs.TestFiHftp
[junit] Tests run: 1, Failures: 0, Errors: 0, Time elapsed: 39.106 sec
[junit] Running org.apache.hadoop.hdfs.TestFiPipelines
[junit] Tests run: 3, Failures: 0, Errors: 0, Time elapsed: 5.715 sec
[junit] Running org.apache.hadoop.hdfs.server.datanode.TestFiDataTransferProtocol
[junit] Tests run: 29, Failures: 0, Errors: 0, Time elapsed: 211.293 sec
[junit] Running org.apache.hadoop.hdfs.server.datanode.TestFiDataTransferProtocol2
[junit] Tests run: 10, Failures: 0, Errors: 0, Time elapsed: 251.774 sec
[junit] Running org.apache.hadoop.hdfs.server.datanode.TestFiPipelineClose
[junit] Tests run: 3, Failures: 0, Errors: 0, Time elapsed: 35.64 sec
checkfailure:
-run-test-hdfs-fault-inject-withtestcaseonly:
run-test-hdfs-fault-inject:
BUILD FAILED
/grid/0/hudson/hudson-slave/workspace/Hadoop-Hdfs-22-branch/trunk/build.xml:746: Tests failed!
Total time: 57 minutes 22 seconds
[FINDBUGS] Skipping publisher since build result is FAILURE
Publishing Javadoc
Archiving artifacts
Recording test results
Recording fingerprints
Publishing Clover coverage report...
No Clover report will be published due to a Build Failure
Email was triggered for: Failure
Sending email for trigger: Failure
###################################################################################
############################## FAILED TESTS (if any) ##############################
1 tests failed.
REGRESSION: org.apache.hadoop.hdfs.server.balancer.TestBalancer.testBalancer0
Error Message:
127.0.0.1:53451is not an underUtilized node
Stack Trace:
junit.framework.AssertionFailedError: 127.0.0.1:53451is not an underUtilized node
at org.apache.hadoop.hdfs.server.balancer.Balancer.initNodes(Balancer.java:1011)
at org.apache.hadoop.hdfs.server.balancer.Balancer.initNodes(Balancer.java:953)
at org.apache.hadoop.hdfs.server.balancer.Balancer.run(Balancer.java:1496)
at org.apache.hadoop.hdfs.server.balancer.TestBalancer.runBalancer(TestBalancer.java:247)
at org.apache.hadoop.hdfs.server.balancer.TestBalancer.test(TestBalancer.java:234)
at org.apache.hadoop.hdfs.server.balancer.TestBalancer.oneNodeTest(TestBalancer.java:307)
at org.apache.hadoop.hdfs.server.balancer.TestBalancer.__CLR3_0_29j3j5bp3s(TestBalancer.java:327)
at org.apache.hadoop.hdfs.server.balancer.TestBalancer.testBalancer0(TestBalancer.java:324)
Hadoop-Hdfs-22-branch - Build # 59 - Still Failing
Posted by Apache Jenkins Server <hu...@hudson.apache.org>.
See https://builds.apache.org/hudson/job/Hadoop-Hdfs-22-branch/59/
###################################################################################
########################## LAST 60 LINES OF THE CONSOLE ###########################
[...truncated 3064 lines...]
compile-hdfs-test:
[delete] Deleting directory /grid/0/hudson/hudson-slave/workspace/Hadoop-Hdfs-22-branch/trunk/build-fi/test/cache
[mkdir] Created dir: /grid/0/hudson/hudson-slave/workspace/Hadoop-Hdfs-22-branch/trunk/build-fi/test/cache
[copy] Copying 1 file to /grid/0/hudson/hudson-slave/workspace/Hadoop-Hdfs-22-branch/trunk/build-fi/test/cache
[copy] Copying 1 file to /grid/0/hudson/hudson-slave/workspace/Hadoop-Hdfs-22-branch/trunk/build-fi/test/cache
[copy] Copying 1 file to /grid/0/hudson/hudson-slave/workspace/Hadoop-Hdfs-22-branch/trunk/build-fi/test/cache
[copy] Copying 1 file to /grid/0/hudson/hudson-slave/workspace/Hadoop-Hdfs-22-branch/trunk/build-fi/test/cache
[copy] Copying 1 file to /grid/0/hudson/hudson-slave/workspace/Hadoop-Hdfs-22-branch/trunk/build-fi/test/cache
[copy] Copying 1 file to /grid/0/hudson/hudson-slave/workspace/Hadoop-Hdfs-22-branch/trunk/build-fi/test/cache
[copy] Copying 1 file to /grid/0/hudson/hudson-slave/workspace/Hadoop-Hdfs-22-branch/trunk/build-fi/test/cache
[copy] Copying 1 file to /grid/0/hudson/hudson-slave/workspace/Hadoop-Hdfs-22-branch/trunk/build-fi/test/cache
[copy] Copying 1 file to /grid/0/hudson/hudson-slave/workspace/Hadoop-Hdfs-22-branch/trunk/build-fi/test/cache
[copy] Copying 1 file to /grid/0/hudson/hudson-slave/workspace/Hadoop-Hdfs-22-branch/trunk/build-fi/test/cache
run-test-hdfs-excluding-commit-and-smoke:
[mkdir] Created dir: /grid/0/hudson/hudson-slave/workspace/Hadoop-Hdfs-22-branch/trunk/build-fi/test/data
[mkdir] Created dir: /grid/0/hudson/hudson-slave/workspace/Hadoop-Hdfs-22-branch/trunk/build-fi/test/logs
[copy] Copying 1 file to /grid/0/hudson/hudson-slave/workspace/Hadoop-Hdfs-22-branch/trunk/build-fi/test/extraconf
[copy] Copying 1 file to /grid/0/hudson/hudson-slave/workspace/Hadoop-Hdfs-22-branch/trunk/build-fi/test/extraconf
[junit] WARNING: multiple versions of ant detected in path for junit
[junit] jar:file:/homes/hudson/tools/ant/latest/lib/ant.jar!/org/apache/tools/ant/Project.class
[junit] and jar:file:/homes/hudson/.ivy2/cache/ant/ant/jars/ant-1.6.5.jar!/org/apache/tools/ant/Project.class
[junit] Running org.apache.hadoop.fs.TestFiListPath
[junit] Tests run: 2, Failures: 0, Errors: 0, Time elapsed: 2.311 sec
[junit] Running org.apache.hadoop.fs.TestFiRename
[junit] Tests run: 4, Failures: 0, Errors: 0, Time elapsed: 5.533 sec
[junit] Running org.apache.hadoop.hdfs.TestFiHFlush
[junit] Tests run: 9, Failures: 0, Errors: 0, Time elapsed: 15.703 sec
[junit] Running org.apache.hadoop.hdfs.TestFiHftp
[junit] Tests run: 1, Failures: 0, Errors: 0, Time elapsed: 38.089 sec
[junit] Running org.apache.hadoop.hdfs.TestFiPipelines
[junit] Tests run: 3, Failures: 0, Errors: 0, Time elapsed: 5.373 sec
[junit] Running org.apache.hadoop.hdfs.server.datanode.TestFiDataTransferProtocol
[junit] Tests run: 29, Failures: 0, Errors: 0, Time elapsed: 211.423 sec
[junit] Running org.apache.hadoop.hdfs.server.datanode.TestFiDataTransferProtocol2
[junit] Tests run: 10, Failures: 0, Errors: 0, Time elapsed: 277.466 sec
[junit] Running org.apache.hadoop.hdfs.server.datanode.TestFiPipelineClose
[junit] Tests run: 3, Failures: 0, Errors: 0, Time elapsed: 35.837 sec
checkfailure:
-run-test-hdfs-fault-inject-withtestcaseonly:
run-test-hdfs-fault-inject:
BUILD FAILED
/grid/0/hudson/hudson-slave/workspace/Hadoop-Hdfs-22-branch/trunk/build.xml:746: Tests failed!
Total time: 103 minutes 26 seconds
[FINDBUGS] Skipping publisher since build result is FAILURE
Publishing Javadoc
Archiving artifacts
Recording test results
Recording fingerprints
Publishing Clover coverage report...
No Clover report will be published due to a Build Failure
Email was triggered for: Failure
Sending email for trigger: Failure
###################################################################################
############################## FAILED TESTS (if any) ##############################
2 tests failed.
REGRESSION: org.apache.hadoop.cli.TestHDFSCLI.testAll
Error Message:
Timeout occurred. Please note the time in the report does not reflect the time until the timeout.
Stack Trace:
junit.framework.AssertionFailedError: Timeout occurred. Please note the time in the report does not reflect the time until the timeout.
REGRESSION: org.apache.hadoop.hdfs.server.datanode.TestBlockRecovery.testErrorReplicas
Error Message:
Timeout occurred. Please note the time in the report does not reflect the time until the timeout.
Stack Trace:
junit.framework.AssertionFailedError: Timeout occurred. Please note the time in the report does not reflect the time until the timeout.
Hadoop-Hdfs-22-branch - Build # 58 - Still Failing
Posted by Apache Jenkins Server <hu...@hudson.apache.org>.
See https://builds.apache.org/hudson/job/Hadoop-Hdfs-22-branch/58/
###################################################################################
########################## LAST 60 LINES OF THE CONSOLE ###########################
[...truncated 3040 lines...]
compile-hdfs-test:
[delete] Deleting directory /grid/0/hudson/hudson-slave/workspace/Hadoop-Hdfs-22-branch/trunk/build-fi/test/cache
[mkdir] Created dir: /grid/0/hudson/hudson-slave/workspace/Hadoop-Hdfs-22-branch/trunk/build-fi/test/cache
[copy] Copying 1 file to /grid/0/hudson/hudson-slave/workspace/Hadoop-Hdfs-22-branch/trunk/build-fi/test/cache
[copy] Copying 1 file to /grid/0/hudson/hudson-slave/workspace/Hadoop-Hdfs-22-branch/trunk/build-fi/test/cache
[copy] Copying 1 file to /grid/0/hudson/hudson-slave/workspace/Hadoop-Hdfs-22-branch/trunk/build-fi/test/cache
[copy] Copying 1 file to /grid/0/hudson/hudson-slave/workspace/Hadoop-Hdfs-22-branch/trunk/build-fi/test/cache
[copy] Copying 1 file to /grid/0/hudson/hudson-slave/workspace/Hadoop-Hdfs-22-branch/trunk/build-fi/test/cache
[copy] Copying 1 file to /grid/0/hudson/hudson-slave/workspace/Hadoop-Hdfs-22-branch/trunk/build-fi/test/cache
[copy] Copying 1 file to /grid/0/hudson/hudson-slave/workspace/Hadoop-Hdfs-22-branch/trunk/build-fi/test/cache
[copy] Copying 1 file to /grid/0/hudson/hudson-slave/workspace/Hadoop-Hdfs-22-branch/trunk/build-fi/test/cache
[copy] Copying 1 file to /grid/0/hudson/hudson-slave/workspace/Hadoop-Hdfs-22-branch/trunk/build-fi/test/cache
[copy] Copying 1 file to /grid/0/hudson/hudson-slave/workspace/Hadoop-Hdfs-22-branch/trunk/build-fi/test/cache
run-test-hdfs-excluding-commit-and-smoke:
[mkdir] Created dir: /grid/0/hudson/hudson-slave/workspace/Hadoop-Hdfs-22-branch/trunk/build-fi/test/data
[mkdir] Created dir: /grid/0/hudson/hudson-slave/workspace/Hadoop-Hdfs-22-branch/trunk/build-fi/test/logs
[copy] Copying 1 file to /grid/0/hudson/hudson-slave/workspace/Hadoop-Hdfs-22-branch/trunk/build-fi/test/extraconf
[copy] Copying 1 file to /grid/0/hudson/hudson-slave/workspace/Hadoop-Hdfs-22-branch/trunk/build-fi/test/extraconf
[junit] WARNING: multiple versions of ant detected in path for junit
[junit] jar:file:/homes/hudson/tools/ant/latest/lib/ant.jar!/org/apache/tools/ant/Project.class
[junit] and jar:file:/homes/hudson/.ivy2/cache/ant/ant/jars/ant-1.6.5.jar!/org/apache/tools/ant/Project.class
[junit] Running org.apache.hadoop.fs.TestFiListPath
[junit] Tests run: 2, Failures: 0, Errors: 0, Time elapsed: 2.22 sec
[junit] Running org.apache.hadoop.fs.TestFiRename
[junit] Tests run: 4, Failures: 0, Errors: 0, Time elapsed: 5.519 sec
[junit] Running org.apache.hadoop.hdfs.TestFiHFlush
[junit] Tests run: 9, Failures: 0, Errors: 0, Time elapsed: 15.436 sec
[junit] Running org.apache.hadoop.hdfs.TestFiHftp
[junit] Tests run: 1, Failures: 0, Errors: 0, Time elapsed: 41.143 sec
[junit] Running org.apache.hadoop.hdfs.TestFiPipelines
[junit] Tests run: 3, Failures: 0, Errors: 0, Time elapsed: 5.484 sec
[junit] Running org.apache.hadoop.hdfs.server.datanode.TestFiDataTransferProtocol
[junit] Tests run: 29, Failures: 0, Errors: 0, Time elapsed: 210.753 sec
[junit] Running org.apache.hadoop.hdfs.server.datanode.TestFiDataTransferProtocol2
[junit] Tests run: 10, Failures: 0, Errors: 0, Time elapsed: 293.13 sec
[junit] Running org.apache.hadoop.hdfs.server.datanode.TestFiPipelineClose
[junit] Tests run: 3, Failures: 0, Errors: 0, Time elapsed: 35.343 sec
checkfailure:
-run-test-hdfs-fault-inject-withtestcaseonly:
run-test-hdfs-fault-inject:
BUILD FAILED
/grid/0/hudson/hudson-slave/workspace/Hadoop-Hdfs-22-branch/trunk/build.xml:746: Tests failed!
Total time: 48 minutes 30 seconds
[FINDBUGS] Skipping publisher since build result is FAILURE
Publishing Javadoc
Archiving artifacts
Recording test results
Recording fingerprints
Publishing Clover coverage report...
No Clover report will be published due to a Build Failure
Email was triggered for: Failure
Sending email for trigger: Failure
###################################################################################
############################## FAILED TESTS (if any) ##############################
2 tests failed.
FAILED: org.apache.hadoop.hdfs.TestMissingBlocksAlert.testMissingBlocksAlert
Error Message:
HDFS Front page does not contain expected warning
Stack Trace:
junit.framework.AssertionFailedError: HDFS Front page does not contain expected warning
at org.apache.hadoop.hdfs.TestMissingBlocksAlert.__CLR3_0_2n2osx5mgx(TestMissingBlocksAlert.java:93)
at org.apache.hadoop.hdfs.TestMissingBlocksAlert.testMissingBlocksAlert(TestMissingBlocksAlert.java:43)
FAILED: org.apache.hadoop.hdfs.server.balancer.TestBalancer.testBalancer0
Error Message:
127.0.0.1:52769is not an underUtilized node
Stack Trace:
junit.framework.AssertionFailedError: 127.0.0.1:52769is not an underUtilized node
at org.apache.hadoop.hdfs.server.balancer.Balancer.initNodes(Balancer.java:1011)
at org.apache.hadoop.hdfs.server.balancer.Balancer.initNodes(Balancer.java:953)
at org.apache.hadoop.hdfs.server.balancer.Balancer.run(Balancer.java:1496)
at org.apache.hadoop.hdfs.server.balancer.TestBalancer.runBalancer(TestBalancer.java:247)
at org.apache.hadoop.hdfs.server.balancer.TestBalancer.test(TestBalancer.java:234)
at org.apache.hadoop.hdfs.server.balancer.TestBalancer.oneNodeTest(TestBalancer.java:307)
at org.apache.hadoop.hdfs.server.balancer.TestBalancer.__CLR3_0_29j3j5bp41(TestBalancer.java:327)
at org.apache.hadoop.hdfs.server.balancer.TestBalancer.testBalancer0(TestBalancer.java:324)
Hadoop-Hdfs-22-branch - Build # 57 - Still Failing
Posted by Apache Jenkins Server <hu...@hudson.apache.org>.
See https://builds.apache.org/hudson/job/Hadoop-Hdfs-22-branch/57/
###################################################################################
########################## LAST 60 LINES OF THE CONSOLE ###########################
[...truncated 3078 lines...]
compile-hdfs-test:
[delete] Deleting directory /grid/0/hudson/hudson-slave/workspace/Hadoop-Hdfs-22-branch/trunk/build-fi/test/cache
[mkdir] Created dir: /grid/0/hudson/hudson-slave/workspace/Hadoop-Hdfs-22-branch/trunk/build-fi/test/cache
[copy] Copying 1 file to /grid/0/hudson/hudson-slave/workspace/Hadoop-Hdfs-22-branch/trunk/build-fi/test/cache
[copy] Copying 1 file to /grid/0/hudson/hudson-slave/workspace/Hadoop-Hdfs-22-branch/trunk/build-fi/test/cache
[copy] Copying 1 file to /grid/0/hudson/hudson-slave/workspace/Hadoop-Hdfs-22-branch/trunk/build-fi/test/cache
[copy] Copying 1 file to /grid/0/hudson/hudson-slave/workspace/Hadoop-Hdfs-22-branch/trunk/build-fi/test/cache
[copy] Copying 1 file to /grid/0/hudson/hudson-slave/workspace/Hadoop-Hdfs-22-branch/trunk/build-fi/test/cache
[copy] Copying 1 file to /grid/0/hudson/hudson-slave/workspace/Hadoop-Hdfs-22-branch/trunk/build-fi/test/cache
[copy] Copying 1 file to /grid/0/hudson/hudson-slave/workspace/Hadoop-Hdfs-22-branch/trunk/build-fi/test/cache
[copy] Copying 1 file to /grid/0/hudson/hudson-slave/workspace/Hadoop-Hdfs-22-branch/trunk/build-fi/test/cache
[copy] Copying 1 file to /grid/0/hudson/hudson-slave/workspace/Hadoop-Hdfs-22-branch/trunk/build-fi/test/cache
[copy] Copying 1 file to /grid/0/hudson/hudson-slave/workspace/Hadoop-Hdfs-22-branch/trunk/build-fi/test/cache
run-test-hdfs-excluding-commit-and-smoke:
[mkdir] Created dir: /grid/0/hudson/hudson-slave/workspace/Hadoop-Hdfs-22-branch/trunk/build-fi/test/data
[mkdir] Created dir: /grid/0/hudson/hudson-slave/workspace/Hadoop-Hdfs-22-branch/trunk/build-fi/test/logs
[copy] Copying 1 file to /grid/0/hudson/hudson-slave/workspace/Hadoop-Hdfs-22-branch/trunk/build-fi/test/extraconf
[copy] Copying 1 file to /grid/0/hudson/hudson-slave/workspace/Hadoop-Hdfs-22-branch/trunk/build-fi/test/extraconf
[junit] WARNING: multiple versions of ant detected in path for junit
[junit] jar:file:/homes/hudson/tools/ant/latest/lib/ant.jar!/org/apache/tools/ant/Project.class
[junit] and jar:file:/homes/hudson/.ivy2/cache/ant/ant/jars/ant-1.6.5.jar!/org/apache/tools/ant/Project.class
[junit] Running org.apache.hadoop.fs.TestFiListPath
[junit] Tests run: 2, Failures: 0, Errors: 0, Time elapsed: 2.174 sec
[junit] Running org.apache.hadoop.fs.TestFiRename
[junit] Tests run: 4, Failures: 0, Errors: 0, Time elapsed: 5.363 sec
[junit] Running org.apache.hadoop.hdfs.TestFiHFlush
[junit] Tests run: 9, Failures: 0, Errors: 0, Time elapsed: 15.369 sec
[junit] Running org.apache.hadoop.hdfs.TestFiHftp
[junit] Tests run: 1, Failures: 0, Errors: 0, Time elapsed: 38.472 sec
[junit] Running org.apache.hadoop.hdfs.TestFiPipelines
[junit] Tests run: 3, Failures: 0, Errors: 0, Time elapsed: 5.48 sec
[junit] Running org.apache.hadoop.hdfs.server.datanode.TestFiDataTransferProtocol
[junit] Tests run: 29, Failures: 0, Errors: 0, Time elapsed: 209.871 sec
[junit] Running org.apache.hadoop.hdfs.server.datanode.TestFiDataTransferProtocol2
[junit] Tests run: 10, Failures: 0, Errors: 0, Time elapsed: 340.916 sec
[junit] Running org.apache.hadoop.hdfs.server.datanode.TestFiPipelineClose
[junit] Tests run: 3, Failures: 0, Errors: 0, Time elapsed: 35.507 sec
checkfailure:
-run-test-hdfs-fault-inject-withtestcaseonly:
run-test-hdfs-fault-inject:
BUILD FAILED
/grid/0/hudson/hudson-slave/workspace/Hadoop-Hdfs-22-branch/trunk/build.xml:746: Tests failed!
Total time: 50 minutes 24 seconds
[FINDBUGS] Skipping publisher since build result is FAILURE
Publishing Javadoc
Archiving artifacts
Recording test results
Recording fingerprints
Publishing Clover coverage report...
No Clover report will be published due to a Build Failure
Email was triggered for: Failure
Sending email for trigger: Failure
###################################################################################
############################## FAILED TESTS (if any) ##############################
2 tests failed.
REGRESSION: org.apache.hadoop.hdfs.TestMissingBlocksAlert.testMissingBlocksAlert
Error Message:
HDFS Front page does not contain expected warning
Stack Trace:
junit.framework.AssertionFailedError: HDFS Front page does not contain expected warning
at org.apache.hadoop.hdfs.TestMissingBlocksAlert.__CLR3_0_2n2osx5mgx(TestMissingBlocksAlert.java:93)
at org.apache.hadoop.hdfs.TestMissingBlocksAlert.testMissingBlocksAlert(TestMissingBlocksAlert.java:43)
FAILED: org.apache.hadoop.hdfs.server.balancer.TestBalancer.testBalancer0
Error Message:
127.0.0.1:41523is not an underUtilized node
Stack Trace:
junit.framework.AssertionFailedError: 127.0.0.1:41523is not an underUtilized node
at org.apache.hadoop.hdfs.server.balancer.Balancer.initNodes(Balancer.java:1011)
at org.apache.hadoop.hdfs.server.balancer.Balancer.initNodes(Balancer.java:953)
at org.apache.hadoop.hdfs.server.balancer.Balancer.run(Balancer.java:1496)
at org.apache.hadoop.hdfs.server.balancer.TestBalancer.runBalancer(TestBalancer.java:247)
at org.apache.hadoop.hdfs.server.balancer.TestBalancer.test(TestBalancer.java:234)
at org.apache.hadoop.hdfs.server.balancer.TestBalancer.oneNodeTest(TestBalancer.java:307)
at org.apache.hadoop.hdfs.server.balancer.TestBalancer.__CLR3_0_29j3j5bp41(TestBalancer.java:327)
at org.apache.hadoop.hdfs.server.balancer.TestBalancer.testBalancer0(TestBalancer.java:324)
Hadoop-Hdfs-22-branch - Build # 56 - Still Failing
Posted by Apache Jenkins Server <hu...@hudson.apache.org>.
See https://builds.apache.org/hudson/job/Hadoop-Hdfs-22-branch/56/
###################################################################################
########################## LAST 60 LINES OF THE CONSOLE ###########################
[...truncated 3050 lines...]
compile-hdfs-test:
[delete] Deleting directory /grid/0/hudson/hudson-slave/workspace/Hadoop-Hdfs-22-branch/trunk/build-fi/test/cache
[mkdir] Created dir: /grid/0/hudson/hudson-slave/workspace/Hadoop-Hdfs-22-branch/trunk/build-fi/test/cache
[copy] Copying 1 file to /grid/0/hudson/hudson-slave/workspace/Hadoop-Hdfs-22-branch/trunk/build-fi/test/cache
[copy] Copying 1 file to /grid/0/hudson/hudson-slave/workspace/Hadoop-Hdfs-22-branch/trunk/build-fi/test/cache
[copy] Copying 1 file to /grid/0/hudson/hudson-slave/workspace/Hadoop-Hdfs-22-branch/trunk/build-fi/test/cache
[copy] Copying 1 file to /grid/0/hudson/hudson-slave/workspace/Hadoop-Hdfs-22-branch/trunk/build-fi/test/cache
[copy] Copying 1 file to /grid/0/hudson/hudson-slave/workspace/Hadoop-Hdfs-22-branch/trunk/build-fi/test/cache
[copy] Copying 1 file to /grid/0/hudson/hudson-slave/workspace/Hadoop-Hdfs-22-branch/trunk/build-fi/test/cache
[copy] Copying 1 file to /grid/0/hudson/hudson-slave/workspace/Hadoop-Hdfs-22-branch/trunk/build-fi/test/cache
[copy] Copying 1 file to /grid/0/hudson/hudson-slave/workspace/Hadoop-Hdfs-22-branch/trunk/build-fi/test/cache
[copy] Copying 1 file to /grid/0/hudson/hudson-slave/workspace/Hadoop-Hdfs-22-branch/trunk/build-fi/test/cache
[copy] Copying 1 file to /grid/0/hudson/hudson-slave/workspace/Hadoop-Hdfs-22-branch/trunk/build-fi/test/cache
run-test-hdfs-excluding-commit-and-smoke:
[mkdir] Created dir: /grid/0/hudson/hudson-slave/workspace/Hadoop-Hdfs-22-branch/trunk/build-fi/test/data
[mkdir] Created dir: /grid/0/hudson/hudson-slave/workspace/Hadoop-Hdfs-22-branch/trunk/build-fi/test/logs
[copy] Copying 1 file to /grid/0/hudson/hudson-slave/workspace/Hadoop-Hdfs-22-branch/trunk/build-fi/test/extraconf
[copy] Copying 1 file to /grid/0/hudson/hudson-slave/workspace/Hadoop-Hdfs-22-branch/trunk/build-fi/test/extraconf
[junit] WARNING: multiple versions of ant detected in path for junit
[junit] jar:file:/homes/hudson/tools/ant/latest/lib/ant.jar!/org/apache/tools/ant/Project.class
[junit] and jar:file:/homes/hudson/.ivy2/cache/ant/ant/jars/ant-1.6.5.jar!/org/apache/tools/ant/Project.class
[junit] Running org.apache.hadoop.fs.TestFiListPath
[junit] Tests run: 2, Failures: 0, Errors: 0, Time elapsed: 2.112 sec
[junit] Running org.apache.hadoop.fs.TestFiRename
[junit] Tests run: 4, Failures: 0, Errors: 0, Time elapsed: 5.369 sec
[junit] Running org.apache.hadoop.hdfs.TestFiHFlush
[junit] Tests run: 9, Failures: 0, Errors: 0, Time elapsed: 15.168 sec
[junit] Running org.apache.hadoop.hdfs.TestFiHftp
[junit] Tests run: 1, Failures: 0, Errors: 0, Time elapsed: 46.228 sec
[junit] Running org.apache.hadoop.hdfs.TestFiPipelines
[junit] Tests run: 3, Failures: 0, Errors: 0, Time elapsed: 5.64 sec
[junit] Running org.apache.hadoop.hdfs.server.datanode.TestFiDataTransferProtocol
[junit] Tests run: 29, Failures: 0, Errors: 0, Time elapsed: 206.769 sec
[junit] Running org.apache.hadoop.hdfs.server.datanode.TestFiDataTransferProtocol2
[junit] Tests run: 10, Failures: 0, Errors: 0, Time elapsed: 263.593 sec
[junit] Running org.apache.hadoop.hdfs.server.datanode.TestFiPipelineClose
[junit] Tests run: 3, Failures: 0, Errors: 0, Time elapsed: 35.43 sec
checkfailure:
-run-test-hdfs-fault-inject-withtestcaseonly:
run-test-hdfs-fault-inject:
BUILD FAILED
/grid/0/hudson/hudson-slave/workspace/Hadoop-Hdfs-22-branch/trunk/build.xml:746: Tests failed!
Total time: 46 minutes 44 seconds
[FINDBUGS] Skipping publisher since build result is FAILURE
Publishing Javadoc
Archiving artifacts
Recording test results
Recording fingerprints
Publishing Clover coverage report...
No Clover report will be published due to a Build Failure
Email was triggered for: Failure
Sending email for trigger: Failure
###################################################################################
############################## FAILED TESTS (if any) ##############################
1 tests failed.
REGRESSION: org.apache.hadoop.hdfs.server.balancer.TestBalancer.testBalancer0
Error Message:
127.0.0.1:35016is not an underUtilized node
Stack Trace:
junit.framework.AssertionFailedError: 127.0.0.1:35016is not an underUtilized node
at org.apache.hadoop.hdfs.server.balancer.Balancer.initNodes(Balancer.java:1011)
at org.apache.hadoop.hdfs.server.balancer.Balancer.initNodes(Balancer.java:953)
at org.apache.hadoop.hdfs.server.balancer.Balancer.run(Balancer.java:1496)
at org.apache.hadoop.hdfs.server.balancer.TestBalancer.runBalancer(TestBalancer.java:247)
at org.apache.hadoop.hdfs.server.balancer.TestBalancer.test(TestBalancer.java:234)
at org.apache.hadoop.hdfs.server.balancer.TestBalancer.twoNodeTest(TestBalancer.java:312)
at org.apache.hadoop.hdfs.server.balancer.TestBalancer.__CLR3_0_29j3j5bp3t(TestBalancer.java:328)
at org.apache.hadoop.hdfs.server.balancer.TestBalancer.testBalancer0(TestBalancer.java:324)