You are viewing a plain text version of this content. The canonical link for it is here.
Posted to builds@beam.apache.org by Apache Jenkins Server <je...@builds.apache.org> on 2022/11/10 05:39:13 UTC
Build failed in Jenkins: beam_PostCommit_XVR_PythonUsingJava_Dataflow #1141
See <https://ci-beam.apache.org/job/beam_PostCommit_XVR_PythonUsingJava_Dataflow/1141/display/redirect?page=changes>
Changes:
[noreply] Remove a duplicate label (#24043)
[noreply] Update datastore_wordcount.py (#23724)
------------------------------------------
[...truncated 1.01 MB...]
overrides==6.5.0
packaging==21.3
pandas==1.4.4
parameterized==0.8.1
pbr==5.11.0
pip==22.3.1
pluggy==1.0.0
proto-plus==1.22.1
protobuf==3.19.6
psycopg2-binary==2.9.4
py==1.11.0
pyarrow==9.0.0
pyasn1==0.4.8
pyasn1-modules==0.2.8
pycparser==2.21
pydot==1.4.2
PyHamcrest==1.10.1
pymongo==3.12.3
PyMySQL==1.0.2
pyparsing==3.0.9
pytest==7.1.3
pytest-forked==1.4.0
pytest-timeout==2.1.0
pytest-xdist==2.5.0
python-dateutil==2.8.2
python-snappy==0.6.1
pytz==2022.5
PyYAML==6.0
regex==2022.9.13
requests==2.28.1
requests-mock==1.10.0
requests-oauthlib==1.3.1
rsa==4.9
scikit-learn==1.1.2
scipy==1.9.3
setuptools==65.5.1
six==1.16.0
sortedcontainers==2.4.0
soupsieve==2.3.2.post1
SQLAlchemy==1.4.42
sqlparse==0.4.3
tenacity==5.1.5
tensorboard==2.10.1
tensorboard-data-server==0.6.1
tensorboard-plugin-wit==1.8.1
tensorflow==2.10.0
tensorflow-estimator==2.10.0
tensorflow-io-gcs-filesystem==0.27.0
termcolor==2.0.1
testcontainers==3.7.0
threadpoolctl==3.1.0
tomli==2.0.1
tqdm==4.64.1
typing_extensions==4.4.0
uritemplate==4.1.1
urllib3==1.26.12
websocket-client==1.4.1
Werkzeug==2.2.2
wheel==0.37.1
wrapt==1.14.1
zstandard==0.18.0
Removing intermediate container 6b2fbd423685
---> 12910c3ec603
Step 17/32 : COPY target/LICENSE /opt/apache/beam/
---> 0f0a8484a4b2
Step 18/32 : COPY target/LICENSE.python /opt/apache/beam/
---> 9a9d832250a6
Step 19/32 : COPY target/NOTICE /opt/apache/beam/
---> b3d8eb8b9c50
Step 20/32 : COPY target/launcher/linux_amd64/boot /opt/apache/beam/
---> 92eab2548258
Step 21/32 : ENTRYPOINT ["/opt/apache/beam/boot"]
---> Running in beada6ca51ec
Removing intermediate container beada6ca51ec
---> f253db2e9b72
Step 22/32 : FROM beam as third_party_licenses
---> f253db2e9b72
Step 23/32 : ARG pull_licenses
---> Running in f444a70e10f9
Removing intermediate container f444a70e10f9
---> dfecd83f8698
Step 24/32 : COPY target/license_scripts /tmp/license_scripts/
---> 223cb15f1bfc
Step 25/32 : COPY target/LICENSE target/go-licenses/* /opt/apache/beam/third_party_licenses/golang/
---> 9791dfd1c643
Step 26/32 : RUN rm /opt/apache/beam/third_party_licenses/golang/LICENSE
---> Running in b1afa2288394
Removing intermediate container b1afa2288394
---> 8ab520a63e9b
Step 27/32 : COPY target/license_scripts /tmp/license_scripts/
---> a562dcc81688
Step 28/32 : RUN if [ "$pull_licenses" = "true" ] ; then pip install 'pip-licenses<4.0.0' pyyaml tenacity && python /tmp/license_scripts/pull_licenses_py.py ; fi
---> Running in 139f161360ab
Collecting pip-licenses<4.0.0
Downloading pip_licenses-3.5.5-py3-none-any.whl (17 kB)
Requirement already satisfied: pyyaml in /usr/local/lib/python3.10/site-packages (6.0)
Requirement already satisfied: tenacity in /usr/local/lib/python3.10/site-packages (5.1.5)
Collecting PTable
Downloading PTable-0.9.2.tar.gz (31 kB)
Preparing metadata (setup.py): started
Preparing metadata (setup.py): finished with status 'done'
Requirement already satisfied: six>=1.9.0 in /usr/local/lib/python3.10/site-packages (from tenacity) (1.16.0)
Building wheels for collected packages: PTable
Building wheel for PTable (setup.py): started
Building wheel for PTable (setup.py): finished with status 'done'
Created wheel for PTable: filename=PTable-0.9.2-py3-none-any.whl size=22908 sha256=b543923e8144202dfc1e6c7516ae8e1e08236e349d40c3b3683daa17dbbd83c6
Stored in directory: /root/.cache/pip/wheels/62/2a/42/c655cf57d84ab59535337af009892aaf16256a813826b465f7
Successfully built PTable
Installing collected packages: PTable, pip-licenses
Successfully installed PTable-0.9.2 pip-licenses-3.5.5
[91mWARNING: Running pip as the 'root' user can result in broken permissions and conflicting behaviour with the system package manager. It is recommended to use a virtual environment instead: https://pip.pypa.io/warnings/venv
[0mSkip pulling license for bs4
[91mINFO:root:Successfully pulled licenses for 135 dependencies
[0mRemoving intermediate container 139f161360ab
---> 2b3f2e84d15d
Step 29/32 : FROM beam
---> f253db2e9b72
Step 30/32 : ARG pull_licenses
---> Running in e811bb329e4f
Removing intermediate container e811bb329e4f
---> f4b8b8298815
Step 31/32 : COPY --from=third_party_licenses /opt/apache/beam/third_party_licenses /opt/apache/beam/third_party_licenses
---> fb08ba6a9f95
Step 32/32 : RUN if [ "$pull_licenses" != "true" ] ; then rm -rf /opt/apache/beam/third_party_licenses ; fi
---> Running in 49c2236459d2
Removing intermediate container 49c2236459d2
---> 0bb72437dc8e
Successfully built 0bb72437dc8e
Successfully tagged apache/beam_python3.10_sdk:2.44.0.dev
> Task :runners:google-cloud-dataflow-java:buildAndPushDockerPythonContainer
WARNING: `gcloud docker` will not be supported for Docker client versions above 18.03.
As an alternative, use `gcloud auth configure-docker` to configure `docker` to
use `gcloud` as a credential helper, then use `docker` as you would for non-GCR
registries, e.g. `docker pull gcr.io/project-id/my-image`. Add
`--verbosity=error` to silence this warning: `gcloud docker
--verbosity=error -- pull gcr.io/project-id/my-image`.
See: https://cloud.google.com/container-registry/docs/support/deprecation-notices#gcloud-docker
The push refers to repository [us.gcr.io/apache-beam-testing/java-postcommit-it/python]
3a639093ee54: Preparing
917530b85871: Preparing
44eca73ec36d: Preparing
3b82cf8184a6: Preparing
b0d8a7f817d2: Preparing
c502c2392e39: Preparing
9280ef4f2e62: Preparing
984d69328dba: Preparing
186d387def57: Preparing
3d438c937582: Preparing
f660f24f15aa: Preparing
c5b6f24eefef: Preparing
371f3dabaeb4: Preparing
980df0081d43: Preparing
f5d161bba139: Preparing
1569e0d95ce6: Preparing
d9e08da15d0c: Preparing
c502c2392e39: Waiting
6b183c62e3d7: Preparing
882fd36bfd35: Preparing
d1dec9917839: Preparing
9280ef4f2e62: Waiting
d38adf39e1dd: Preparing
4ed121b04368: Preparing
d9d07d703dd5: Preparing
984d69328dba: Waiting
186d387def57: Waiting
6b183c62e3d7: Waiting
1569e0d95ce6: Waiting
3d438c937582: Waiting
980df0081d43: Waiting
882fd36bfd35: Waiting
f660f24f15aa: Waiting
f5d161bba139: Waiting
c5b6f24eefef: Waiting
d1dec9917839: Waiting
371f3dabaeb4: Waiting
d9e08da15d0c: Waiting
d38adf39e1dd: Waiting
4ed121b04368: Waiting
3a639093ee54: Pushed
b0d8a7f817d2: Pushed
3b82cf8184a6: Pushed
917530b85871: Pushed
984d69328dba: Pushed
9280ef4f2e62: Pushed
44eca73ec36d: Pushed
186d387def57: Pushed
371f3dabaeb4: Pushed
f660f24f15aa: Pushed
f5d161bba139: Layer already exists
1569e0d95ce6: Layer already exists
d9e08da15d0c: Layer already exists
6b183c62e3d7: Layer already exists
882fd36bfd35: Layer already exists
980df0081d43: Pushed
d1dec9917839: Layer already exists
d38adf39e1dd: Layer already exists
4ed121b04368: Layer already exists
d9d07d703dd5: Layer already exists
c502c2392e39: Pushed
3d438c937582: Pushed
c5b6f24eefef: Pushed
name unknown: Failed to get blob sizes.
> Task :runners:google-cloud-dataflow-java:buildAndPushDockerPythonContainer FAILED
> Task :runners:google-cloud-dataflow-java:validatesCrossLanguageRunnerSetup
Launching Java expansion service @ 41795
Launching Python expansion service @ 45603
> Task :runners:google-cloud-dataflow-java:validatesCrossLanguageRunnerCleanup
Stopping expansion service pid: 1062108.
Stopping expansion service pid: 1062109.
FAILURE: Build failed with an exception.
* Where:
Build file '<https://ci-beam.apache.org/job/beam_PostCommit_XVR_PythonUsingJava_Dataflow/ws/src/runners/google-cloud-dataflow-java/build.gradle'> line: 330
* What went wrong:
Execution failed for task ':runners:google-cloud-dataflow-java:buildAndPushDockerPythonContainer'.
> Process 'command 'gcloud'' finished with non-zero exit value 1
* Try:
> Run with --stacktrace option to get the stack trace.
> Run with --info or --debug option to get more log output.
* Get more help at https://help.gradle.org
Deprecated Gradle features were used in this build, making it incompatible with Gradle 8.0.
You can use '--warning-mode all' to show the individual deprecation warnings and determine if they come from your own scripts or plugins.
See https://docs.gradle.org/7.5.1/userguide/command_line_interface.html#sec:command_line_warnings
Execution optimizations have been disabled for 1 invalid unit(s) of work during this build to ensure correctness.
Please consult deprecation warnings for more details.
BUILD FAILED in 11m 40s
126 actionable tasks: 22 executed, 104 up-to-date
Publishing build scan...
https://gradle.com/s/7a35l6zyfsf32
Build step 'Invoke Gradle script' changed build result to FAILURE
Build step 'Invoke Gradle script' marked build as failure
---------------------------------------------------------------------
To unsubscribe, e-mail: builds-unsubscribe@beam.apache.org
For additional commands, e-mail: builds-help@beam.apache.org
Jenkins build is back to normal : beam_PostCommit_XVR_PythonUsingJava_Dataflow #1143
Posted by Apache Jenkins Server <je...@builds.apache.org>.
See <https://ci-beam.apache.org/job/beam_PostCommit_XVR_PythonUsingJava_Dataflow/1143/display/redirect?page=changes>
---------------------------------------------------------------------
To unsubscribe, e-mail: builds-unsubscribe@beam.apache.org
For additional commands, e-mail: builds-help@beam.apache.org
Build failed in Jenkins: beam_PostCommit_XVR_PythonUsingJava_Dataflow #1142
Posted by Apache Jenkins Server <je...@builds.apache.org>.
See <https://ci-beam.apache.org/job/beam_PostCommit_XVR_PythonUsingJava_Dataflow/1142/display/redirect>
Changes:
------------------------------------------
[...truncated 1.02 MB...]
packaging==21.3
pandas==1.4.4
parameterized==0.8.1
pbr==5.11.0
pip==22.3.1
pluggy==1.0.0
proto-plus==1.22.1
protobuf==3.19.6
psycopg2-binary==2.9.4
py==1.11.0
pyarrow==9.0.0
pyasn1==0.4.8
pyasn1-modules==0.2.8
pycparser==2.21
pydot==1.4.2
PyHamcrest==1.10.1
pymongo==3.12.3
PyMySQL==1.0.2
pyparsing==3.0.9
pytest==7.1.3
pytest-forked==1.4.0
pytest-timeout==2.1.0
pytest-xdist==2.5.0
python-dateutil==2.8.2
python-snappy==0.6.1
pytz==2022.5
PyYAML==6.0
regex==2022.9.13
requests==2.28.1
requests-mock==1.10.0
requests-oauthlib==1.3.1
rsa==4.9
scikit-learn==1.1.2
scipy==1.9.3
setuptools==65.5.1
six==1.16.0
sortedcontainers==2.4.0
soupsieve==2.3.2.post1
SQLAlchemy==1.4.42
sqlparse==0.4.3
tenacity==5.1.5
tensorboard==2.10.1
tensorboard-data-server==0.6.1
tensorboard-plugin-wit==1.8.1
tensorflow==2.10.0
tensorflow-estimator==2.10.0
tensorflow-io-gcs-filesystem==0.27.0
termcolor==2.0.1
testcontainers==3.7.0
threadpoolctl==3.1.0
tomli==2.0.1
tqdm==4.64.1
typing_extensions==4.4.0
uritemplate==4.1.1
urllib3==1.26.12
websocket-client==1.4.1
Werkzeug==2.2.2
wheel==0.37.1
wrapt==1.14.1
zstandard==0.18.0
Removing intermediate container 572a536f4dd4
---> 75ba6bfb55a3
Step 17/32 : COPY target/LICENSE /opt/apache/beam/
---> 1892db63146d
Step 18/32 : COPY target/LICENSE.python /opt/apache/beam/
---> 85f081042cf0
Step 19/32 : COPY target/NOTICE /opt/apache/beam/
---> e71325959088
Step 20/32 : COPY target/launcher/linux_amd64/boot /opt/apache/beam/
---> fb71edd57ef7
Step 21/32 : ENTRYPOINT ["/opt/apache/beam/boot"]
---> Running in 0655083a1ba9
Removing intermediate container 0655083a1ba9
---> 96864dd91bd1
Step 22/32 : FROM beam as third_party_licenses
---> 96864dd91bd1
Step 23/32 : ARG pull_licenses
---> Running in f8a5312303e7
Removing intermediate container f8a5312303e7
---> 140c74c2ff95
Step 24/32 : COPY target/license_scripts /tmp/license_scripts/
---> 0169fcadc405
Step 25/32 : COPY target/LICENSE target/go-licenses/* /opt/apache/beam/third_party_licenses/golang/
---> 43245770970d
Step 26/32 : RUN rm /opt/apache/beam/third_party_licenses/golang/LICENSE
---> Running in 011e8fb26fad
Removing intermediate container 011e8fb26fad
---> 1a7161d313df
Step 27/32 : COPY target/license_scripts /tmp/license_scripts/
---> a8c03cab5d70
Step 28/32 : RUN if [ "$pull_licenses" = "true" ] ; then pip install 'pip-licenses<4.0.0' pyyaml tenacity && python /tmp/license_scripts/pull_licenses_py.py ; fi
---> Running in da01a8554424
Collecting pip-licenses<4.0.0
Downloading pip_licenses-3.5.5-py3-none-any.whl (17 kB)
Requirement already satisfied: pyyaml in /usr/local/lib/python3.10/site-packages (6.0)
Requirement already satisfied: tenacity in /usr/local/lib/python3.10/site-packages (5.1.5)
Collecting PTable
Downloading PTable-0.9.2.tar.gz (31 kB)
Preparing metadata (setup.py): started
Preparing metadata (setup.py): finished with status 'done'
Requirement already satisfied: six>=1.9.0 in /usr/local/lib/python3.10/site-packages (from tenacity) (1.16.0)
Building wheels for collected packages: PTable
Building wheel for PTable (setup.py): started
Building wheel for PTable (setup.py): finished with status 'done'
Created wheel for PTable: filename=PTable-0.9.2-py3-none-any.whl size=22908 sha256=83c49f5f25287e784864fcfa413bded76c9bde8ef0295ccfcb00bebd41a06ab0
Stored in directory: /root/.cache/pip/wheels/62/2a/42/c655cf57d84ab59535337af009892aaf16256a813826b465f7
Successfully built PTable
Installing collected packages: PTable, pip-licenses
Successfully installed PTable-0.9.2 pip-licenses-3.5.5
[91mWARNING: Running pip as the 'root' user can result in broken permissions and conflicting behaviour with the system package manager. It is recommended to use a virtual environment instead: https://pip.pypa.io/warnings/venv
[0mSkip pulling license for bs4
[91mINFO:root:Successfully pulled licenses for 135 dependencies
[0mRemoving intermediate container da01a8554424
---> 6199c40ca2d6
Step 29/32 : FROM beam
---> 96864dd91bd1
Step 30/32 : ARG pull_licenses
---> Running in c6fa9852081d
Removing intermediate container c6fa9852081d
---> 1cab43c3e71a
Step 31/32 : COPY --from=third_party_licenses /opt/apache/beam/third_party_licenses /opt/apache/beam/third_party_licenses
---> d12d61220cf0
Step 32/32 : RUN if [ "$pull_licenses" != "true" ] ; then rm -rf /opt/apache/beam/third_party_licenses ; fi
---> Running in ed505c4fcf21
Removing intermediate container ed505c4fcf21
---> 0cf6d3c200b1
Successfully built 0cf6d3c200b1
Successfully tagged apache/beam_python3.10_sdk:2.44.0.dev
> Task :runners:google-cloud-dataflow-java:buildAndPushDockerPythonContainer
WARNING: `gcloud docker` will not be supported for Docker client versions above 18.03.
As an alternative, use `gcloud auth configure-docker` to configure `docker` to
use `gcloud` as a credential helper, then use `docker` as you would for non-GCR
registries, e.g. `docker pull gcr.io/project-id/my-image`. Add
`--verbosity=error` to silence this warning: `gcloud docker
--verbosity=error -- pull gcr.io/project-id/my-image`.
See: https://cloud.google.com/container-registry/docs/support/deprecation-notices#gcloud-docker
The push refers to repository [us.gcr.io/apache-beam-testing/java-postcommit-it/python]
67bb86f42c60: Preparing
e5e43964020b: Preparing
26d2f3e74403: Preparing
4a0470db3f99: Preparing
0d6eeb738100: Preparing
6c621a24ac02: Preparing
d567ac532f07: Preparing
b6a22495adf4: Preparing
6542139d41e1: Preparing
04af0a567f1e: Preparing
e93879aa10b0: Preparing
42cabb076e60: Preparing
4330bba1d897: Preparing
10f41d3d8cb1: Preparing
f5d161bba139: Preparing
1569e0d95ce6: Preparing
d9e08da15d0c: Preparing
6b183c62e3d7: Preparing
882fd36bfd35: Preparing
d1dec9917839: Preparing
d38adf39e1dd: Preparing
4ed121b04368: Preparing
d9d07d703dd5: Preparing
e93879aa10b0: Waiting
1569e0d95ce6: Waiting
d9e08da15d0c: Waiting
6c621a24ac02: Waiting
42cabb076e60: Waiting
f5d161bba139: Waiting
4330bba1d897: Waiting
10f41d3d8cb1: Waiting
d38adf39e1dd: Waiting
d567ac532f07: Waiting
d9d07d703dd5: Waiting
6b183c62e3d7: Waiting
d1dec9917839: Waiting
b6a22495adf4: Waiting
6542139d41e1: Waiting
04af0a567f1e: Waiting
882fd36bfd35: Waiting
4ed121b04368: Waiting
4a0470db3f99: Pushed
26d2f3e74403: Pushed
0d6eeb738100: Pushed
67bb86f42c60: Pushed
e5e43964020b: Pushed
6542139d41e1: Pushed
b6a22495adf4: Pushed
d567ac532f07: Pushed
4330bba1d897: Pushed
10f41d3d8cb1: Pushed
f5d161bba139: Layer already exists
1569e0d95ce6: Layer already exists
d9e08da15d0c: Layer already exists
6b183c62e3d7: Layer already exists
882fd36bfd35: Layer already exists
d1dec9917839: Layer already exists
e93879aa10b0: Pushed
d38adf39e1dd: Layer already exists
4ed121b04368: Layer already exists
d9d07d703dd5: Layer already exists
6c621a24ac02: Pushed
04af0a567f1e: Pushed
42cabb076e60: Pushed
name unknown: Failed to get blob sizes.
> Task :runners:google-cloud-dataflow-java:buildAndPushDockerPythonContainer FAILED
> Task :runners:google-cloud-dataflow-java:validatesCrossLanguageRunnerSetup
Launching Java expansion service @ 37171
Launching Python expansion service @ 39215
> Task :runners:google-cloud-dataflow-java:validatesCrossLanguageRunnerCleanup
Stopping expansion service pid: 1316965.
Stopping expansion service pid: 1316966.
FAILURE: Build failed with an exception.
* Where:
Build file '<https://ci-beam.apache.org/job/beam_PostCommit_XVR_PythonUsingJava_Dataflow/ws/src/runners/google-cloud-dataflow-java/build.gradle'> line: 330
* What went wrong:
Execution failed for task ':runners:google-cloud-dataflow-java:buildAndPushDockerPythonContainer'.
> Process 'command 'gcloud'' finished with non-zero exit value 1
* Try:
> Run with --stacktrace option to get the stack trace.
> Run with --info or --debug option to get more log output.
* Get more help at https://help.gradle.org
Deprecated Gradle features were used in this build, making it incompatible with Gradle 8.0.
You can use '--warning-mode all' to show the individual deprecation warnings and determine if they come from your own scripts or plugins.
See https://docs.gradle.org/7.5.1/userguide/command_line_interface.html#sec:command_line_warnings
Execution optimizations have been disabled for 1 invalid unit(s) of work during this build to ensure correctness.
Please consult deprecation warnings for more details.
BUILD FAILED in 11m 53s
126 actionable tasks: 22 executed, 104 up-to-date
Publishing build scan...
https://gradle.com/s/exnrg6te3lsla
Build step 'Invoke Gradle script' changed build result to FAILURE
Build step 'Invoke Gradle script' marked build as failure
---------------------------------------------------------------------
To unsubscribe, e-mail: builds-unsubscribe@beam.apache.org
For additional commands, e-mail: builds-help@beam.apache.org