You are viewing a plain text version of this content. The canonical link for it is here.
Posted to builds@solr.apache.org by Apache Jenkins Server <je...@builds.apache.org> on 2024/02/10 16:29:50 UTC
[JENKINS] Lucene » Lucene-Solr-Tests-8.11 - Build # 525 - Still Unstable!
Build: https://ci-builds.apache.org/job/Lucene/job/Lucene-Solr-Tests-8.11/525/
3 tests failed.
FAILED: org.apache.solr.cloud.api.collections.ShardSplitTest.testSplitMixedReplicaTypesLink
Error Message:
Timeout occurred while waiting response from server at: http://127.0.0.1:32853
Stack Trace:
org.apache.solr.client.solrj.SolrServerException: Timeout occurred while waiting response from server at: http://127.0.0.1:32853
at __randomizedtesting.SeedInfo.seed([48C24EB070DBE3BF:74AC87E9D5034826]:0)
at org.apache.solr.client.solrj.impl.HttpSolrClient.executeMethod(HttpSolrClient.java:692)
at org.apache.solr.client.solrj.impl.HttpSolrClient.request(HttpSolrClient.java:266)
at org.apache.solr.client.solrj.impl.HttpSolrClient.request(HttpSolrClient.java:248)
at org.apache.solr.client.solrj.impl.LBSolrClient.doRequest(LBSolrClient.java:369)
at org.apache.solr.client.solrj.impl.LBSolrClient.request(LBSolrClient.java:297)
at org.apache.solr.client.solrj.impl.BaseCloudSolrClient.sendRequest(BaseCloudSolrClient.java:1188)
at org.apache.solr.client.solrj.impl.BaseCloudSolrClient.requestWithRetryOnStaleState(BaseCloudSolrClient.java:934)
at org.apache.solr.client.solrj.impl.BaseCloudSolrClient.request(BaseCloudSolrClient.java:866)
at org.apache.solr.client.solrj.SolrRequest.process(SolrRequest.java:225)
at org.apache.solr.client.solrj.SolrRequest.process(SolrRequest.java:242)
at org.apache.solr.cloud.api.collections.ShardSplitTest.doSplitMixedReplicaTypes(ShardSplitTest.java:365)
at org.apache.solr.cloud.api.collections.ShardSplitTest.testSplitMixedReplicaTypesLink(ShardSplitTest.java:356)
at sun.reflect.NativeMethodAccessorImpl.invoke0(Native Method)
at sun.reflect.NativeMethodAccessorImpl.invoke(NativeMethodAccessorImpl.java:62)
at sun.reflect.DelegatingMethodAccessorImpl.invoke(DelegatingMethodAccessorImpl.java:43)
at java.lang.reflect.Method.invoke(Method.java:498)
at com.carrotsearch.randomizedtesting.RandomizedRunner.invoke(RandomizedRunner.java:1758)
at com.carrotsearch.randomizedtesting.RandomizedRunner$8.evaluate(RandomizedRunner.java:946)
at com.carrotsearch.randomizedtesting.RandomizedRunner$9.evaluate(RandomizedRunner.java:982)
at com.carrotsearch.randomizedtesting.RandomizedRunner$10.evaluate(RandomizedRunner.java:996)
at org.apache.solr.BaseDistributedSearchTestCase$ShardsRepeatRule$ShardsFixedStatement.callStatement(BaseDistributedSearchTestCase.java:1084)
at org.apache.solr.BaseDistributedSearchTestCase$ShardsRepeatRule$ShardsStatement.evaluate(BaseDistributedSearchTestCase.java:1055)
at com.carrotsearch.randomizedtesting.rules.SystemPropertiesRestoreRule$1.evaluate(SystemPropertiesRestoreRule.java:80)
at org.junit.rules.RunRules.evaluate(RunRules.java:20)
at org.apache.lucene.util.TestRuleSetupTeardownChained$1.evaluate(TestRuleSetupTeardownChained.java:49)
at org.apache.lucene.util.AbstractBeforeAfterRule$1.evaluate(AbstractBeforeAfterRule.java:45)
at org.apache.lucene.util.TestRuleThreadAndTestName$1.evaluate(TestRuleThreadAndTestName.java:48)
at org.apache.lucene.util.TestRuleIgnoreAfterMaxFailures$1.evaluate(TestRuleIgnoreAfterMaxFailures.java:64)
at org.apache.lucene.util.TestRuleMarkFailure$1.evaluate(TestRuleMarkFailure.java:47)
at org.junit.rules.RunRules.evaluate(RunRules.java:20)
at com.carrotsearch.randomizedtesting.rules.StatementAdapter.evaluate(StatementAdapter.java:36)
at com.carrotsearch.randomizedtesting.ThreadLeakControl$StatementRunner.run(ThreadLeakControl.java:390)
at com.carrotsearch.randomizedtesting.ThreadLeakControl.forkTimeoutingTask(ThreadLeakControl.java:843)
at com.carrotsearch.randomizedtesting.ThreadLeakControl$3.evaluate(ThreadLeakControl.java:490)
at com.carrotsearch.randomizedtesting.RandomizedRunner.runSingleTest(RandomizedRunner.java:955)
at com.carrotsearch.randomizedtesting.RandomizedRunner$5.evaluate(RandomizedRunner.java:840)
at com.carrotsearch.randomizedtesting.RandomizedRunner$6.evaluate(RandomizedRunner.java:891)
at com.carrotsearch.randomizedtesting.RandomizedRunner$7.evaluate(RandomizedRunner.java:902)
at com.carrotsearch.randomizedtesting.rules.StatementAdapter.evaluate(StatementAdapter.java:36)
at com.carrotsearch.randomizedtesting.rules.SystemPropertiesRestoreRule$1.evaluate(SystemPropertiesRestoreRule.java:80)
at org.junit.rules.RunRules.evaluate(RunRules.java:20)
at org.apache.lucene.util.AbstractBeforeAfterRule$1.evaluate(AbstractBeforeAfterRule.java:45)
at com.carrotsearch.randomizedtesting.rules.StatementAdapter.evaluate(StatementAdapter.java:36)
at org.apache.lucene.util.TestRuleStoreClassName$1.evaluate(TestRuleStoreClassName.java:41)
at com.carrotsearch.randomizedtesting.rules.NoShadowingOrOverridesOnMethodsRule$1.evaluate(NoShadowingOrOverridesOnMethodsRule.java:40)
at com.carrotsearch.randomizedtesting.rules.NoShadowingOrOverridesOnMethodsRule$1.evaluate(NoShadowingOrOverridesOnMethodsRule.java:40)
at com.carrotsearch.randomizedtesting.rules.StatementAdapter.evaluate(StatementAdapter.java:36)
at com.carrotsearch.randomizedtesting.rules.StatementAdapter.evaluate(StatementAdapter.java:36)
at com.carrotsearch.randomizedtesting.rules.StatementAdapter.evaluate(StatementAdapter.java:36)
at org.apache.lucene.util.TestRuleAssertionsRequired$1.evaluate(TestRuleAssertionsRequired.java:53)
at org.apache.lucene.util.TestRuleMarkFailure$1.evaluate(TestRuleMarkFailure.java:47)
at org.apache.lucene.util.TestRuleIgnoreAfterMaxFailures$1.evaluate(TestRuleIgnoreAfterMaxFailures.java:64)
at org.apache.lucene.util.TestRuleIgnoreTestSuites$1.evaluate(TestRuleIgnoreTestSuites.java:54)
at org.junit.rules.RunRules.evaluate(RunRules.java:20)
at com.carrotsearch.randomizedtesting.rules.StatementAdapter.evaluate(StatementAdapter.java:36)
at com.carrotsearch.randomizedtesting.ThreadLeakControl$StatementRunner.run(ThreadLeakControl.java:390)
at com.carrotsearch.randomizedtesting.ThreadLeakControl.lambda$forkTimeoutingTask$0(ThreadLeakControl.java:850)
at java.lang.Thread.run(Thread.java:750)
Caused by: java.net.SocketTimeoutException: Read timed out
at java.net.SocketInputStream.socketRead0(Native Method)
at java.net.SocketInputStream.socketRead(SocketInputStream.java:116)
at java.net.SocketInputStream.read(SocketInputStream.java:171)
at java.net.SocketInputStream.read(SocketInputStream.java:141)
at org.apache.http.impl.io.SessionInputBufferImpl.streamRead(SessionInputBufferImpl.java:137)
at org.apache.http.impl.io.SessionInputBufferImpl.fillBuffer(SessionInputBufferImpl.java:153)
at org.apache.http.impl.io.SessionInputBufferImpl.readLine(SessionInputBufferImpl.java:280)
at org.apache.http.impl.conn.DefaultHttpResponseParser.parseHead(DefaultHttpResponseParser.java:138)
at org.apache.http.impl.conn.DefaultHttpResponseParser.parseHead(DefaultHttpResponseParser.java:56)
at org.apache.http.impl.io.AbstractMessageParser.parse(AbstractMessageParser.java:259)
at org.apache.http.impl.DefaultBHttpClientConnection.receiveResponseHeader(DefaultBHttpClientConnection.java:163)
at org.apache.http.impl.conn.CPoolProxy.receiveResponseHeader(CPoolProxy.java:157)
at org.apache.http.protocol.HttpRequestExecutor.doReceiveResponse(HttpRequestExecutor.java:273)
at org.apache.http.protocol.HttpRequestExecutor.execute(HttpRequestExecutor.java:125)
at org.apache.http.impl.execchain.MainClientExec.execute(MainClientExec.java:272)
at org.apache.http.impl.execchain.ProtocolExec.execute(ProtocolExec.java:186)
at org.apache.http.impl.execchain.RetryExec.execute(RetryExec.java:89)
at org.apache.http.impl.execchain.RedirectExec.execute(RedirectExec.java:110)
at org.apache.http.impl.client.InternalHttpClient.doExecute(InternalHttpClient.java:185)
at org.apache.http.impl.client.CloseableHttpClient.execute(CloseableHttpClient.java:83)
at org.apache.http.impl.client.CloseableHttpClient.execute(CloseableHttpClient.java:56)
at org.apache.solr.client.solrj.impl.HttpSolrClient.executeMethod(HttpSolrClient.java:571)
... 57 more
FAILED: junit.framework.TestSuite.org.apache.solr.cloud.hdfs.HDFSCollectionsAPITest
Error Message:
1 thread leaked from SUITE scope at org.apache.solr.cloud.hdfs.HDFSCollectionsAPITest: 1) Thread[id=5571, name=Command processor, state=WAITING, group=TGRP-HDFSCollectionsAPITest] at sun.misc.Unsafe.park(Native Method) at java.util.concurrent.locks.LockSupport.park(LockSupport.java:175) at java.util.concurrent.locks.AbstractQueuedSynchronizer$ConditionObject.await(AbstractQueuedSynchronizer.java:2039) at java.util.concurrent.LinkedBlockingQueue.take(LinkedBlockingQueue.java:442) at org.apache.hadoop.hdfs.server.datanode.BPServiceActor$CommandProcessingThread.processQueue(BPServiceActor.java:1291) at org.apache.hadoop.hdfs.server.datanode.BPServiceActor$CommandProcessingThread.run(BPServiceActor.java:1275)
Stack Trace:
com.carrotsearch.randomizedtesting.ThreadLeakError: 1 thread leaked from SUITE scope at org.apache.solr.cloud.hdfs.HDFSCollectionsAPITest:
1) Thread[id=5571, name=Command processor, state=WAITING, group=TGRP-HDFSCollectionsAPITest]
at sun.misc.Unsafe.park(Native Method)
at java.util.concurrent.locks.LockSupport.park(LockSupport.java:175)
at java.util.concurrent.locks.AbstractQueuedSynchronizer$ConditionObject.await(AbstractQueuedSynchronizer.java:2039)
at java.util.concurrent.LinkedBlockingQueue.take(LinkedBlockingQueue.java:442)
at org.apache.hadoop.hdfs.server.datanode.BPServiceActor$CommandProcessingThread.processQueue(BPServiceActor.java:1291)
at org.apache.hadoop.hdfs.server.datanode.BPServiceActor$CommandProcessingThread.run(BPServiceActor.java:1275)
at __randomizedtesting.SeedInfo.seed([48C24EB070DBE3BF]:0)
FAILED: junit.framework.TestSuite.org.apache.solr.update.TestHdfsUpdateLog
Error Message:
1 thread leaked from SUITE scope at org.apache.solr.update.TestHdfsUpdateLog: 1) Thread[id=2294, name=Command processor, state=WAITING, group=TGRP-TestHdfsUpdateLog] at sun.misc.Unsafe.park(Native Method) at java.util.concurrent.locks.LockSupport.park(LockSupport.java:175) at java.util.concurrent.locks.AbstractQueuedSynchronizer$ConditionObject.await(AbstractQueuedSynchronizer.java:2039) at java.util.concurrent.LinkedBlockingQueue.take(LinkedBlockingQueue.java:442) at org.apache.hadoop.hdfs.server.datanode.BPServiceActor$CommandProcessingThread.processQueue(BPServiceActor.java:1291) at org.apache.hadoop.hdfs.server.datanode.BPServiceActor$CommandProcessingThread.run(BPServiceActor.java:1275)
Stack Trace:
com.carrotsearch.randomizedtesting.ThreadLeakError: 1 thread leaked from SUITE scope at org.apache.solr.update.TestHdfsUpdateLog:
1) Thread[id=2294, name=Command processor, state=WAITING, group=TGRP-TestHdfsUpdateLog]
at sun.misc.Unsafe.park(Native Method)
at java.util.concurrent.locks.LockSupport.park(LockSupport.java:175)
at java.util.concurrent.locks.AbstractQueuedSynchronizer$ConditionObject.await(AbstractQueuedSynchronizer.java:2039)
at java.util.concurrent.LinkedBlockingQueue.take(LinkedBlockingQueue.java:442)
at org.apache.hadoop.hdfs.server.datanode.BPServiceActor$CommandProcessingThread.processQueue(BPServiceActor.java:1291)
at org.apache.hadoop.hdfs.server.datanode.BPServiceActor$CommandProcessingThread.run(BPServiceActor.java:1275)
at __randomizedtesting.SeedInfo.seed([48C24EB070DBE3BF]:0)
Build Log:
[...truncated 13629 lines...]
[junit4] Suite: org.apache.solr.update.TestHdfsUpdateLog
[junit4] 2> 139415 INFO (SUITE-TestHdfsUpdateLog-seed#[48C24EB070DBE3BF]-worker) [ ] o.a.s.SolrTestCase Setting 'solr.default.confdir' system property to test-framework derived value of '/home/jenkins/jenkins-slave/workspace/Lucene/Lucene-Solr-Tests-8.11/solr/server/solr/configsets/_default/conf'
[junit4] 2> 139415 INFO (SUITE-TestHdfsUpdateLog-seed#[48C24EB070DBE3BF]-worker) [ ] o.a.s.SolrTestCaseJ4 SecureRandom sanity checks: test.solr.allowed.securerandom=null & java.security.egd=file:/dev/./urandom
[junit4] 2> 139416 INFO (SUITE-TestHdfsUpdateLog-seed#[48C24EB070DBE3BF]-worker) [ ] o.a.s.u.ErrorLogMuter Closing ErrorLogMuter-regex-14 after mutting 0 log messages
[junit4] 2> 139416 INFO (SUITE-TestHdfsUpdateLog-seed#[48C24EB070DBE3BF]-worker) [ ] o.a.s.u.ErrorLogMuter Creating ErrorLogMuter-regex-15 for ERROR logs matching regex: ignore_exception
[junit4] 2> 139417 INFO (SUITE-TestHdfsUpdateLog-seed#[48C24EB070DBE3BF]-worker) [ ] o.a.s.SolrTestCaseJ4 Created dataDir: /home/jenkins/jenkins-slave/workspace/Lucene/Lucene-Solr-Tests-8.11/solr/build/solr-core/test/J3/temp/solr.update.TestHdfsUpdateLog_48C24EB070DBE3BF-001/data-dir-3-001
[junit4] 2> 139417 WARN (SUITE-TestHdfsUpdateLog-seed#[48C24EB070DBE3BF]-worker) [ ] o.a.s.SolrTestCaseJ4 startTrackingSearchers: numOpens=33 numCloses=33
[junit4] 2> 139417 INFO (SUITE-TestHdfsUpdateLog-seed#[48C24EB070DBE3BF]-worker) [ ] o.a.s.SolrTestCaseJ4 Using PointFields (NUMERIC_POINTS_SYSPROP=true) w/NUMERIC_DOCVALUES_SYSPROP=false
[junit4] 2> 139419 INFO (SUITE-TestHdfsUpdateLog-seed#[48C24EB070DBE3BF]-worker) [ ] o.a.s.SolrTestCaseJ4 Randomized ssl (false) and clientAuth (true) via: @org.apache.solr.util.RandomizeSSL(reason=, ssl=NaN, value=NaN, clientAuth=NaN)
[junit4] 1> Formatting using clusterid: testClusterID
[junit4] 2> 139887 WARN (SUITE-TestHdfsUpdateLog-seed#[48C24EB070DBE3BF]-worker) [ ] o.a.h.s.a.s.AuthenticationFilter Unable to initialize FileSignerSecretProvider, falling back to use random secrets. Reason: access denied ("java.io.FilePermission" "/home/jenkins/hadoop-http-auth-signature-secret" "read")
[junit4] 2> 139889 WARN (SUITE-TestHdfsUpdateLog-seed#[48C24EB070DBE3BF]-worker) [ ] o.a.h.h.HttpRequestLog Jetty request log can only be enabled using Log4j
[junit4] 2> 139891 INFO (SUITE-TestHdfsUpdateLog-seed#[48C24EB070DBE3BF]-worker) [ ] o.e.j.s.Server jetty-9.4.53.v20231009; built: 2023-10-09T12:29:09.265Z; git: 27bde00a0b95a1d5bbee0eae7984f891d2d0f8c9; jvm 1.8.0_362-b09
[junit4] 2> 139892 INFO (SUITE-TestHdfsUpdateLog-seed#[48C24EB070DBE3BF]-worker) [ ] o.e.j.s.session DefaultSessionIdManager workerName=node0
[junit4] 2> 139892 INFO (SUITE-TestHdfsUpdateLog-seed#[48C24EB070DBE3BF]-worker) [ ] o.e.j.s.session No SessionScavenger set, using defaults
[junit4] 2> 139892 INFO (SUITE-TestHdfsUpdateLog-seed#[48C24EB070DBE3BF]-worker) [ ] o.e.j.s.session node0 Scavenging every 660000ms
[junit4] 2> 139893 INFO (SUITE-TestHdfsUpdateLog-seed#[48C24EB070DBE3BF]-worker) [ ] o.e.j.s.h.ContextHandler Started o.e.j.s.ServletContextHandler@5c00b059{static,/static,jar:file:/home/jenkins/.ivy2/cache/org.apache.hadoop/hadoop-hdfs/tests/hadoop-hdfs-3.2.4-tests.jar!/webapps/static,AVAILABLE}
[junit4] 2> 140008 INFO (SUITE-TestHdfsUpdateLog-seed#[48C24EB070DBE3BF]-worker) [ ] o.e.j.s.h.ContextHandler Started o.e.j.w.WebAppContext@71808637{hdfs,/,file:///home/jenkins/jenkins-slave/workspace/Lucene/Lucene-Solr-Tests-8.11/solr/build/solr-core/test/J3/temp/jetty-localhost-44875-hadoop-hdfs-3_2_4-tests_jar-_-any-3782985261614590160/webapp/,AVAILABLE}{jar:file:/home/jenkins/.ivy2/cache/org.apache.hadoop/hadoop-hdfs/tests/hadoop-hdfs-3.2.4-tests.jar!/webapps/hdfs}
[junit4] 2> 140009 INFO (SUITE-TestHdfsUpdateLog-seed#[48C24EB070DBE3BF]-worker) [ ] o.e.j.s.AbstractConnector Started ServerConnector@103f0465{HTTP/1.1, (http/1.1)}{localhost:44875}
[junit4] 2> 140009 INFO (SUITE-TestHdfsUpdateLog-seed#[48C24EB070DBE3BF]-worker) [ ] o.e.j.s.Server Started @140034ms
[junit4] 2> 140096 WARN (Listener at localhost/38339) [ ] o.a.h.s.a.s.AuthenticationFilter Unable to initialize FileSignerSecretProvider, falling back to use random secrets. Reason: access denied ("java.io.FilePermission" "/home/jenkins/hadoop-http-auth-signature-secret" "read")
[junit4] 2> 140097 WARN (Listener at localhost/38339) [ ] o.a.h.h.HttpRequestLog Jetty request log can only be enabled using Log4j
[junit4] 2> 140098 INFO (Listener at localhost/38339) [ ] o.e.j.s.Server jetty-9.4.53.v20231009; built: 2023-10-09T12:29:09.265Z; git: 27bde00a0b95a1d5bbee0eae7984f891d2d0f8c9; jvm 1.8.0_362-b09
[junit4] 2> 140099 INFO (Listener at localhost/38339) [ ] o.e.j.s.session DefaultSessionIdManager workerName=node0
[junit4] 2> 140099 INFO (Listener at localhost/38339) [ ] o.e.j.s.session No SessionScavenger set, using defaults
[junit4] 2> 140099 INFO (Listener at localhost/38339) [ ] o.e.j.s.session node0 Scavenging every 600000ms
[junit4] 2> 140100 INFO (Listener at localhost/38339) [ ] o.e.j.s.h.ContextHandler Started o.e.j.s.ServletContextHandler@594e2645{static,/static,jar:file:/home/jenkins/.ivy2/cache/org.apache.hadoop/hadoop-hdfs/tests/hadoop-hdfs-3.2.4-tests.jar!/webapps/static,AVAILABLE}
[junit4] 2> 140223 INFO (Listener at localhost/38339) [ ] o.e.j.s.h.ContextHandler Started o.e.j.w.WebAppContext@68eacca3{datanode,/,file:///home/jenkins/jenkins-slave/workspace/Lucene/Lucene-Solr-Tests-8.11/solr/build/solr-core/test/J3/temp/jetty-localhost-45783-hadoop-hdfs-3_2_4-tests_jar-_-any-2877589054368002289/webapp/,AVAILABLE}{jar:file:/home/jenkins/.ivy2/cache/org.apache.hadoop/hadoop-hdfs/tests/hadoop-hdfs-3.2.4-tests.jar!/webapps/datanode}
[junit4] 2> 140224 INFO (Listener at localhost/38339) [ ] o.e.j.s.AbstractConnector Started ServerConnector@46d607d9{HTTP/1.1, (http/1.1)}{localhost:45783}
[junit4] 2> 140224 INFO (Listener at localhost/38339) [ ] o.e.j.s.Server Started @140249ms
[junit4] 2> 140262 WARN (Listener at localhost/40191) [ ] o.a.h.s.a.s.AuthenticationFilter Unable to initialize FileSignerSecretProvider, falling back to use random secrets. Reason: access denied ("java.io.FilePermission" "/home/jenkins/hadoop-http-auth-signature-secret" "read")
[junit4] 2> 140262 WARN (Listener at localhost/40191) [ ] o.a.h.h.HttpRequestLog Jetty request log can only be enabled using Log4j
[junit4] 2> 140264 INFO (Listener at localhost/40191) [ ] o.e.j.s.Server jetty-9.4.53.v20231009; built: 2023-10-09T12:29:09.265Z; git: 27bde00a0b95a1d5bbee0eae7984f891d2d0f8c9; jvm 1.8.0_362-b09
[junit4] 2> 140265 INFO (Listener at localhost/40191) [ ] o.e.j.s.session DefaultSessionIdManager workerName=node0
[junit4] 2> 140265 INFO (Listener at localhost/40191) [ ] o.e.j.s.session No SessionScavenger set, using defaults
[junit4] 2> 140265 INFO (Listener at localhost/40191) [ ] o.e.j.s.session node0 Scavenging every 600000ms
[junit4] 2> 140266 INFO (Listener at localhost/40191) [ ] o.e.j.s.h.ContextHandler Started o.e.j.s.ServletContextHandler@33e2c83b{static,/static,jar:file:/home/jenkins/.ivy2/cache/org.apache.hadoop/hadoop-hdfs/tests/hadoop-hdfs-3.2.4-tests.jar!/webapps/static,AVAILABLE}
[junit4] 2> 140949 INFO (Listener at localhost/40191) [ ] o.e.j.s.h.ContextHandler Started o.e.j.w.WebAppContext@69c5b115{datanode,/,file:///home/jenkins/jenkins-slave/workspace/Lucene/Lucene-Solr-Tests-8.11/solr/build/solr-core/test/J3/temp/jetty-localhost-35357-hadoop-hdfs-3_2_4-tests_jar-_-any-2967049860377881441/webapp/,AVAILABLE}{jar:file:/home/jenkins/.ivy2/cache/org.apache.hadoop/hadoop-hdfs/tests/hadoop-hdfs-3.2.4-tests.jar!/webapps/datanode}
[junit4] 2> 140953 INFO (Listener at localhost/40191) [ ] o.e.j.s.AbstractConnector Started ServerConnector@569229ba{HTTP/1.1, (http/1.1)}{localhost:35357}
[junit4] 2> 140953 INFO (Listener at localhost/40191) [ ] o.e.j.s.Server Started @140978ms
[junit4] 2> 141000 INFO (Block report processor) [ ] BlockStateChange BLOCK* processReport 0xebd7bca7ee484bfb: Processing first storage report for DS-e63c3a3e-ddc2-4a1f-afb9-92bbb263a8e8 from datanode DatanodeRegistration(127.0.0.1:38537, datanodeUuid=d44695ff-d0d9-4c9d-b79f-1a2c973f86fe, infoPort=42949, infoSecurePort=0, ipcPort=40191, storageInfo=lv=-57;cid=testClusterID;nsid=1941849053;c=1707578868308)
[junit4] 2> 141000 INFO (Block report processor) [ ] BlockStateChange BLOCK* processReport 0xebd7bca7ee484bfb: from storage DS-e63c3a3e-ddc2-4a1f-afb9-92bbb263a8e8 node DatanodeRegistration(127.0.0.1:38537, datanodeUuid=d44695ff-d0d9-4c9d-b79f-1a2c973f86fe, infoPort=42949, infoSecurePort=0, ipcPort=40191, storageInfo=lv=-57;cid=testClusterID;nsid=1941849053;c=1707578868308), blocks: 0, hasStaleStorage: true, processing time: 0 msecs, invalidatedBlocks: 0
[junit4] 2> 141000 INFO (Block report processor) [ ] BlockStateChange BLOCK* processReport 0xebd7bca7ee484bfb: Processing first storage report for DS-f03b9905-cb04-44d1-8410-f3f3886e235e from datanode DatanodeRegistration(127.0.0.1:38537, datanodeUuid=d44695ff-d0d9-4c9d-b79f-1a2c973f86fe, infoPort=42949, infoSecurePort=0, ipcPort=40191, storageInfo=lv=-57;cid=testClusterID;nsid=1941849053;c=1707578868308)
[junit4] 2> 141000 INFO (Block report processor) [ ] BlockStateChange BLOCK* processReport 0xebd7bca7ee484bfb: from storage DS-f03b9905-cb04-44d1-8410-f3f3886e235e node DatanodeRegistration(127.0.0.1:38537, datanodeUuid=d44695ff-d0d9-4c9d-b79f-1a2c973f86fe, infoPort=42949, infoSecurePort=0, ipcPort=40191, storageInfo=lv=-57;cid=testClusterID;nsid=1941849053;c=1707578868308), blocks: 0, hasStaleStorage: false, processing time: 0 msecs, invalidatedBlocks: 0
[junit4] 2> 141080 INFO (Block report processor) [ ] BlockStateChange BLOCK* processReport 0xe1acc95d9d506b14: Processing first storage report for DS-5afeaf8a-1d86-41e2-a21c-1c18adec2ab6 from datanode DatanodeRegistration(127.0.0.1:45633, datanodeUuid=5a8568bc-daf0-42d4-aedf-ee2e3d40a6d3, infoPort=46263, infoSecurePort=0, ipcPort=33049, storageInfo=lv=-57;cid=testClusterID;nsid=1941849053;c=1707578868308)
[junit4] 2> 141081 INFO (Block report processor) [ ] BlockStateChange BLOCK* processReport 0xe1acc95d9d506b14: from storage DS-5afeaf8a-1d86-41e2-a21c-1c18adec2ab6 node DatanodeRegistration(127.0.0.1:45633, datanodeUuid=5a8568bc-daf0-42d4-aedf-ee2e3d40a6d3, infoPort=46263, infoSecurePort=0, ipcPort=33049, storageInfo=lv=-57;cid=testClusterID;nsid=1941849053;c=1707578868308), blocks: 0, hasStaleStorage: true, processing time: 0 msecs, invalidatedBlocks: 0
[junit4] 2> 141081 INFO (Block report processor) [ ] BlockStateChange BLOCK* processReport 0xe1acc95d9d506b14: Processing first storage report for DS-4a7fd0fe-55f3-4c71-8085-c13658c56f3b from datanode DatanodeRegistration(127.0.0.1:45633, datanodeUuid=5a8568bc-daf0-42d4-aedf-ee2e3d40a6d3, infoPort=46263, infoSecurePort=0, ipcPort=33049, storageInfo=lv=-57;cid=testClusterID;nsid=1941849053;c=1707578868308)
[junit4] 2> 141081 INFO (Block report processor) [ ] BlockStateChange BLOCK* processReport 0xe1acc95d9d506b14: from storage DS-4a7fd0fe-55f3-4c71-8085-c13658c56f3b node DatanodeRegistration(127.0.0.1:45633, datanodeUuid=5a8568bc-daf0-42d4-aedf-ee2e3d40a6d3, infoPort=46263, infoSecurePort=0, ipcPort=33049, storageInfo=lv=-57;cid=testClusterID;nsid=1941849053;c=1707578868308), blocks: 0, hasStaleStorage: false, processing time: 0 msecs, invalidatedBlocks: 0
[junit4] 2> 141111 INFO (Listener at localhost/33049) [ ] o.a.s.SolrTestCaseJ4 ####initCore
[junit4] 2> 141119 INFO (Listener at localhost/33049) [ ] o.a.s.c.SolrResourceLoader Added 2 libs to classloader, from paths: [/home/jenkins/jenkins-slave/workspace/Lucene/Lucene-Solr-Tests-8.11/solr/core/src/test-files/solr/collection1/lib, /home/jenkins/jenkins-slave/workspace/Lucene/Lucene-Solr-Tests-8.11/solr/core/src/test-files/solr/collection1/lib/classes]
[junit4] 2> 141134 INFO (Listener at localhost/33049) [ ] o.a.s.c.SolrConfig Using Lucene MatchVersion: 8.11.4
[junit4] 2> 141134 WARN (Listener at localhost/33049) [ ] o.a.s.c.SolrConfig solrconfig.xml: <jmx> is no longer supported, use solr.xml:/metrics/reporter section instead
[junit4] 2> 141141 INFO (Listener at localhost/33049) [ ] o.a.s.s.IndexSchema Schema name=test
[junit4] 2> 141160 INFO (Listener at localhost/33049) [ ] o.a.s.s.IndexSchema Loaded schema test/1.6 with uniqueid field id
[junit4] 2> 142682 WARN (Listener at localhost/33049) [ ] o.a.s.c.CoreContainer Unable to create [/home/jenkins/jenkins-slave/workspace/Lucene/Lucene-Solr-Tests-8.11/solr/core/src/test-files/solr/userfiles]. Features requiring this directory may fail.
[junit4] 2> => java.security.AccessControlException: access denied ("java.io.FilePermission" "/home/jenkins/jenkins-slave/workspace/Lucene/Lucene-Solr-Tests-8.11/solr/core/src/test-files/solr/userfiles" "write")
[junit4] 2> at java.security.AccessControlContext.checkPermission(AccessControlContext.java:472)
[junit4] 2> java.security.AccessControlException: access denied ("java.io.FilePermission" "/home/jenkins/jenkins-slave/workspace/Lucene/Lucene-Solr-Tests-8.11/solr/core/src/test-files/solr/userfiles" "write")
[junit4] 2> at java.security.AccessControlContext.checkPermission(AccessControlContext.java:472) ~[?:1.8.0_362]
[junit4] 2> at java.security.AccessController.checkPermission(AccessController.java:886) ~[?:1.8.0_362]
[junit4] 2> at java.lang.SecurityManager.checkPermission(SecurityManager.java:549) ~[?:1.8.0_362]
[junit4] 2> at java.lang.SecurityManager.checkWrite(SecurityManager.java:979) ~[?:1.8.0_362]
[junit4] 2> at sun.nio.fs.UnixPath.checkWrite(UnixPath.java:801) ~[?:?]
[junit4] 2> at sun.nio.fs.UnixFileSystemProvider.createDirectory(UnixFileSystemProvider.java:376) ~[?:?]
[junit4] 2> at java.nio.file.Files.createDirectory(Files.java:674) ~[?:1.8.0_362]
[junit4] 2> at java.nio.file.Files.createAndCheckIsDirectory(Files.java:781) ~[?:1.8.0_362]
[junit4] 2> at java.nio.file.Files.createDirectories(Files.java:727) ~[?:1.8.0_362]
[junit4] 2> at org.apache.solr.core.CoreContainer.<init>(CoreContainer.java:379) ~[java/:?]
[junit4] 2> at org.apache.solr.core.CoreContainer.<init>(CoreContainer.java:344) ~[java/:?]
[junit4] 2> at org.apache.solr.util.TestHarness.<init>(TestHarness.java:183) ~[java/:?]
[junit4] 2> at org.apache.solr.util.TestHarness.<init>(TestHarness.java:156) ~[java/:?]
[junit4] 2> at org.apache.solr.util.TestHarness.<init>(TestHarness.java:162) ~[java/:?]
[junit4] 2> at org.apache.solr.util.TestHarness.<init>(TestHarness.java:112) ~[java/:?]
[junit4] 2> at org.apache.solr.SolrTestCaseJ4.createCore(SolrTestCaseJ4.java:840) ~[java/:?]
[junit4] 2> at org.apache.solr.SolrTestCaseJ4.initCore(SolrTestCaseJ4.java:830) ~[java/:?]
[junit4] 2> at org.apache.solr.SolrTestCaseJ4.initCore(SolrTestCaseJ4.java:677) ~[java/:?]
[junit4] 2> at org.apache.solr.SolrTestCaseJ4.initCore(SolrTestCaseJ4.java:666) ~[java/:?]
[junit4] 2> at org.apache.solr.update.TestHdfsUpdateLog.beforeClass(TestHdfsUpdateLog.java:64) ~[test/:?]
[junit4] 2> at sun.reflect.NativeMethodAccessorImpl.invoke0(Native Method) ~[?:1.8.0_362]
[junit4] 2> at sun.reflect.NativeMethodAccessorImpl.invoke(NativeMethodAccessorImpl.java:62) ~[?:1.8.0_362]
[junit4] 2> at sun.reflect.DelegatingMethodAccessorImpl.invoke(DelegatingMethodAccessorImpl.java:43) ~[?:1.8.0_362]
[junit4] 2> at java.lang.reflect.Method.invoke(Method.java:498) ~[?:1.8.0_362]
[junit4] 2> at com.carrotsearch.randomizedtesting.RandomizedRunner.invoke(RandomizedRunner.java:1758) ~[randomizedtesting-runner-2.8.1.jar:?]
[junit4] 2> at com.carrotsearch.randomizedtesting.RandomizedRunner$6.evaluate(RandomizedRunner.java:886) ~[randomizedtesting-runner-2.8.1.jar:?]
[junit4] 2> at com.carrotsearch.randomizedtesting.RandomizedRunner$7.evaluate(RandomizedRunner.java:902) ~[randomizedtesting-runner-2.8.1.jar:?]
[junit4] 2> at com.carrotsearch.randomizedtesting.rules.StatementAdapter.evaluate(StatementAdapter.java:36) ~[randomizedtesting-runner-2.8.1.jar:?]
[junit4] 2> at com.carrotsearch.randomizedtesting.rules.SystemPropertiesRestoreRule$1.evaluate(SystemPropertiesRestoreRule.java:80) ~[randomizedtesting-runner-2.8.1.jar:?]
[junit4] 2> at org.junit.rules.RunRules.evaluate(RunRules.java:20) ~[junit-4.13.1.jar:4.13.1]
[junit4] 2> at org.apache.lucene.util.AbstractBeforeAfterRule$1.evaluate(AbstractBeforeAfterRule.java:45) ~[java/:?]
[junit4] 2> at com.carrotsearch.randomizedtesting.rules.StatementAdapter.evaluate(StatementAdapter.java:36) ~[randomizedtesting-runner-2.8.1.jar:?]
[junit4] 2> at org.apache.lucene.util.TestRuleStoreClassName$1.evaluate(TestRuleStoreClassName.java:41) ~[java/:?]
[junit4] 2> at com.carrotsearch.randomizedtesting.rules.NoShadowingOrOverridesOnMethodsRule$1.evaluate(NoShadowingOrOverridesOnMethodsRule.java:40) ~[randomizedtesting-runner-2.8.1.jar:?]
[junit4] 2> at com.carrotsearch.randomizedtesting.rules.NoShadowingOrOverridesOnMethodsRule$1.evaluate(NoShadowingOrOverridesOnMethodsRule.java:40) ~[randomizedtesting-runner-2.8.1.jar:?]
[junit4] 2> at com.carrotsearch.randomizedtesting.rules.StatementAdapter.evaluate(StatementAdapter.java:36) ~[randomizedtesting-runner-2.8.1.jar:?]
[junit4] 2> at com.carrotsearch.randomizedtesting.rules.StatementAdapter.evaluate(StatementAdapter.java:36) ~[randomizedtesting-runner-2.8.1.jar:?]
[junit4] 2> at com.carrotsearch.randomizedtesting.rules.StatementAdapter.evaluate(StatementAdapter.java:36) ~[randomizedtesting-runner-2.8.1.jar:?]
[junit4] 2> at org.apache.lucene.util.TestRuleAssertionsRequired$1.evaluate(TestRuleAssertionsRequired.java:53) ~[java/:?]
[junit4] 2> at org.apache.lucene.util.TestRuleMarkFailure$1.evaluate(TestRuleMarkFailure.java:47) ~[java/:?]
[junit4] 2> at org.apache.lucene.util.TestRuleIgnoreAfterMaxFailures$1.evaluate(TestRuleIgnoreAfterMaxFailures.java:64) ~[java/:?]
[junit4] 2> at org.apache.lucene.util.TestRuleIgnoreTestSuites$1.evaluate(TestRuleIgnoreTestSuites.java:54) ~[java/:?]
[junit4] 2> at org.junit.rules.RunRules.evaluate(RunRules.java:20) ~[junit-4.13.1.jar:4.13.1]
[junit4] 2> at com.carrotsearch.randomizedtesting.rules.StatementAdapter.evaluate(StatementAdapter.java:36) ~[randomizedtesting-runner-2.8.1.jar:?]
[junit4] 2> at com.carrotsearch.randomizedtesting.ThreadLeakControl$StatementRunner.run(ThreadLeakControl.java:390) ~[randomizedtesting-runner-2.8.1.jar:?]
[junit4] 2> at com.carrotsearch.randomizedtesting.ThreadLeakControl.lambda$forkTimeoutingTask$0(ThreadLeakControl.java:850) ~[randomizedtesting-runner-2.8.1.jar:?]
[junit4] 2> at java.lang.Thread.run(Thread.java:750) [?:1.8.0_362]
[junit4] 2> 142683 WARN (Listener at localhost/33049) [ ] o.a.s.f.DistribPackageStore Unable to create [/home/jenkins/jenkins-slave/workspace/Lucene/Lucene-Solr-Tests-8.11/solr/core/src/test-files/solr/filestore] directory in SOLR_HOME [/home/jenkins/jenkins-slave/workspace/Lucene/Lucene-Solr-Tests-8.11/solr/core/src/test-files/solr]. Features requiring this directory may fail.
[junit4] 2> => java.security.AccessControlException: access denied ("java.io.FilePermission" "/home/jenkins/jenkins-slave/workspace/Lucene/Lucene-Solr-Tests-8.11/solr/core/src/test-files/solr/filestore" "write")
[junit4] 2> at java.security.AccessControlContext.checkPermission(AccessControlContext.java:472)
[junit4] 2> java.security.AccessControlException: access denied ("java.io.FilePermission" "/home/jenkins/jenkins-slave/workspace/Lucene/Lucene-Solr-Tests-8.11/solr/core/src/test-files/solr/filestore" "write")
[junit4] 2> at java.security.AccessControlContext.checkPermission(AccessControlContext.java:472) ~[?:1.8.0_362]
[junit4] 2> at java.security.AccessController.checkPermission(AccessController.java:886) ~[?:1.8.0_362]
[junit4] 2> at java.lang.SecurityManager.checkPermission(SecurityManager.java:549) ~[?:1.8.0_362]
[junit4] 2> at java.lang.SecurityManager.checkWrite(SecurityManager.java:979) ~[?:1.8.0_362]
[junit4] 2> at java.io.File.mkdir(File.java:1350) ~[?:1.8.0_362]
[junit4] 2> at java.io.File.mkdirs(File.java:1382) ~[?:1.8.0_362]
[junit4] 2> at org.apache.solr.filestore.DistribPackageStore.ensurePackageStoreDir(DistribPackageStore.java:561) ~[java/:?]
[junit4] 2> at org.apache.solr.filestore.DistribPackageStore.<init>(DistribPackageStore.java:81) ~[java/:?]
[junit4] 2> at org.apache.solr.filestore.PackageStoreAPI.<init>(PackageStoreAPI.java:78) ~[java/:?]
[junit4] 2> at org.apache.solr.core.CoreContainer.load(CoreContainer.java:693) ~[java/:?]
[junit4] 2> at org.apache.solr.util.TestHarness.<init>(TestHarness.java:184) ~[java/:?]
[junit4] 2> at org.apache.solr.util.TestHarness.<init>(TestHarness.java:156) ~[java/:?]
[junit4] 2> at org.apache.solr.util.TestHarness.<init>(TestHarness.java:162) ~[java/:?]
[junit4] 2> at org.apache.solr.util.TestHarness.<init>(TestHarness.java:112) ~[java/:?]
[junit4] 2> at org.apache.solr.SolrTestCaseJ4.createCore(SolrTestCaseJ4.java:840) ~[java/:?]
[junit4] 2> at org.apache.solr.SolrTestCaseJ4.initCore(SolrTestCaseJ4.java:830) ~[java/:?]
[junit4] 2> at org.apache.solr.SolrTestCaseJ4.initCore(SolrTestCaseJ4.java:677) ~[java/:?]
[junit4] 2> at org.apache.solr.SolrTestCaseJ4.initCore(SolrTestCaseJ4.java:666) ~[java/:?]
[junit4] 2> at org.apache.solr.update.TestHdfsUpdateLog.beforeClass(TestHdfsUpdateLog.java:64) ~[test/:?]
[junit4] 2> at sun.reflect.NativeMethodAccessorImpl.invoke0(Native Method) ~[?:1.8.0_362]
[junit4] 2> at sun.reflect.NativeMethodAccessorImpl.invoke(NativeMethodAccessorImpl.java:62) ~[?:1.8.0_362]
[junit4] 2> at sun.reflect.DelegatingMethodAccessorImpl.invoke(DelegatingMethodAccessorImpl.java:43) ~[?:1.8.0_362]
[junit4] 2> at java.lang.reflect.Method.invoke(Method.java:498) ~[?:1.8.0_362]
[junit4] 2> at com.carrotsearch.randomizedtesting.RandomizedRunner.invoke(RandomizedRunner.java:1758) ~[randomizedtesting-runner-2.8.1.jar:?]
[junit4] 2> at com.carrotsearch.randomizedtesting.RandomizedRunner$6.evaluate(RandomizedRunner.java:886) ~[randomizedtesting-runner-2.8.1.jar:?]
[junit4] 2> at com.carrotsearch.randomizedtesting.RandomizedRunner$7.evaluate(RandomizedRunner.java:902) ~[randomizedtesting-runner-2.8.1.jar:?]
[junit4] 2> at com.carrotsearch.randomizedtesting.rules.StatementAdapter.evaluate(StatementAdapter.java:36) ~[randomizedtesting-runner-2.8.1.jar:?]
[junit4] 2> at com.carrotsearch.randomizedtesting.rules.SystemPropertiesRestoreRule$1.evaluate(SystemPropertiesRestoreRule.java:80) ~[randomizedtesting-runner-2.8.1.jar:?]
[junit4] 2> at org.junit.rules.RunRules.evaluate(RunRules.java:20) ~[junit-4.13.1.jar:4.13.1]
[junit4] 2> at org.apache.lucene.util.AbstractBeforeAfterRule$1.evaluate(AbstractBeforeAfterRule.java:45) ~[java/:?]
[junit4] 2> at com.carrotsearch.randomizedtesting.rules.StatementAdapter.evaluate(StatementAdapter.java:36) ~[randomizedtesting-runner-2.8.1.jar:?]
[junit4] 2> at org.apache.lucene.util.TestRuleStoreClassName$1.evaluate(TestRuleStoreClassName.java:41) ~[java/:?]
[junit4] 2> at com.carrotsearch.randomizedtesting.rules.NoShadowingOrOverridesOnMethodsRule$1.evaluate(NoShadowingOrOverridesOnMethodsRule.java:40) ~[randomizedtesting-runner-2.8.1.jar:?]
[junit4] 2> at com.carrotsearch.randomizedtesting.rules.NoShadowingOrOverridesOnMethodsRule$1.evaluate(NoShadowingOrOverridesOnMethodsRule.java:40) ~[randomizedtesting-runner-2.8.1.jar:?]
[junit4] 2> at com.carrotsearch.randomizedtesting.rules.StatementAdapter.evaluate(StatementAdapter.java:36) ~[randomizedtesting-runner-2.8.1.jar:?]
[junit4] 2> at com.carrotsearch.randomizedtesting.rules.StatementAdapter.evaluate(StatementAdapter.java:36) ~[randomizedtesting-runner-2.8.1.jar:?]
[junit4] 2> at com.carrotsearch.randomizedtesting.rules.StatementAdapter.evaluate(StatementAdapter.java:36) ~[randomizedtesting-runner-2.8.1.jar:?]
[junit4] 2> at org.apache.lucene.util.TestRuleAssertionsRequired$1.evaluate(TestRuleAssertionsRequired.java:53) ~[java/:?]
[junit4] 2> at org.apache.lucene.util.TestRuleMarkFailure$1.evaluate(TestRuleMarkFailure.java:47) ~[java/:?]
[junit4] 2> at org.apache.lucene.util.TestRuleIgnoreAfterMaxFailures$1.evaluate(TestRuleIgnoreAfterMaxFailures.java:64) ~[java/:?]
[junit4] 2> at org.apache.lucene.util.TestRuleIgnoreTestSuites$1.evaluate(TestRuleIgnoreTestSuites.java:54) ~[java/:?]
[junit4] 2> at org.junit.rules.RunRules.evaluate(RunRules.java:20) ~[junit-4.13.1.jar:4.13.1]
[junit4] 2> at com.carrotsearch.randomizedtesting.rules.StatementAdapter.evaluate(StatementAdapter.java:36) ~[randomizedtesting-runner-2.8.1.jar:?]
[junit4] 2> at com.carrotsearch.randomizedtesting.ThreadLeakControl$StatementRunner.run(ThreadLeakControl.java:390) ~[randomizedtesting-runner-2.8.1.jar:?]
[junit4] 2> at com.carrotsearch.randomizedtesting.ThreadLeakControl.lambda$forkTimeoutingTask$0(ThreadLeakControl.java:850) ~[randomizedtesting-runner-2.8.1.jar:?]
[junit4] 2> at java.lang.Thread.run(Thread.java:750) [?:1.8.0_362]
[junit4] 2> 142686 INFO (Listener at localhost/33049) [ ] o.a.s.h.c.HttpShardHandlerFactory Host whitelist initialized: WhitelistHostChecker [whitelistHosts=null, whitelistHostCheckingEnabled=true]
[junit4] 2> 142689 WARN (Listener at localhost/33049) [ ] o.e.j.u.s.S.config Trusting all certificates configured for Client@317266c3[provider=null,keyStore=null,trustStore=null]
[junit4] 2> 142689 WARN (Listener at localhost/33049) [ ] o.e.j.u.s.S.config No Client EndPointIdentificationAlgorithm configured for Client@317266c3[provider=null,keyStore=null,trustStore=null]
[junit4] 2> 142694 WARN (Listener at localhost/33049) [ ] o.e.j.u.s.S.config Trusting all certificates configured for Client@52ac94d8[provider=null,keyStore=null,trustStore=null]
[junit4] 2> 142695 WARN (Listener at localhost/33049) [ ] o.e.j.u.s.S.config No Client EndPointIdentificationAlgorithm configured for Client@52ac94d8[provider=null,keyStore=null,trustStore=null]
[junit4] 2> 142696 WARN (Listener at localhost/33049) [ ] o.a.s.c.CoreContainer Not all security plugins configured! authentication=disabled authorization=disabled. Solr is only as secure as you make it. Consider configuring authentication/authorization before exposing Solr to users internal or external. See https://s.apache.org/solrsecurity for more info
[junit4] 2> 142729 INFO (Listener at localhost/33049) [ ] o.a.s.m.r.SolrJmxReporter JMX monitoring for 'solr.node' (registry 'solr.node') enabled at server: com.sun.jmx.mbeanserver.JmxMBeanServer@53d40213
[junit4] 2> 142735 INFO (Listener at localhost/33049) [ ] o.a.s.m.r.SolrJmxReporter JMX monitoring for 'solr.jvm' (registry 'solr.jvm') enabled at server: com.sun.jmx.mbeanserver.JmxMBeanServer@53d40213
[junit4] 2> 142735 INFO (Listener at localhost/33049) [ ] o.a.s.m.r.SolrJmxReporter JMX monitoring for 'solr.jetty' (registry 'solr.jetty') enabled at server: com.sun.jmx.mbeanserver.JmxMBeanServer@53d40213
[junit4] 2> 142737 INFO (coreLoadExecutor-773-thread-1) [ ] o.a.s.c.TransientSolrCoreCacheDefault Allocating transient core cache for max 2147483647 cores with initial capacity of 1024
[junit4] 2> 142745 INFO (coreLoadExecutor-773-thread-1) [ x:collection1 ] o.a.s.c.SolrResourceLoader Added 2 libs to classloader, from paths: [/home/jenkins/jenkins-slave/workspace/Lucene/Lucene-Solr-Tests-8.11/solr/core/src/test-files/solr/collection1/lib, /home/jenkins/jenkins-slave/workspace/Lucene/Lucene-Solr-Tests-8.11/solr/core/src/test-files/solr/collection1/lib/classes]
[junit4] 2> 142764 INFO (coreLoadExecutor-773-thread-1) [ x:collection1 ] o.a.s.c.SolrConfig Using Lucene MatchVersion: 8.11.4
[junit4] 2> 142764 WARN (coreLoadExecutor-773-thread-1) [ x:collection1 ] o.a.s.c.SolrConfig solrconfig.xml: <jmx> is no longer supported, use solr.xml:/metrics/reporter section instead
[junit4] 2> 142769 INFO (coreLoadExecutor-773-thread-1) [ x:collection1 ] o.a.s.s.IndexSchema Schema name=test
[junit4] 2> 142779 INFO (coreLoadExecutor-773-thread-1) [ x:collection1 ] o.a.s.s.IndexSchema Loaded schema test/1.6 with uniqueid field id
[junit4] 2> 142796 INFO (coreLoadExecutor-773-thread-1) [ x:collection1 ] o.a.s.c.CoreContainer Creating SolrCore 'collection1' using configuration from instancedir /home/jenkins/jenkins-slave/workspace/Lucene/Lucene-Solr-Tests-8.11/solr/core/src/test-files/solr/collection1, trusted=true
[junit4] 2> 142797 INFO (coreLoadExecutor-773-thread-1) [ x:collection1 ] o.a.s.m.r.SolrJmxReporter JMX monitoring for 'solr.core.collection1' (registry 'solr.core.collection1') enabled at server: com.sun.jmx.mbeanserver.JmxMBeanServer@53d40213
[junit4] 2> 142797 INFO (coreLoadExecutor-773-thread-1) [ x:collection1 ] o.a.s.c.HdfsDirectoryFactory solr.hdfs.home=hdfs://localhost:38339/solr_hdfs_home
[junit4] 2> 142797 INFO (coreLoadExecutor-773-thread-1) [ x:collection1 ] o.a.s.c.HdfsDirectoryFactory Solr Kerberos Authentication disabled
[junit4] 2> 142797 INFO (coreLoadExecutor-773-thread-1) [ x:collection1 ] o.a.s.c.SolrCore [[collection1] ] Opening new SolrCore at [/home/jenkins/jenkins-slave/workspace/Lucene/Lucene-Solr-Tests-8.11/solr/core/src/test-files/solr/collection1], dataDir=[hdfs://localhost:38339/solr_hdfs_home/collection1//home/jenkins/jenkins-slave/workspace/Lucene/Lucene-Solr-Tests-8.11/solr/build/solr-core/test/J3/temp/solr.update.TestHdfsUpdateLog_48C24EB070DBE3BF-001/data-dir-3-001/]
[junit4] 2> 142797 INFO (coreLoadExecutor-773-thread-1) [ x:collection1 ] o.a.s.c.HdfsDirectoryFactory creating directory factory for path hdfs://localhost:38339/solr_hdfs_home/collection1//home/jenkins/jenkins-slave/workspace/Lucene/Lucene-Solr-Tests-8.11/solr/build/solr-core/test/J3/temp/solr.update.TestHdfsUpdateLog_48C24EB070DBE3BF-001/data-dir-3-001/snapshot_metadata
[junit4] 2> 142805 INFO (coreLoadExecutor-773-thread-1) [ x:collection1 ] o.a.s.c.HdfsDirectoryFactory Number of slabs of block cache [1] with direct memory allocation set to [true]
[junit4] 2> 142805 INFO (coreLoadExecutor-773-thread-1) [ x:collection1 ] o.a.s.c.HdfsDirectoryFactory Block cache target memory usage, slab size of [33554432] will allocate [1] slabs and use ~[33554432] bytes
[junit4] 2> 142805 INFO (coreLoadExecutor-773-thread-1) [ x:collection1 ] o.a.s.c.HdfsDirectoryFactory Creating new global HDFS BlockCache
[junit4] 2> 142828 WARN (coreLoadExecutor-773-thread-1) [ x:collection1 ] o.a.s.s.h.HdfsDirectory The NameNode is in SafeMode - Solr will wait 5 seconds and try again.
[junit4] 2> 148050 WARN (coreLoadExecutor-773-thread-1) [ x:collection1 ] o.a.s.s.h.HdfsDirectory HDFS support in Solr has been deprecated as of 8.6. See SOLR-14021 for details.
[junit4] 2> 148050 INFO (coreLoadExecutor-773-thread-1) [ x:collection1 ] o.a.s.s.b.BlockDirectory Block cache on write is disabled
[junit4] 2> 148051 INFO (coreLoadExecutor-773-thread-1) [ x:collection1 ] o.a.s.c.HdfsDirectoryFactory creating directory factory for path hdfs://localhost:38339/solr_hdfs_home/collection1//home/jenkins/jenkins-slave/workspace/Lucene/Lucene-Solr-Tests-8.11/solr/build/solr-core/test/J3/temp/solr.update.TestHdfsUpdateLog_48C24EB070DBE3BF-001/data-dir-3-001
[junit4] 2> 148072 WARN (coreLoadExecutor-773-thread-1) [ x:collection1 ] o.a.s.s.h.HdfsDirectory HDFS support in Solr has been deprecated as of 8.6. See SOLR-14021 for details.
[junit4] 2> 148086 INFO (coreLoadExecutor-773-thread-1) [ x:collection1 ] o.a.s.c.HdfsDirectoryFactory creating directory factory for path hdfs://localhost:38339/solr_hdfs_home/collection1//home/jenkins/jenkins-slave/workspace/Lucene/Lucene-Solr-Tests-8.11/solr/build/solr-core/test/J3/temp/solr.update.TestHdfsUpdateLog_48C24EB070DBE3BF-001/data-dir-3-001/index
[junit4] 2> 148095 INFO (coreLoadExecutor-773-thread-1) [ x:collection1 ] o.a.s.c.HdfsDirectoryFactory Number of slabs of block cache [1] with direct memory allocation set to [true]
[junit4] 2> 148095 INFO (coreLoadExecutor-773-thread-1) [ x:collection1 ] o.a.s.c.HdfsDirectoryFactory Block cache target memory usage, slab size of [33554432] will allocate [1] slabs and use ~[33554432] bytes
[junit4] 2> 148118 WARN (coreLoadExecutor-773-thread-1) [ x:collection1 ] o.a.s.s.h.HdfsDirectory HDFS support in Solr has been deprecated as of 8.6. See SOLR-14021 for details.
[junit4] 2> 148118 INFO (coreLoadExecutor-773-thread-1) [ x:collection1 ] o.a.s.s.b.BlockDirectory Block cache on write is disabled
[junit4] 2> 148119 INFO (coreLoadExecutor-773-thread-1) [ x:collection1 ] o.a.s.u.RandomMergePolicy RandomMergePolicy wrapping class org.apache.lucene.index.TieredMergePolicy: [TieredMergePolicy: maxMergeAtOnce=35, maxMergeAtOnceExplicit=11, maxMergedSegmentMB=66.0927734375, floorSegmentMB=1.765625, forceMergeDeletesPctAllowed=6.949407095799835, segmentsPerTier=40.0, maxCFSSegmentSizeMB=8.796093022207999E12, noCFSRatio=1.0, deletesPctAllowed=36.67904572737649
[junit4] 2> 148203 WARN (coreLoadExecutor-773-thread-1) [ x:collection1 ] o.a.s.c.RequestHandlers INVALID paramSet a in requestHandler {type = requestHandler,name = /dump,class = DumpRequestHandler,attributes = {initParams=a, name=/dump, class=DumpRequestHandler},args = {defaults={a=A,b=B}}}
[junit4] 2> 148299 INFO (coreLoadExecutor-773-thread-1) [ x:collection1 ] o.a.s.u.UpdateHandler Using UpdateLog implementation: org.apache.solr.update.HdfsUpdateLog
[junit4] 2> 148299 INFO (coreLoadExecutor-773-thread-1) [ x:collection1 ] o.a.s.u.UpdateLog Initializing UpdateLog: dataDir=hdfs://localhost:38339/solr/shard1 defaultSyncLevel=FLUSH numRecordsToKeep=100 maxNumLogsToKeep=10 numVersionBuckets=65536
[junit4] 2> 148299 INFO (coreLoadExecutor-773-thread-1) [ x:collection1 ] o.a.s.u.HdfsUpdateLog Initializing HdfsUpdateLog: tlogDfsReplication=2
[junit4] 2> 148314 INFO (coreLoadExecutor-773-thread-1) [ x:collection1 ] o.a.s.u.CommitTracker Hard AutoCommit: disabled
[junit4] 2> 148314 INFO (coreLoadExecutor-773-thread-1) [ x:collection1 ] o.a.s.u.CommitTracker Soft AutoCommit: disabled
[junit4] 2> 148320 INFO (coreLoadExecutor-773-thread-1) [ x:collection1 ] o.a.s.u.RandomMergePolicy RandomMergePolicy wrapping class org.apache.lucene.index.TieredMergePolicy: [TieredMergePolicy: maxMergeAtOnce=42, maxMergeAtOnceExplicit=15, maxMergedSegmentMB=60.1123046875, floorSegmentMB=0.8935546875, forceMergeDeletesPctAllowed=29.88765365285958, segmentsPerTier=22.0, maxCFSSegmentSizeMB=8.796093022207999E12, noCFSRatio=1.0, deletesPctAllowed=29.918072961421338
[junit4] 2> 148352 WARN (coreLoadExecutor-773-thread-1) [ x:collection1 ] o.a.s.r.ManagedResourceStorage Cannot write to config directory /home/jenkins/jenkins-slave/workspace/Lucene/Lucene-Solr-Tests-8.11/solr/core/src/test-files/solr/collection1/conf ; switching to use InMemory storage instead.
[junit4] 2> 148352 INFO (coreLoadExecutor-773-thread-1) [ x:collection1 ] o.a.s.h.ReplicationHandler Commits will be reserved for 10000 ms
[junit4] 2> 148353 INFO (coreLoadExecutor-773-thread-1) [ x:collection1 ] o.a.s.u.UpdateLog Could not find max version in index or recent updates, using new clock 1790526228335165440
[junit4] 2> 148359 INFO (searcherExecutor-775-thread-1-processing-x:collection1) [ x:collection1 ] o.a.s.c.SolrCore [collection1] Registered new searcher autowarm time: 0 ms
[junit4] 2> 148361 INFO (Listener at localhost/33049) [ ] o.a.s.SolrTestCaseJ4 ####initCore end
[junit4] 2> 148412 INFO (TEST-TestHdfsUpdateLog.testFSThreadSafety-seed#[48C24EB070DBE3BF]) [ ] o.a.s.SolrTestCaseJ4 ###Starting testFSThreadSafety
[junit4] 2> 149045 INFO (TEST-TestHdfsUpdateLog.testFSThreadSafety-seed#[48C24EB070DBE3BF]) [ ] o.a.s.u.DirectUpdateHandler2 [collection1] REMOVING ALL DOCUMENTS FROM INDEX
[junit4] 2> 149058 INFO (TEST-TestHdfsUpdateLog.testFSThreadSafety-seed#[48C24EB070DBE3BF]) [ ] o.a.s.u.p.LogUpdateProcessorFactory [collection1] webapp=null path=null params={_version_=-9223372036854775807&update.distrib=FROMLEADER&versions=true&wt=json&indent=true}{deleteByQuery=*:* (-9223372036854775807)} 0 643
[junit4] 2> 149139 INFO (searcherExecutor-775-thread-1-processing-x:collection1) [ x:collection1 ] o.a.s.c.SolrCore [collection1] Registered new searcher autowarm time: 0 ms
[junit4] 2> 149139 INFO (TEST-TestHdfsUpdateLog.testFSThreadSafety-seed#[48C24EB070DBE3BF]) [ x:collection1 ] o.a.s.u.p.LogUpdateProcessorFactory [collection1] webapp=null path=null params={}{commit=} 0 80
[junit4] 2> 149290 INFO (Thread-1505) [ x:collection1 ] o.a.s.u.p.LogUpdateProcessorFactory [collection1] webapp=null path=null params={}{add=[0 (1790526229191852032)]} 0 122
[junit4] 2> 149306 INFO (Thread-1505) [ x:collection1 ] o.a.s.u.p.LogUpdateProcessorFactory [collection1] webapp=null path=null params={}{add=[1 (1790526229333409792)]} 0 1
[junit4] 2> 149337 INFO (Thread-1505) [ x:collection1 ] o.a.s.u.p.LogUpdateProcessorFactory [collection1] webapp=null path=null params={}{add=[2 (1790526229347041280)]} 0 19
[junit4] 2> 149459 INFO (Thread-1505) [ x:collection1 ] o.a.s.u.p.LogUpdateProcessorFactory [collection1] webapp=null path=null params={}{add=[3 (1790526229378498560)]} 0 110
[junit4] 2> 149495 INFO (Thread-1505) [ x:collection1 ] o.a.s.u.p.LogUpdateProcessorFactory [collection1] webapp=null path=null params={}{add=[4 (1790526229507473408)]} 0 25
[junit4] 2> 149508 INFO (Thread-1505) [ x:collection1 ] o.a.s.u.p.LogUpdateProcessorFactory [collection1] webapp=null path=null params={}{add=[5 (1790526229545222144)]} 0 1
[junit4] 2> 149520 INFO (Thread-1505) [ x:collection1 ] o.a.s.u.p.LogUpdateProcessorFactory [collection1] webapp=null path=null params={}{add=[6 (1790526229557805056)]} 0 1
[junit4] 2> 149532 INFO (Thread-1505) [ x:collection1 ] o.a.s.u.p.LogUpdateProcessorFactory [collection1] webapp=null path=null params={}{add=[7 (1790526229570387968)]} 0 1
[junit4] 2> 149544 INFO (Thread-1505) [ x:collection1 ] o.a.s.u.p.LogUpdateProcessorFactory [collection1] webapp=null path=null params={}{add=[8 (1790526229584019456)]} 0 1
[junit4] 2> 149556 INFO (Thread-1505) [ x:collection1 ] o.a.s.u.p.LogUpdateProcessorFactory [collection1] webapp=null path=null params={}{add=[9 (1790526229596602368)]} 0 1
[junit4] 2> 149568 INFO (Thread-1505) [ x:collection1 ] o.a.s.u.p.LogUpdateProcessorFactory [collection1] webapp=null path=null params={}{add=[10 (1790526229608136704)]} 0 1
[junit4] 2> 149580 INFO (Thread-1505) [ x:collection1 ] o.a.s.u.p.LogUpdateProcessorFactory [collection1] webapp=null path=null params={}{add=[11 (1790526229620719616)]} 0 1
[junit4] 2> 149592 INFO (Thread-1505) [ x:collection1 ] o.a.s.u.p.LogUpdateProcessorFactory [collection1] webapp=null path=null params={}{add=[12 (1790526229633302528)]} 0 1
[junit4] 2> 149837 INFO (Thread-1505) [ x:collection1 ] o.a.s.u.p.LogUpdateProcessorFactory [collection1] webapp=null path=null params={}{add=[13 (1790526229645885440)]} 0 234
[junit4] 2> 149861 INFO (Thread-1505) [ x:collection1 ] o.a.s.u.p.LogUpdateProcessorFactory [collection1] webapp=null path=null params={}{add=[14 (1790526229909078016)]} 0 12
[junit4] 2> 149879 INFO (Thread-1505) [ x:collection1 ] o.a.s.u.p.LogUpdateProcessorFactory [collection1] webapp=null path=null params={}{add=[15 (1790526229934243840)]} 0 7
[junit4] 2> 149904 INFO (Thread-1505) [ x:collection1 ] o.a.s.u.p.LogUpdateProcessorFactory [collection1] webapp=null path=null params={}{add=[16 (1790526229959409664)]} 0 14
[junit4] 2> 149919 INFO (Thread-1505) [ x:collection1 ] o.a.s.u.p.LogUpdateProcessorFactory [collection1] webapp=null path=null params={}{add=[17 (1790526229976186880)]} 0 3
[junit4] 2> 149932 INFO (Thread-1505) [ x:collection1 ] o.a.s.u.p.LogUpdateProcessorFactory [collection1] webapp=null path=null params={}{add=[18 (1790526229988769792)]} 0 2
[junit4] 2> 149945 INFO (Thread-1505) [ x:collection1 ] o.a.s.u.p.LogUpdateProcessorFactory [collection1] webapp=null path=null params={}{add=[19 (1790526230002401280)]} 0 1
[junit4] 2> 149957 INFO (Thread-1505) [ x:collection1 ] o.a.s.u.p.LogUpdateProcessorFactory [collection1] webapp=null path=null params={}{add=[20 (1790526230014984192)]} 0 2
[junit4] 2> 149969 INFO (Thread-1505) [ x:collection1 ] o.a.s.u.p.LogUpdateProcessorFactory [collection1] webapp=null path=null params={}{add=[21 (1790526230028615680)]} 0 1
[junit4] 2> 149981 INFO (Thread-1505) [ x:collection1 ] o.a.s.u.p.LogUpdateProcessorFactory [collection1] webapp=null path=null params={}{add=[22 (1790526230041198592)]} 0 1
[junit4] 2> 149993 INFO (Thread-1505) [ x:collection1 ] o.a.s.u.p.LogUpdateProcessorFactory [collection1] webapp=null path=null params={}{add=[23 (1790526230053781504)]} 0 1
[junit4] 2> 150004 INFO (Thread-1505) [ x:collection1 ] o.a.s.u.p.LogUpdateProcessorFactory [collection1] webapp=null path=null params={}{add=[24 (1790526230066364416)]} 0 0
[junit4] 2> 150015 INFO (Thread-1505) [ x:collection1 ] o.a.s.u.p.LogUpdateProcessorFactory [collection1] webapp=null path=null params={}{add=[25 (1790526230077898752)]} 0 0
[junit4] 2> 150027 INFO (Thread-1505) [ x:collection1 ] o.a.s.u.p.LogUpdateProcessorFactory [collection1] webapp=null path=null params={}{add=[26 (1790526230089433088)]} 0 1
[junit4] 2> 150039 INFO (Thread-1505) [ x:collection1 ] o.a.s.u.p.LogUpdateProcessorFactory [collection1] webapp=null path=null params={}{add=[27 (1790526230102016000)]} 0 1
[junit4] 2> 150050 INFO (Thread-1505) [ x:collection1 ] o.a.s.u.p.LogUpdateProcessorFactory [collection1] webapp=null path=null params={}{add=[28 (1790526230114598912)]} 0 0
[junit4] 2> 150062 INFO (Thread-1505) [ x:collection1 ] o.a.s.u.p.LogUpdateProcessorFactory [collection1] webapp=null path=null params={}{add=[29 (1790526230126133248)]} 0 0
[junit4] 2> 150073 INFO (Thread-1505) [ x:collection1 ] o.a.s.u.p.LogUpdateProcessorFactory [collection1] webapp=null path=null params={}{add=[30 (1790526230137667584)]} 0 1
[junit4] 2> 150084 INFO (Thread-1505) [ x:collection1 ] o.a.s.u.p.LogUpdateProcessorFactory [collection1] webapp=null path=null params={}{add=[31 (1790526230150250496)]} 0 0
[junit4] 2> 150097 INFO (Thread-1505) [ x:collection1 ] o.a.s.u.p.LogUpdateProcessorFactory [collection1] webapp=null path=null params={}{add=[32 (1790526230161784832)]} 0 2
[junit4] 2> 150109 INFO (Thread-1505) [ x:collection1 ] o.a.s.u.p.LogUpdateProcessorFactory [collection1] webapp=null path=null params={}{add=[33 (1790526230175416320)]} 0 0
[junit4] 2> 150120 INFO (Thread-1505) [ x:collection1 ] o.a.s.u.p.LogUpdateProcessorFactory [collection1] webapp=null path=null params={}{add=[34 (1790526230186950656)]} 0 0
[junit4] 2> 150131 INFO (Thread-1505) [ x:collection1 ] o.a.s.u.p.LogUpdateProcessorFactory [collection1] webapp=null path=null params={}{add=[35 (1790526230199533568)]} 0 0
[junit4] 2> 150143 INFO (Thread-1505) [ x:collection1 ] o.a.s.u.p.LogUpdateProcessorFactory [collection1] webapp=null path=null params={}{add=[36 (1790526230212116480)]} 0 1
[junit4] 2> 150155 INFO (Thread-1505) [ x:collection1 ] o.a.s.u.p.LogUpdateProcessorFactory [collection1] webapp=null path=null params={}{add=[37 (1790526230223650816)]} 0 0
[junit4] 2> 150166 INFO (Thread-1505) [ x:collection1 ] o.a.s.u.p.LogUpdateProcessorFactory [collection1] webapp=null path=null params={}{add=[38 (1790526230235185152)]} 0 0
[junit4] 2> 150178 INFO (Thread-1505) [ x:collection1 ] o.a.s.u.p.LogUpdateProcessorFactory [collection1] webapp=null path=null params={}{add=[39 (1790526230247768064)]} 0 1
[junit4] 2> 150189 INFO (Thread-1505) [ x:collection1 ] o.a.s.u.p.LogUpdateProcessorFactory [collection1] webapp=null path=null params={}{add=[40 (1790526230260350976)]} 0 0
[junit4] 2> 150201 INFO (Thread-1505) [ x:collection1 ] o.a.s.u.p.LogUpdateProcessorFactory [collection1] webapp=null path=null params={}{add=[41 (1790526230271885312)]} 0 1
[junit4] 2> 150440 INFO (Thread-1505) [ x:collection1 ] o.a.s.u.p.LogUpdateProcessorFactory [collection1] webapp=null path=null params={}{add=[42 (1790526230284468224)]} 0 228
[junit4] 2> 150452 INFO (Thread-1505) [ x:collection1 ] o.a.s.u.p.LogUpdateProcessorFactory [collection1] webapp=null path=null params={}{add=[43 (1790526230535077888)]} 0 0
[junit4] 2> 150464 INFO (Thread-1505) [ x:collection1 ] o.a.s.u.p.LogUpdateProcessorFactory [collection1] webapp=null path=null params={}{add=[44 (1790526230547660800)]} 0 1
[junit4] 2> 150475 INFO (Thread-1505) [ x:collection1 ] o.a.s.u.p.LogUpdateProcessorFactory [collection1] webapp=null path=null params={}{add=[45 (1790526230559195136)]} 0 0
[junit4] 2> 150487 INFO (Thread-1505) [ x:collection1 ] o.a.s.u.p.LogUpdateProcessorFactory [collection1] webapp=null path=null params={}{add=[46 (1790526230571778048)]} 0 0
[junit4] 2> 150505 INFO (Thread-1505) [ x:collection1 ] o.a.s.u.p.LogUpdateProcessorFactory [collection1] webapp=null path=null params={}{add=[47 (1790526230589603840)]} 0 1
[junit4] 2> 150516 INFO (Thread-1505) [ x:collection1 ] o.a.s.u.p.LogUpdateProcessorFactory [collection1] webapp=null path=null params={}{add=[48 (1790526230602186752)]} 0 1
[junit4] 2> 150528 INFO (Thread-1505) [ x:collection1 ] o.a.s.u.p.LogUpdateProcessorFactory [collection1] webapp=null path=null params={}{add=[49 (1790526230614769664)]} 0 1
[junit4] 2> 150540 INFO (Thread-1505) [ x:collection1 ] o.a.s.u.p.LogUpdateProcessorFactory [collection1] webapp=null path=null params={}{add=[50 (1790526230627352576)]} 0 0
[junit4] 2> 150551 INFO (Thread-1505) [ x:collection1 ] o.a.s.u.p.LogUpdateProcessorFactory [collection1] webapp=null path=null params={}{add=[51 (1790526230639935488)]} 0 0
[junit4] 2> 150581 INFO (Thread-1505) [ x:collection1 ] o.a.s.u.p.LogUpdateProcessorFactory [collection1] webapp=null path=null params={}{add=[52 (1790526230651469824)]} 0 19
[junit4] 2> 150593 INFO (Thread-1505) [ x:collection1 ] o.a.s.u.p.LogUpdateProcessorFactory [collection1] webapp=null path=null params={}{add=[53 (1790526230682927104)]} 0 1
[junit4] 2> 150607 INFO (Thread-1505) [ x:collection1 ] o.a.s.u.p.LogUpdateProcessorFactory [collection1] webapp=null path=null params={}{add=[54 (1790526230695510016)]} 0 3
[junit4] 2> 150619 INFO (Thread-1505) [ x:collection1 ] o.a.s.u.p.LogUpdateProcessorFactory [collection1] webapp=null path=null params={}{add=[55 (1790526230710190080)]} 0 1
[junit4] 2> 150635 INFO (Thread-1505) [ x:collection1 ] o.a.s.u.p.LogUpdateProcessorFactory [collection1] webapp=null path=null params={}{add=[56 (1790526230722772992)]} 0 4
[junit4] 2> 150646 INFO (Thread-1505) [ x:collection1 ] o.a.s.u.p.LogUpdateProcessorFactory [collection1] webapp=null path=null params={}{add=[57 (1790526230739550208)]} 0 1
[junit4] 2> 150659 INFO (Thread-1505) [ x:collection1 ] o.a.s.u.p.LogUpdateProcessorFactory [collection1] webapp=null path=null params={}{add=[58 (1790526230751084544)]} 0 2
[junit4] 2> 150672 INFO (Thread-1505) [ x:collection1 ] o.a.s.u.p.LogUpdateProcessorFactory [collection1] webapp=null path=null params={}{add=[59 (1790526230765764608)]} 0 1
[junit4] 2> 150684 INFO (Thread-1505) [ x:collection1 ] o.a.s.u.p.LogUpdateProcessorFactory [collection1] webapp=null path=null params={}{add=[60 (1790526230778347520)]} 0 0
[junit4] 2> 150695 INFO (Thread-1505) [ x:collection1 ] o.a.s.u.p.LogUpdateProcessorFactory [collection1] webapp=null path=null params={}{add=[61 (1790526230790930432)]} 0 0
[junit4] 2> 150707 INFO (Thread-1505) [ x:collection1 ] o.a.s.u.p.LogUpdateProcessorFactory [collection1] webapp=null path=null params={}{add=[62 (1790526230802464768)]} 0 0
[junit4] 2> 150769 INFO (Thread-1505) [ x:collection1 ] o.a.s.u.p.LogUpdateProcessorFactory [collection1] webapp=null path=null params={}{add=[63 (1790526230815047680)]} 0 50
[junit4] 2> 150800 INFO (Thread-1505) [ x:collection1 ] o.a.s.u.p.LogUpdateProcessorFactory [collection1] webapp=null path=null params={}{add=[64 (1790526230880059392)]} 0 20
[junit4] 2> 151040 INFO (Thread-1505) [ x:collection1 ] o.a.s.u.p.LogUpdateProcessorFactory [collection1] webapp=null path=null params={}{add=[65 (1790526231150592000)]} 0 1
[junit4] 2> 151052 INFO (Thread-1505) [ x:collection1 ] o.a.s.u.p.LogUpdateProcessorFactory [collection1] webapp=null path=null params={}{add=[66 (1790526231164223488)]} 0 1
[junit4] 2> 151064 INFO (Thread-1505) [ x:collection1 ] o.a.s.u.p.LogUpdateProcessorFactory [collection1] webapp=null path=null params={}{add=[67 (1790526231176806400)]} 0 0
[junit4] 2> 151077 INFO (Thread-1505) [ x:collection1 ] o.a.s.u.p.LogUpdateProcessorFactory [collection1] webapp=null path=null params={}{add=[68 (1790526231189389312)]} 0 1
[junit4] 2> 151090 INFO (Thread-1505) [ x:collection1 ] o.a.s.u.p.LogUpdateProcessorFactory [collection1] webapp=null path=null params={}{add=[69 (1790526231203020800)]} 0 1
[junit4] 2> 151102 INFO (Thread-1505) [ x:collection1 ] o.a.s.u.p.LogUpdateProcessorFactory [collection1] webapp=null path=null params={}{add=[70 (1790526231217700864)]} 0 0
[junit4] 2> 151114 INFO (Thread-1505) [ x:collection1 ] o.a.s.u.p.LogUpdateProcessorFactory [collection1] webapp=null path=null params={}{add=[71 (1790526231229235200)]} 0 1
[junit4] 2> 151126 INFO (Thread-1505) [ x:collection1 ] o.a.s.u.p.LogUpdateProcessorFactory [collection1] webapp=null path=null params={}{add=[72 (1790526231241818112)]} 0 0
[junit4] 2> 151137 INFO (Thread-1505) [ x:collection1 ] o.a.s.u.p.LogUpdateProcessorFactory [collection1] webapp=null path=null params={}{add=[73 (1790526231254401024)]} 0 0
[junit4] 2> 151149 INFO (Thread-1505) [ x:collection1 ] o.a.s.u.p.LogUpdateProcessorFactory [collection1] webapp=null path=null params={}{add=[74 (1790526231265935360)]} 0 0
[junit4] 2> 151160 INFO (Thread-1505) [ x:collection1 ] o.a.s.u.p.LogUpdateProcessorFactory [collection1] webapp=null path=null params={}{add=[75 (1790526231278518272)]} 0 0
[junit4] 2> 151176 INFO (Thread-1505) [ x:collection1 ] o.a.s.u.p.LogUpdateProcessorFactory [collection1] webapp=null path=null params={}{add=[76 (1790526231292149760)]} 0 2
[junit4] 2> 151191 INFO (Thread-1505) [ x:collection1 ] o.a.s.u.p.LogUpdateProcessorFactory [collection1] webapp=null path=null params={}{add=[77 (1790526231305781248)]} 0 4
[junit4] 2> 151206 INFO (Thread-1505) [ x:collection1 ] o.a.s.u.p.LogUpdateProcessorFactory [collection1] webapp=null path=null params={}{add=[78 (1790526231324655616)]} 0 1
[junit4] 2> 151219 INFO (Thread-1505) [ x:collection1 ] o.a.s.u.p.LogUpdateProcessorFactory [collection1] webapp=null path=null params={}{add=[79 (1790526231338287104)]} 0 2
[junit4] 2> 151231 INFO (Thread-1505) [ x:collection1 ] o.a.s.u.p.LogUpdateProcessorFactory [collection1] webapp=null path=null params={}{add=[80 (1790526231351918592)]} 0 0
[junit4] 2> 151245 INFO (Thread-1505) [ x:collection1 ] o.a.s.u.p.LogUpdateProcessorFactory [collection1] webapp=null path=null params={}{add=[81 (1790526231366598656)]} 0 1
[junit4] 2> 151257 INFO (Thread-1505) [ x:collection1 ] o.a.s.u.p.LogUpdateProcessorFactory [collection1] webapp=null path=null params={}{add=[82 (1790526231380230144)]} 0 0
[junit4] 2> 151269 INFO (Thread-1505) [ x:collection1 ] o.a.s.u.p.LogUpdateProcessorFactory [collection1] webapp=null path=null params={}{add=[83 (1790526231391764480)]} 0 1
[junit4] 2> 151280 INFO (Thread-1505) [ x:collection1 ] o.a.s.u.p.LogUpdateProcessorFactory [collection1] webapp=null path=null params={}{add=[84 (1790526231404347392)]} 0 0
[junit4] 2> 151293 INFO (Thread-1505) [ x:collection1 ] o.a.s.u.p.LogUpdateProcessorFactory [collection1] webapp=null path=null params={}{add=[85 (1790526231415881728)]} 0 2
[junit4] 2> 151320 INFO (Thread-1505) [ x:collection1 ] o.a.s.u.p.LogUpdateProcessorFactory [collection1] webapp=null path=null params={}{add=[86 (1790526231429513216)]} 0 16
[junit4] 2> 151331 INFO (Thread-1505) [ x:collection1 ] o.a.s.u.p.LogUpdateProcessorFactory [collection1] webapp=null path=null params={}{add=[87 (1790526231457824768)]} 0 0
[junit4] 2> 151343 INFO (Thread-1505) [ x:collection1 ] o.a.s.u.p.LogUpdateProcessorFactory [collection1] webapp=null path=null params={}{add=[88 (1790526231469359104)]} 0 1
[junit4] 2> 151359 INFO (Thread-1505) [ x:collection1 ] o.a.s.u.p.LogUpdateProcessorFactory [collection1] webapp=null path=null params={}{add=[89 (1790526231485087744)]} 0 1
[junit4] 2> 151371 INFO (Thread-1505) [ x:collection1 ] o.a.s.u.p.LogUpdateProcessorFactory [collection1] webapp=null path=null params={}{add=[90 (1790526231497670656)]} 0 2
[junit4] 2> 151384 INFO (Thread-1505) [ x:collection1 ] o.a.s.u.p.LogUpdateProcessorFactory [collection1] webapp=null path=null params={}{add=[91 (1790526231511302144)]} 0 2
[junit4] 2> 151396 INFO (Thread-1505) [ x:collection1 ] o.a.s.u.p.LogUpdateProcessorFactory [collection1] webapp=null path=null params={}{add=[92 (1790526231524933632)]} 0 0
[junit4] 2> 151407 INFO (Thread-1505) [ x:collection1 ] o.a.s.u.p.LogUpdateProcessorFactory [collection1] webapp=null path=null params={}{add=[93 (1790526231537516544)]} 0 0
[junit4] 2> 151419 INFO (Thread-1505) [ x:collection1 ] o.a.s.u.p.LogUpdateProcessorFactory [collection1] webapp=null path=null params={}{add=[94 (1790526231549050880)]} 0 0
[junit4] 2> 151430 INFO (Thread-1505) [ x:collection1 ] o.a.s.u.p.LogUpdateProcessorFactory [collection1] webapp=null path=null params={}{add=[95 (1790526231560585216)]} 0 0
[junit4] 2> 151441 INFO (Thread-1505) [ x:collection1 ] o.a.s.u.p.LogUpdateProcessorFactory [collection1] webapp=null path=null params={}{add=[96 (1790526231572119552)]} 0 1
[junit4] 2> 151494 INFO (Thread-1505) [ x:collection1 ] o.a.s.u.p.LogUpdateProcessorFactory [collection1] webapp=null path=null params={}{add=[97 (1790526231584702464)]} 0 41
[junit4] 2> 151506 INFO (Thread-1505) [ x:collection1 ] o.a.s.u.p.LogUpdateProcessorFactory [collection1] webapp=null path=null params={}{add=[98 (1790526231640276992)]} 0 1
[junit4] 2> 151518 INFO (Thread-1505) [ x:collection1 ] o.a.s.u.p.LogUpdateProcessorFactory [collection1] webapp=null path=null params={}{add=[99 (1790526231652859904)]} 0 1
[junit4] 2> 151529 INFO (Thread-1505) [ x:collection1 ] o.a.s.u.p.LogUpdateProcessorFactory [collection1] webapp=null path=null params={}{add=[100 (1790526231664394240)]} 0 0
[junit4] 2> 151542 INFO (Thread-1505) [ x:collection1 ] o.a.s.u.p.LogUpdateProcessorFactory [collection1] webapp=null path=null params={}{add=[101 (1790526231678025728)]} 0 0
[junit4] 2> 151553 INFO (Thread-1505) [ x:collection1 ] o.a.s.u.p.LogUpdateProcessorFactory [collection1] webapp=null path=null params={}{add=[102 (1790526231689560064)]} 0 0
[junit4] 2> 151564 INFO (Thread-1505) [ x:collection1 ] o.a.s.u.p.LogUpdateProcessorFactory [collection1] webapp=null path=null params={}{add=[103 (1790526231702142976)]} 0 0
[junit4] 2> 151575 INFO (Thread-1505) [ x:collection1 ] o.a.s.u.p.LogUpdateProcessorFactory [collection1] webapp=null path=null params={}{add=[104 (1790526231713677312)]} 0 0
[junit4] 2> 151587 INFO (Thread-1505) [ x:collection1 ] o.a.s.u.p.LogUpdateProcessorFactory [collection1] webapp=null path=null params={}{add=[105 (1790526231725211648)]} 0 1
[junit4] 2> 151599 INFO (Thread-1505) [ x:collection1 ] o.a.s.u.p.LogUpdateProcessorFactory [collection1] webapp=null path=null params={}{add=[106 (1790526231737794560)]} 0 0
[junit4] 2> 151610 INFO (Thread-1505) [ x:collection1 ] o.a.s.u.p.LogUpdateProcessorFactory [collection1] webapp=null path=null params={}{add=[107 (1790526231750377472)]} 0 0
[junit4] 2> 151621 INFO (Thread-1505) [ x:collection1 ] o.a.s.u.p.LogUpdateProcessorFactory [collection1] webapp=null path=null params={}{add=[108 (1790526231761911808)]} 0 0
[junit4] 2> 151633 INFO (Thread-1505) [ x:collection1 ] o.a.s.u.p.LogUpdateProcessorFactory [collection1] webapp=null path=null params={}{add=[109 (1790526231773446144)]} 0 0
[junit4] 2> 152038 INFO (Thread-1505) [ x:collection1 ] o.a.s.u.p.LogUpdateProcessorFactory [collection1] webapp=null path=null params={}{add=[110 (1790526232198119424)]} 0 1
[junit4] 2> 152051 INFO (Thread-1505) [ x:collection1 ] o.a.s.u.p.LogUpdateProcessorFactory [collection1] webapp=null path=null params={}{add=[111 (1790526232211750912)]} 0 1
[junit4] 2> 152063 INFO (Thread-1505) [ x:collection1 ] o.a.s.u.p.LogUpdateProcessorFactory [collection1] webapp=null path=null params={}{add=[112 (1790526232224333824)]} 0 0
[junit4] 2> 152074 INFO (Thread-1505) [ x:collection1 ] o.a.s.u.p.LogUpdateProcessorFactory [collection1] webapp=null path=null params={}{add=[113 (1790526232235868160)]} 0 0
[junit4] 2> 152085 INFO (Thread-1505) [ x:collection1 ] o.a.s.u.p.LogUpdateProcessorFactory [collection1] webapp=null path=null params={}{add=[114 (1790526232247402496)]} 0 0
[junit4] 2> 152097 INFO (Thread-1505) [ x:collection1 ] o.a.s.u.p.LogUpdateProcessorFactory [collection1] webapp=null path=null params={}{add=[115 (1790526232259985408)]} 0 1
[junit4] 2> 152108 INFO (Thread-1505) [ x:collection1 ] o.a.s.u.p.LogUpdateProcessorFactory [collection1] webapp=null path=null params={}{add=[116 (1790526232271519744)]} 0 0
[junit4] 2> 152119 INFO (Thread-1505) [ x:collection1 ] o.a.s.u.p.LogUpdateProcessorFactory [collection1] webapp=null path=null params={}{add=[117 (1790526232284102656)]} 0 0
[junit4] 2> 152145 INFO (Thread-1505) [ x:collection1 ] o.a.s.u.p.LogUpdateProcessorFactory [collection1] webapp=null path=null params={}{add=[118 (1790526232310317056)]} 0 0
[junit4] 2> 152156 INFO (Thread-1505) [ x:collection1 ] o.a.s.u.p.LogUpdateProcessorFactory [collection1] webapp=null path=null params={}{add=[119 (1790526232322899968)]} 0 0
[junit4] 2> 152167 INFO (Thread-1505) [ x:collection1 ] o.a.s.u.p.LogUpdateProcessorFactory [collection1] webapp=null path=null params={}{add=[120 (1790526232334434304)]} 0 0
[junit4] 2> 152202 INFO (Thread-1505) [ x:collection1 ] o.a.s.u.p.LogUpdateProcessorFactory [collection1] webapp=null path=null params={}{add=[121 (1790526232345968640)]} 0 23
[junit4] 2> 152214 INFO (Thread-1505) [ x:collection1 ] o.a.s.u.p.LogUpdateProcessorFactory [collection1] webapp=null path=null params={}{add=[122 (1790526232382668800)]} 0 1
[junit4] 2> 152226 INFO (Thread-1505) [ x:collection1 ] o.a.s.u.p.LogUpdateProcessorFactory [collection1] webapp=null path=null params={}{add=[123 (1790526232395251712)]} 0 0
[junit4] 2> 152237 INFO (Thread-1505) [ x:collection1 ] o.a.s.u.p.LogUpdateProcessorFactory [collection1] webapp=null path=null params={}{add=[124 (1790526232406786048)]} 0 0
[junit4] 2> 152248 INFO (Thread-1505) [ x:collection1 ] o.a.s.u.p.LogUpdateProcessorFactory [collection1] webapp=null path=null params={}{add=[125 (1790526232419368960)]} 0 0
[junit4] 2> 152259 INFO (Thread-1505) [ x:collection1 ] o.a.s.u.p.LogUpdateProcessorFactory [collection1] webapp=null path=null params={}{add=[126 (1790526232430903296)]} 0 0
[junit4] 2> 152270 INFO (Thread-1505) [ x:collection1 ] o.a.s.u.p.LogUpdateProcessorFactory [collection1] webapp=null path=null params={}{add=[127 (1790526232442437632)]} 0 0
[junit4] 2> 152282 INFO (Thread-1505) [ x:collection1 ] o.a.s.u.p.LogUpdateProcessorFactory [collection1] webapp=null path=null params={}{add=[128 (1790526232453971968)]} 0 1
[junit4] 2> 152293 INFO (Thread-1505) [ x:collection1 ] o.a.s.u.p.LogUpdateProcessorFactory [collection1] webapp=null path=null params={}{add=[129 (1790526232466554880)]} 0 0
[junit4] 2> 152341 INFO (Thread-1505) [ x:collection1 ] o.a.s.u.p.LogUpdateProcessorFactory [collection1] webapp=null path=null params={}{add=[130 (1790526232478089216)]} 0 36
[junit4] 2> 152555 INFO (Thread-1505) [ x:collection1 ] o.a.s.u.p.LogUpdateProcessorFactory [collection1] webapp=null path=null params={}{add=[131 (1790526232527372288)]} 0 203
[junit4] 2> 152567 INFO (Thread-1505) [ x:collection1 ] o.a.s.u.p.LogUpdateProcessorFactory [collection1] webapp=null path=null params={}{add=[132 (1790526232752816128)]} 0 0
[junit4] 2> 152579 INFO (Thread-1505) [ x:collection1 ] o.a.s.u.p.LogUpdateProcessorFactory [collection1] webapp=null path=null params={}{add=[133 (1790526232765399040)]} 0 0
[junit4] 2> 152590 INFO (Thread-1505) [ x:collection1 ] o.a.s.u.p.LogUpdateProcessorFactory [collection1] webapp=null path=null params={}{add=[134 (1790526232777981952)]} 0 0
[junit4] 2> 152602 INFO (Thread-1505) [ x:collection1 ] o.a.s.u.p.LogUpdateProcessorFactory [collection1] webapp=null path=null params={}{add=[135 (1790526232789516288)]} 0 1
[junit4] 2> 152614 INFO (Thread-1505) [ x:collection1 ] o.a.s.u.p.LogUpdateProcessorFactory [collection1] webapp=null path=null params={}{add=[136 (1790526232802099200)]} 0 0
[junit4] 2> 152625 INFO (Thread-1505) [ x:collection1 ] o.a.s.u.p.LogUpdateProcessorFactory [collection1] webapp=null path=null params={}{add=[137 (1790526232813633536)]} 0 1
[junit4] 2> 152637 INFO (Thread-1505) [ x:collection1 ] o.a.s.u.p.LogUpdateProcessorFactory [collection1] webapp=null path=null params={}{add=[138 (1790526232826216448)]} 0 0
[junit4] 2> 152649 INFO (Thread-1505) [ x:collection1 ] o.a.s.u.p.LogUpdateProcessorFactory [collection1] webapp=null path=null params={}{add=[139 (1790526232838799360)]} 0 0
[junit4] 2> 152660 INFO (Thread-1505) [ x:collection1 ] o.a.s.u.p.LogUpdateProcessorFactory [collection1] webapp=null path=null params={}{add=[140 (1790526232850333696)]} 0 1
[junit4] 2> 152672 INFO (Thread-1505) [ x:collection1 ] o.a.s.u.p.LogUpdateProcessorFactory [collection1] webapp=null path=null params={}{add=[141 (1790526232862916608)]} 0 0
[junit4] 2> 152684 INFO (Thread-1505) [ x:collection1 ] o.a.s.u.p.LogUpdateProcessorFactory [collection1] webapp=null path=null params={}{add=[142 (1790526232875499520)]} 0 1
[junit4] 2> 152695 INFO (Thread-1505) [ x:collection1 ] o.a.s.u.p.LogUpdateProcessorFactory [collection1] webapp=null path=null params={}{add=[143 (1790526232887033856)]} 0 0
[junit4] 2> 152709 INFO (Thread-1505) [ x:collection1 ] o.a.s.u.p.LogUpdateProcessorFactory [collection1] webapp=null path=null params={}{add=[144 (1790526232899616768)]} 0 3
[junit4] 2> 152720 INFO (Thread-1505) [ x:collection1 ] o.a.s.u.p.LogUpdateProcessorFactory [collection1] webapp=null path=null params={}{add=[145 (1790526232914296832)]} 0 0
[junit4] 2> 152731 INFO (Thread-1505) [ x:collection1 ] o.a.s.u.p.LogUpdateProcessorFactory [collection1] webapp=null path=null params={}{add=[146 (1790526232925831168)]} 0 0
[junit4] 2> 152743 INFO (Thread-1505) [ x:collection1 ] o.a.s.u.p.LogUpdateProcessorFactory [collection1] webapp=null path=null params={}{add=[147 (1790526232937365504)]} 0 0
[junit4] 2> 152765 INFO (Thread-1505) [ x:collection1 ] o.a.s.u.p.LogUpdateProcessorFactory [collection1] webapp=null path=null params={}{add=[148 (1790526232948899840)]} 0 12
[junit4] 2> 152776 INFO (Thread-1505) [ x:collection1 ] o.a.s.u.p.LogUpdateProcessorFactory [collection1] webapp=null path=null params={}{add=[149 (1790526232973017088)]} 0 0
[junit4] 2> 152788 INFO (Thread-1505) [ x:collection1 ] o.a.s.u.p.LogUpdateProcessorFactory [collection1] webapp=null path=null params={}{add=[150 (1790526232984551424)]} 0 0
[junit4] 2> 152799 INFO (Thread-1505) [ x:collection1 ] o.a.s.u.p.LogUpdateProcessorFactory [collection1] webapp=null path=null params={}{add=[151 (1790526232996085760)]} 0 0
[junit4] 2> 152810 INFO (Thread-1505) [ x:collection1 ] o.a.s.u.p.LogUpdateProcessorFactory [collection1] webapp=null path=null params={}{add=[152 (1790526233008668672)]} 0 0
[junit4] 2> 152822 INFO (Thread-1505) [ x:collection1 ] o.a.s.u.p.LogUpdateProcessorFactory [collection1] webapp=null path=null params={}{add=[153 (1790526233020203008)]} 0 0
[junit4] 2> 152833 INFO (Thread-1505) [ x:collection1 ] o.a.s.u.p.LogUpdateProcessorFactory [collection1] webapp=null path=null params={}{add=[154 (1790526233032785920)]} 0 0
[junit4] 2> 152844 INFO (Thread-1505) [ x:collection1 ] o.a.s.u.p.LogUpdateProcessorFactory [collection1] webapp=null path=null params={}{add=[155 (1790526233044320256)]} 0 0
[junit4] 2> 153241 INFO (Thread-1505) [ x:collection1 ] o.a.s.u.p.LogUpdateProcessorFactory [collection1] webapp=null path=null params={}{add=[156 (1790526233055854592)]} 0 385
[junit4] 2> 153254 INFO (Thread-1505) [ x:collection1 ] o.a.s.u.p.LogUpdateProcessorFactory [collection1] webapp=null path=null params={}{add=[157 (1790526233473187840)]} 0 1
[junit4] 2> 153265 INFO (Thread-1505) [ x:collection1 ] o.a.s.u.p.LogUpdateProcessorFactory [collection1] webapp=null path=null params={}{add=[158 (1790526233485770752)]} 0 1
[junit4] 2> 153294 INFO (Thread-1505) [ x:collection1 ] o.a.s.u.p.LogUpdateProcessorFactory [collection1] webapp=null path=null params={}{add=[159 (1790526233502547968)]} 0 13
[junit4] 2> 153347 INFO (Thread-1505) [ x:collection1 ] o.a.s.u.p.LogUpdateProcessorFactory [collection1] webapp=null path=null params={}{add=[160 (1790526233527713792)]} 0 42
[junit4] 2> 153360 INFO (Thread-1505) [ x:collection1 ] o.a.s.u.p.LogUpdateProcessorFactory [collection1] webapp=null path=null params={}{add=[161 (1790526233584336896)]} 0 1
[junit4] 2> 153373 INFO (Thread-1505) [ x:collection1 ] o.a.s.u.p.LogUpdateProcessorFactory [collection1] webapp=null path=null params={}{add=[162 (1790526233596919808)]} 0 2
[junit4] 2> 153385 INFO (Thread-1505) [ x:collection1 ] o.a.s.u.p.LogUpdateProcessorFactory [collection1] webapp=null path=null params={}{add=[163 (1790526233610551296)]} 0 1
[junit4] 2> 153396 INFO (Thread-1505) [ x:collection1 ] o.a.s.u.p.LogUpdateProcessorFactory [collection1] webapp=null path=null params={}{add=[164 (1790526233623134208)]} 0 0
[junit4] 2> 153409 INFO (Thread-1505) [ x:collection1 ] o.a.s.u.p.LogUpdateProcessorFactory [collection1] webapp=null path=null params={}{add=[165 (1790526233635717120)]} 0 0
[junit4] 2> 153420 INFO (Thread-1505) [ x:collection1 ] o.a.s.u.p.LogUpdateProcessorFactory [collection1] webapp=null path=null params={}{add=[166 (1790526233648300032)]} 0 0
[junit4] 2> 153431 INFO (Thread-1505) [ x:collection1 ] o.a.s.u.p.LogUpdateProcessorFactory [collection1] webapp=null path=null params={}{add=[167 (1790526233659834368)]} 0 0
[junit4] 2> 153444 INFO (Thread-1505) [ x:collection1 ] o.a.s.u.p.LogUpdateProcessorFactory [collection1] webapp=null path=null params={}{add=[168 (1790526233671368704)]} 0 2
[junit4] 2> 153456 INFO (Thread-1505) [ x:collection1 ] o.a.s.u.p.LogUpdateProcessorFactory [collection1] webapp=null path=null params={}{add=[169 (1790526233685000192)]} 0 1
[junit4] 2> 153468 INFO (Thread-1505) [ x:collection1 ] o.a.s.u.p.LogUpdateProcessorFactory [collection1] webapp=null path=null params={}{add=[170 (1790526233697583104)]} 0 0
[junit4] 2> 153479 INFO (Thread-1505) [ x:collection1 ] o.a.s.u.p.LogUpdateProcessorFactory [collection1] webapp=null path=null params={}{add=[171 (1790526233709117440)]} 0 0
[junit4] 2> 153492 INFO (Thread-1505) [ x:collection1 ] o.a.s.u.p.LogUpdateProcessorFactory [collection1] webapp=null path=null params={}{add=[172 (1790526233722748928)]} 0 1
[junit4] 2> 153503 INFO (Thread-1505) [ x:collection1 ] o.a.s.u.p.LogUpdateProcessorFactory [collection1] webapp=null path=null params={}{add=[173 (1790526233734283264)]} 0 0
[junit4] 2> 153515 INFO (Thread-1505) [ x:collection1 ] o.a.s.u.p.LogUpdateProcessorFactory [collection1] webapp=null path=null params={}{add=[174 (1790526233746866176)]} 0 1
[junit4] 2> 153527 INFO (Thread-1505) [ x:collection1 ] o.a.s.u.p.LogUpdateProcessorFactory [collection1] webapp=null path=null params={}{add=[175 (1790526233759449088)]} 0 0
[junit4] 2> 153545 INFO (Thread-1505) [ x:collection1 ] o.a.s.u.p.LogUpdateProcessorFactory [collection1] webapp=null path=null params={}{add=[176 (1790526233773080576)]} 0 7
[junit4] 2> 153557 INFO (Thread-1505) [ x:collection1 ] o.a.s.u.p.LogUpdateProcessorFactory [collection1] webapp=null path=null params={}{add=[177 (1790526233790906368)]} 0 0
[junit4] 2> 153575 INFO (Thread-1505) [ x:collection1 ] o.a.s.u.p.LogUpdateProcessorFactory [collection1] webapp=null path=null params={}{add=[178 (1790526233804537856)]} 0 6
[junit4] 2> 153608 INFO (Thread-1505) [ x:collection1 ] o.a.s.u.p.LogUpdateProcessorFactory [collection1] webapp=null path=null params={}{add=[179 (1790526233822363648)]} 0 21
[junit4] 2> 153619 INFO (Thread-1505) [ x:collection1 ] o.a.s.u.p.LogUpdateProcessorFactory [collection1] webapp=null path=null params={}{add=[180 (1790526233856966656)]} 0 0
[junit4] 2> 153631 INFO (Thread-1505) [ x:collection1 ] o.a.s.u.p.LogUpdateProcessorFactory [collection1] webapp=null path=null params={}{add=[181 (1790526233868500992)]} 0 0
[junit4] 2> 153644 INFO (Thread-1505) [ x:collection1 ] o.a.s.u.p.LogUpdateProcessorFactory [collection1] webapp=null path=null params={}{add=[182 (1790526233881083904)]} 0 2
[junit4] 2> 153657 INFO (Thread-1505) [ x:collection1 ] o.a.s.u.p.LogUpdateProcessorFactory [collection1] webapp=null path=null params={}{add=[183 (1790526233894715392)]} 0 1
[junit4] 2> 153669 INFO (Thread-1505) [ x:collection1 ] o.a.s.u.p.LogUpdateProcessorFactory [collection1] webapp=null path=null params={}{add=[184 (1790526233908346880)]} 0 1
[junit4] 2> 153681 INFO (Thread-1505) [ x:collection1 ] o.a.s.u.p.LogUpdateProcessorFactory [collection1] webapp=null path=null params={}{add=[185 (1790526233920929792)]} 0 1
[junit4] 2> 153693 INFO (Thread-1505) [ x:collection1 ] o.a.s.u.p.LogUpdateProcessorFactory [collection1] webapp=null path=null params={}{add=[186 (1790526233933512704)]} 0 1
[junit4] 2> 153705 INFO (Thread-1505) [ x:collection1 ] o.a.s.u.p.LogUpdateProcessorFactory [collection1] webapp=null path=null params={}{add=[187 (1790526233946095616)]} 0 1
[junit4] 2> 153716 INFO (Thread-1505) [ x:collection1 ] o.a.s.u.p.LogUpdateProcessorFactory [collection1] webapp=null path=null params={}{add=[188 (1790526233958678528)]} 0 0
[junit4] 2> 153728 INFO (Thread-1505) [ x:collection1 ] o.a.s.u.p.LogUpdateProcessorFactory [collection1] webapp=null path=null params={}{add=[189 (1790526233970212864)]} 0 1
[junit4] 2> 153740 INFO (Thread-1505) [ x:collection1 ] o.a.s.u.p.LogUpdateProcessorFactory [collection1] webapp=null path=null params={}{add=[190 (1790526233982795776)]} 0 1
[junit4] 2> 153751 INFO (Thread-1505) [ x:collection1 ] o.a.s.u.p.LogUpdateProcessorFactory [collection1] webapp=null path=null params={}{add=[191 (1790526233995378688)]} 0 0
[junit4] 2> 153763 INFO (Thread-1505) [ x:collection1 ] o.a.s.u.p.LogUpdateProcessorFactory [collection1] webapp=null path=null params={}{add=[192 (1790526234006913024)]} 0 0
[junit4] 2> 153775 INFO (Thread-1505) [ x:collection1 ] o.a.s.u.p.LogUpdateProcessorFactory [collection1] webapp=null path=null params={}{add=[193 (1790526234019495936)]} 0 1
[junit4] 2> 153789 INFO (Thread-1505) [ x:collection1 ] o.a.s.u.p.LogUpdateProcessorFactory [collection1] webapp=null path=null params={}{add=[194 (1790526234032078848)]} 0 3
[junit4] 2> 153801 INFO (Thread-1505) [ x:collection1 ] o.a.s.u.p.LogUpdateProcessorFactory [collection1] webapp=null path=null params={}{add=[195 (1790526234046758912)]} 0 0
[junit4] 2> 153812 INFO (Thread-1505) [ x:collection1 ] o.a.s.u.p.LogUpdateProcessorFactory [collection1] webapp=null path=null params={}{add=[196 (1790526234058293248)]} 0 0
[junit4] 2> 153824 INFO (Thread-1505) [ x:collection1 ] o.a.s.u.p.LogUpdateProcessorFactory [collection1] webapp=null path=null params={}{add=[197 (1790526234070876160)]} 0 0
[junit4] 2> 153836 INFO (Thread-1505) [ x:collection1 ] o.a.s.u.p.LogUpdateProcessorFactory [collection1] webapp=null path=null params={}{add=[198 (1790526234082410496)]} 0 1
[junit4] 2> 153849 INFO (Thread-1505) [ x:collection1 ] o.a.s.u.p.LogUpdateProcessorFactory [collection1] webapp=null path=null params={}{add=[199 (1790526234097090560)]} 0 1
[junit4] 2> 153861 INFO (Thread-1505) [ x:collection1 ] o.a.s.u.p.LogUpdateProcessorFactory [collection1] webapp=null path=null params={}{add=[200 (1790526234109673472)]} 0 1
[junit4] 2> 153875 INFO (Thread-1505) [ x:collection1 ] o.a.s.u.p.LogUpdateProcessorFactory [collection1] webapp=null path=null params={}{add=[201 (1790526234123304960)]} 0 2
[junit4] 2> 153887 INFO (Thread-1505) [ x:collection1 ] o.a.s.u.p.LogUpdateProcessorFactory [collection1] webapp=null path=null params={}{add=[202 (1790526234136936448)]} 0 0
[junit4] 2> 153899 INFO (Thread-1505) [ x:collection1 ] o.a.s.u.p.LogUpdateProcessorFactory [collection1] webapp=null path=null params={}{add=[203 (1790526234150567936)]} 0 0
[junit4] 2> 153914 INFO (Thread-1505) [ x:collection1 ] o.a.s.u.p.LogUpdateProcessorFactory [collection1] webapp=null path=null params={}{add=[204 (1790526234162102272)]} 0 3
[junit4] 2> 153927 INFO (Thread-1505) [ x:collection1 ] o.a.s.u.p.LogUpdateProcessorFactory [collection1] webapp=null path=null params={}{add=[205 (1790526234177830912)]} 0 2
[junit4] 2> 153938 INFO (Thread-1505) [ x:collection1 ] o.a.s.u.p.LogUpdateProcessorFactory [collection1] webapp=null path=null params={}{add=[206 (1790526234190413824)]} 0 0
[junit4] 2> 153949 INFO (Thread-1505) [ x:collection1 ] o.a.s.u.p.LogUpdateProcessorFactory [collection1] webapp=null path=null params={}{add=[207 (1790526234202996736)]} 0 0
[junit4] 2> 153961 INFO (Thread-1505) [ x:collection1 ] o.a.s.u.p.LogUpdateProcessorFactory [collection1] webapp=null path=null params={}{add=[208 (1790526234214531072)]} 0 0
[junit4] 2> 153973 INFO (Thread-1505) [ x:collection1 ] o.a.s.u.p.LogUpdateProcessorFactory [collection1] webapp=null path=null params={}{add=[209 (1790526234227113984)]} 0 0
[junit4] 2> 153984 INFO (Thread-1505) [ x:collection1 ] o.a.s.u.p.LogUpdateProcessorFactory [collection1] webapp=null path=null params={}{add=[210 (1790526234238648320)]} 0 1
[junit4] 2> 153996 INFO (Thread-1505) [ x:collection1 ] o.a.s.u.p.LogUpdateProcessorFactory [collection1] webapp=null path=null params={}{add=[211 (1790526234251231232)]} 0 0
[junit4] 2> 154007 INFO (Thread-1505) [ x:collection1 ] o.a.s.u.p.LogUpdateProcessorFactory [collection1] webapp=null path=null params={}{add=[212 (1790526234262765568)]} 0 0
[junit4] 2> 154018 INFO (Thread-1505) [ x:collection1 ] o.a.s.u.p.LogUpdateProcessorFactory [collection1] webapp=null path=null params={}{add=[213 (1790526234275348480)]} 0 0
[junit4] 2> 154029 INFO (Thread-1505) [ x:collection1 ] o.a.s.u.p.LogUpdateProcessorFactory [collection1] webapp=null path=null params={}{add=[214 (1790526234286882816)]} 0 0
[junit4] 2> 154041 INFO (Thread-1505) [ x:collection1 ] o.a.s.u.p.LogUpdateProcessorFactory [collection1] webapp=null path=null params={}{add=[215 (1790526234298417152)]} 0 0
[junit4] 2> 154052 INFO (Thread-1505) [ x:collection1 ] o.a.s.u.p.LogUpdateProcessorFactory [collection1] webapp=null path=null params={}{add=[216 (1790526234309951488)]} 0 0
[junit4] 2> 154066 INFO (Thread-1505) [ x:collection1 ] o.a.s.u.p.LogUpdateProcessorFactory [collection1] webapp=null path=null params={}{add=[217 (1790526234321485824)]} 0 3
[junit4] 2> 154078 INFO (Thread-1505) [ x:collection1 ] o.a.s.u.p.LogUpdateProcessorFactory [collection1] webapp=null path=null params={}{add=[218 (1790526234336165888)]} 0 2
[junit4] 2> 154093 INFO (Thread-1505) [ x:collection1 ] o.a.s.u.p.LogUpdateProcessorFactory [collection1] webapp=null path=null params={}{add=[219 (1790526234349797376)]} 0 4
[junit4] 2> 154105 INFO (Thread-1505) [ x:collection1 ] o.a.s.u.p.LogUpdateProcessorFactory [collection1] webapp=null path=null params={}{add=[220 (1790526234365526016)]} 0 1
[junit4] 2> 154118 INFO (Thread-1505) [ x:collection1 ] o.a.s.u.p.LogUpdateProcessorFactory [coll
[...truncated too long message...]
es_link/terms/shard1
[junit4] 2> 2 /solr/collections/control_collection/terms/shard1
[junit4] 2>
[junit4] 2> Maximum concurrent data watches above limit:
[junit4] 2>
[junit4] 2> 62 /solr/clusterstate.json
[junit4] 2> 61 /solr/collections/testSplitMixedReplicaTypes_link/state.json
[junit4] 2> 7 /solr/clusterprops.json
[junit4] 2> 5 /solr/collections/control_collection/state.json
[junit4] 2> 3 /solr/overseer_elect/election/72071144297070596-127.0.0.1:32853_-n_0000000000
[junit4] 2> 2 /solr/overseer_elect/election/72071144297070607-127.0.0.1:40455_-n_0000000002
[junit4] 2>
[junit4] 2> Maximum concurrent children watches above limit:
[junit4] 2>
[junit4] 2> 151 /solr/collections/testSplitMixedReplicaTypes_link/state.json
[junit4] 2> 38 /solr/overseer/queue
[junit4] 2> 34 /solr/live_nodes
[junit4] 2> 22 /solr/overseer/collection-queue-work
[junit4] 2> 14 /solr/collections
[junit4] 2> 2 /solr/collections/control_collection/state.json
[junit4] 2>
[junit4] 2> 1371520 INFO (TEST-ShardSplitTest.testSplitMixedReplicaTypesLink-seed#[48C24EB070DBE3BF]) [ ] o.a.s.c.ZkTestServer waitForServerDown: 127.0.0.1:32921
[junit4] 2> 1371520 INFO (TEST-ShardSplitTest.testSplitMixedReplicaTypesLink-seed#[48C24EB070DBE3BF]) [ ] o.a.s.c.ZkTestServer parse host and port list: 127.0.0.1:32921
[junit4] 2> 1371520 INFO (TEST-ShardSplitTest.testSplitMixedReplicaTypesLink-seed#[48C24EB070DBE3BF]) [ ] o.a.s.c.ZkTestServer connecting to 127.0.0.1 32921
[junit4] 2> NOTE: reproduce with: ant test -Dtestcase=ShardSplitTest -Dtests.method=testSplitMixedReplicaTypesLink -Dtests.seed=48C24EB070DBE3BF -Dtests.multiplier=2 -Dtests.slow=true -Dtests.locale=es-DO -Dtests.timezone=Etc/GMT-6 -Dtests.asserts=true -Dtests.file.encoding=UTF-8
[junit4] ERROR 135s J3 | ShardSplitTest.testSplitMixedReplicaTypesLink <<<
[junit4] > Throwable #1: org.apache.solr.client.solrj.SolrServerException: Timeout occurred while waiting response from server at: http://127.0.0.1:32853
[junit4] > at __randomizedtesting.SeedInfo.seed([48C24EB070DBE3BF:74AC87E9D5034826]:0)
[junit4] > at org.apache.solr.client.solrj.impl.HttpSolrClient.executeMethod(HttpSolrClient.java:692)
[junit4] > at org.apache.solr.client.solrj.impl.HttpSolrClient.request(HttpSolrClient.java:266)
[junit4] > at org.apache.solr.client.solrj.impl.HttpSolrClient.request(HttpSolrClient.java:248)
[junit4] > at org.apache.solr.client.solrj.impl.LBSolrClient.doRequest(LBSolrClient.java:369)
[junit4] > at org.apache.solr.client.solrj.impl.LBSolrClient.request(LBSolrClient.java:297)
[junit4] > at org.apache.solr.client.solrj.impl.BaseCloudSolrClient.sendRequest(BaseCloudSolrClient.java:1188)
[junit4] > at org.apache.solr.client.solrj.impl.BaseCloudSolrClient.requestWithRetryOnStaleState(BaseCloudSolrClient.java:934)
[junit4] > at org.apache.solr.client.solrj.impl.BaseCloudSolrClient.request(BaseCloudSolrClient.java:866)
[junit4] > at org.apache.solr.client.solrj.SolrRequest.process(SolrRequest.java:225)
[junit4] > at org.apache.solr.client.solrj.SolrRequest.process(SolrRequest.java:242)
[junit4] > at org.apache.solr.cloud.api.collections.ShardSplitTest.doSplitMixedReplicaTypes(ShardSplitTest.java:365)
[junit4] > at org.apache.solr.cloud.api.collections.ShardSplitTest.testSplitMixedReplicaTypesLink(ShardSplitTest.java:356)
[junit4] > at org.apache.solr.BaseDistributedSearchTestCase$ShardsRepeatRule$ShardsFixedStatement.callStatement(BaseDistributedSearchTestCase.java:1084)
[junit4] > at org.apache.solr.BaseDistributedSearchTestCase$ShardsRepeatRule$ShardsStatement.evaluate(BaseDistributedSearchTestCase.java:1055)
[junit4] > at java.lang.Thread.run(Thread.java:750)
[junit4] > Caused by: java.net.SocketTimeoutException: Read timed out
[junit4] > at java.net.SocketInputStream.socketRead0(Native Method)
[junit4] > at java.net.SocketInputStream.socketRead(SocketInputStream.java:116)
[junit4] > at java.net.SocketInputStream.read(SocketInputStream.java:171)
[junit4] > at java.net.SocketInputStream.read(SocketInputStream.java:141)
[junit4] > at org.apache.http.impl.io.SessionInputBufferImpl.streamRead(SessionInputBufferImpl.java:137)
[junit4] > at org.apache.http.impl.io.SessionInputBufferImpl.fillBuffer(SessionInputBufferImpl.java:153)
[junit4] > at org.apache.http.impl.io.SessionInputBufferImpl.readLine(SessionInputBufferImpl.java:280)
[junit4] > at org.apache.http.impl.conn.DefaultHttpResponseParser.parseHead(DefaultHttpResponseParser.java:138)
[junit4] > at org.apache.http.impl.conn.DefaultHttpResponseParser.parseHead(DefaultHttpResponseParser.java:56)
[junit4] > at org.apache.http.impl.io.AbstractMessageParser.parse(AbstractMessageParser.java:259)
[junit4] > at org.apache.http.impl.DefaultBHttpClientConnection.receiveResponseHeader(DefaultBHttpClientConnection.java:163)
[junit4] > at org.apache.http.impl.conn.CPoolProxy.receiveResponseHeader(CPoolProxy.java:157)
[junit4] > at org.apache.http.protocol.HttpRequestExecutor.doReceiveResponse(HttpRequestExecutor.java:273)
[junit4] > at org.apache.http.protocol.HttpRequestExecutor.execute(HttpRequestExecutor.java:125)
[junit4] > at org.apache.http.impl.execchain.MainClientExec.execute(MainClientExec.java:272)
[junit4] > at org.apache.http.impl.execchain.ProtocolExec.execute(ProtocolExec.java:186)
[junit4] > at org.apache.http.impl.execchain.RetryExec.execute(RetryExec.java:89)
[junit4] > at org.apache.http.impl.execchain.RedirectExec.execute(RedirectExec.java:110)
[junit4] > at org.apache.http.impl.client.InternalHttpClient.doExecute(InternalHttpClient.java:185)
[junit4] > at org.apache.http.impl.client.CloseableHttpClient.execute(CloseableHttpClient.java:83)
[junit4] > at org.apache.http.impl.client.CloseableHttpClient.execute(CloseableHttpClient.java:56)
[junit4] > at org.apache.solr.client.solrj.impl.HttpSolrClient.executeMethod(HttpSolrClient.java:571)
[junit4] > ... 57 more
[junit4] 2> 1371523 INFO (SUITE-ShardSplitTest-seed#[48C24EB070DBE3BF]-worker) [ ] o.a.s.u.ErrorLogMuter Closing ErrorLogMuter-regex-15070 after mutting 0 log messages
[junit4] 2> 1371523 INFO (SUITE-ShardSplitTest-seed#[48C24EB070DBE3BF]-worker) [ ] o.a.s.u.ErrorLogMuter Creating ErrorLogMuter-regex-15071 for ERROR logs matching regex: ignore_exception
[junit4] 2> NOTE: leaving temporary files on disk at: /home/jenkins/jenkins-slave/workspace/Lucene/Lucene-Solr-Tests-8.11/solr/build/solr-core/test/J3/temp/solr.cloud.api.collections.ShardSplitTest_48C24EB070DBE3BF-001
[junit4] 2> Feb 10, 2024 3:48:19 PM com.carrotsearch.randomizedtesting.ThreadLeakControl checkThreadLeaks
[junit4] 2> WARNING: Will linger awaiting termination of 1 leaked thread(s).
[junit4] 2> NOTE: test params are: codec=Asserting(Lucene87): {rnd_b=Lucene84, a_t=PostingsFormat(name=LuceneVarGapFixedInterval), _root_=PostingsFormat(name=LuceneVarGapFixedInterval), id=Lucene84, foo_s=PostingsFormat(name=LuceneVarGapFixedInterval)}, docValues:{_version_=DocValuesFormat(name=Asserting), a_i=DocValuesFormat(name=Lucene80)}, maxPointsInLeafNode=1681, maxMBSortInHeap=5.9762137755308, sim=Asserting(RandomSimilarity(queryNorm=false): {}), locale=es-DO, timezone=Etc/GMT-6
[junit4] 2> NOTE: Linux 5.4.0-171-generic amd64/Temurin 1.8.0_362 (64-bit)/cpus=4,threads=1,free=144838680,total=518520832
[junit4] 2> NOTE: All tests run in this JVM: [CheckHdfsIndexTest, TestCoreContainer, TestHdfsUpdateLog, TestSolrCLIRunExample, NodeLostTriggerTest, ManagedSchemaRoundRobinCloudTest, BasicDistributedZkTest, TestHighFrequencyDictionaryFactory, TestCloudRecovery2, BadComponentTest, TestConfigSetsAPIExclusivity, ShardBackupIdTest, TestSolrXml, TestMergePolicyConfig, TestJsonRequest, TestJavabinTupleStreamParser, TestQueryingOnDownCollection, TestCSVResponseWriter, TestIBSimilarityFactory, ClassificationUpdateProcessorFactoryTest, TestPrepRecovery, TestNumericTerms32, ScheduledTriggerIntegrationTest, V2StandaloneTest, ConjunctionSolrSpellCheckerTest, ConnectionManagerTest, TestExportWriter, BJQParserTest, QueryResultKeyTest, AnalysisErrorHandlingTest, XMLAtomicUpdateMultivalueTest, TestStandardQParsers, PeerSyncWithBufferUpdatesTest, DistributedFacetPivotWhiteBoxTest, TestNestedDocsSort, TestSimDistribStateManager, TestCustomSort, TestLegacyFieldReuse, TestRequestStatusCollectionAPI, TestSimGenericDistributedQueue, TestFieldCollectionResource, SolrMetricManagerTest, ReplaceNodeNoTargetTest, SharedFSAutoReplicaFailoverTest, TestInfoStreamLogging, TestMaxScoreQueryParser, XmlInterpolationTest, SplitHandlerTest, DocumentAnalysisRequestHandlerTest, TestTermsQParserPlugin, TestTrie, OverseerTaskQueueTest, ForceLeaderWithTlogReplicasTest, TestDynamicFieldNamesIndexCorrectly, V2CollectionBackupsAPIMappingTest, TestInPlaceUpdatesStandalone, TestRandomFaceting, TestSuggestSpellingConverter, TestCollationFieldDocValues, DateRangeFieldTest, TermVectorComponentTest, JWTAuthPluginIntegrationTest, HdfsChaosMonkeyNothingIsSafeTest, HttpPartitionWithTlogReplicasTest, ManagedSchemaDiffTest, TestUseDocValuesAsStored, TriggerIntegrationTest, SparseHLLTest, TestSolrCloudWithSecureImpersonation, TestStreamBody, TestNumericRangeQuery32, TestJsonFacetRefinement, TestSnapshotCloudManager, SolrXmlInZkTest, ZkCLITest, HdfsCloudIncrementalBackupTest, LegacyCloudClusterPropTest, TestDeleteCollectionOnDownNodes, TestQuerySenderNoQuery, HighlighterTest, TestMaxTokenLenTokenizer, DirectUpdateHandlerTest, TlogReplayBufferedWhileIndexingTest, URLClassifyProcessorTest, ShardSplitTest]
[junit4] Completed [482/959 (3!)] on J3 in 298.87s, 11 tests, 1 error, 3 skipped <<< FAILURES!
[...truncated 56066 lines...]
[JENKINS] Lucene » Lucene-Solr-Tests-8.11 - Build # 526 - Still Unstable!
Posted by Apache Jenkins Server <je...@builds.apache.org>.
Build: https://ci-builds.apache.org/job/Lucene/job/Lucene-Solr-Tests-8.11/526/
1 tests failed.
FAILED: org.apache.solr.cloud.TestTlogReplica.testRemoveLeader
Error Message:
Expected collection to be 1x2 Timeout waiting to see state for collection=tlog_replica_test_remove_leader :DocCollection(tlog_replica_test_remove_leader//collections/tlog_replica_test_remove_leader/state.json/10 )={ "pullReplicas":"0", "replicationFactor":"0", "shards":{"shard1":{ "range":"80000000-7fffffff", "state":"active", "replicas":{ "core_node4":{ "core":"tlog_replica_test_remove_leader_shard1_replica_t2", "node_name":"127.0.0.1:44217_solr", "base_url":"https://127.0.0.1:44217/solr", "state":"active", "type":"TLOG", "force_set_state":"false", "leader":"true"}, "core_node6":{ "core":"tlog_replica_test_remove_leader_shard1_replica_t5", "state":"down", "node_name":"127.0.0.1:40753_solr", "base_url":"https://127.0.0.1:40753/solr", "force_set_state":"false", "type":"TLOG"}, "core_node8":{ "core":"tlog_replica_test_remove_leader_shard1_replica_t7", "state":"down", "node_name":"127.0.0.1:40753_solr", "base_url":"https://127.0.0.1:40753/solr", "force_set_state":"false", "type":"TLOG"}, "core_node10":{ "core":"tlog_replica_test_remove_leader_shard1_replica_t9", "state":"down", "node_name":"127.0.0.1:40753_solr", "base_url":"https://127.0.0.1:40753/solr", "force_set_state":"false", "type":"TLOG"}}}}, "router":{"name":"compositeId"}, "maxShardsPerNode":"100", "autoAddReplicas":"false", "nrtReplicas":"0", "tlogReplicas":"2"} Live Nodes: [127.0.0.1:40753_solr, 127.0.0.1:44217_solr] Last available state: DocCollection(tlog_replica_test_remove_leader//collections/tlog_replica_test_remove_leader/state.json/10 )={ "pullReplicas":"0", "replicationFactor":"0", "shards":{"shard1":{ "range":"80000000-7fffffff", "state":"active", "replicas":{ "core_node4":{ "core":"tlog_replica_test_remove_leader_shard1_replica_t2", "node_name":"127.0.0.1:44217_solr", "base_url":"https://127.0.0.1:44217/solr", "state":"active", "type":"TLOG", "force_set_state":"false", "leader":"true"}, "core_node6":{ "core":"tlog_replica_test_remove_leader_shard1_replica_t5", "state":"down", "node_name":"127.0.0.1:40753_solr", "base_url":"https://127.0.0.1:40753/solr", "force_set_state":"false", "type":"TLOG"}, "core_node8":{ "core":"tlog_replica_test_remove_leader_shard1_replica_t7", "state":"down", "node_name":"127.0.0.1:40753_solr", "base_url":"https://127.0.0.1:40753/solr", "force_set_state":"false", "type":"TLOG"}, "core_node10":{ "core":"tlog_replica_test_remove_leader_shard1_replica_t9", "state":"down", "node_name":"127.0.0.1:40753_solr", "base_url":"https://127.0.0.1:40753/solr", "force_set_state":"false", "type":"TLOG"}}}}, "router":{"name":"compositeId"}, "maxShardsPerNode":"100", "autoAddReplicas":"false", "nrtReplicas":"0", "tlogReplicas":"2"}
Stack Trace:
java.lang.AssertionError: Expected collection to be 1x2
Timeout waiting to see state for collection=tlog_replica_test_remove_leader :DocCollection(tlog_replica_test_remove_leader//collections/tlog_replica_test_remove_leader/state.json/10 )={
"pullReplicas":"0",
"replicationFactor":"0",
"shards":{"shard1":{
"range":"80000000-7fffffff",
"state":"active",
"replicas":{
"core_node4":{
"core":"tlog_replica_test_remove_leader_shard1_replica_t2",
"node_name":"127.0.0.1:44217_solr",
"base_url":"https://127.0.0.1:44217/solr",
"state":"active",
"type":"TLOG",
"force_set_state":"false",
"leader":"true"},
"core_node6":{
"core":"tlog_replica_test_remove_leader_shard1_replica_t5",
"state":"down",
"node_name":"127.0.0.1:40753_solr",
"base_url":"https://127.0.0.1:40753/solr",
"force_set_state":"false",
"type":"TLOG"},
"core_node8":{
"core":"tlog_replica_test_remove_leader_shard1_replica_t7",
"state":"down",
"node_name":"127.0.0.1:40753_solr",
"base_url":"https://127.0.0.1:40753/solr",
"force_set_state":"false",
"type":"TLOG"},
"core_node10":{
"core":"tlog_replica_test_remove_leader_shard1_replica_t9",
"state":"down",
"node_name":"127.0.0.1:40753_solr",
"base_url":"https://127.0.0.1:40753/solr",
"force_set_state":"false",
"type":"TLOG"}}}},
"router":{"name":"compositeId"},
"maxShardsPerNode":"100",
"autoAddReplicas":"false",
"nrtReplicas":"0",
"tlogReplicas":"2"}
Live Nodes: [127.0.0.1:40753_solr, 127.0.0.1:44217_solr]
Last available state: DocCollection(tlog_replica_test_remove_leader//collections/tlog_replica_test_remove_leader/state.json/10 )={
"pullReplicas":"0",
"replicationFactor":"0",
"shards":{"shard1":{
"range":"80000000-7fffffff",
"state":"active",
"replicas":{
"core_node4":{
"core":"tlog_replica_test_remove_leader_shard1_replica_t2",
"node_name":"127.0.0.1:44217_solr",
"base_url":"https://127.0.0.1:44217/solr",
"state":"active",
"type":"TLOG",
"force_set_state":"false",
"leader":"true"},
"core_node6":{
"core":"tlog_replica_test_remove_leader_shard1_replica_t5",
"state":"down",
"node_name":"127.0.0.1:40753_solr",
"base_url":"https://127.0.0.1:40753/solr",
"force_set_state":"false",
"type":"TLOG"},
"core_node8":{
"core":"tlog_replica_test_remove_leader_shard1_replica_t7",
"state":"down",
"node_name":"127.0.0.1:40753_solr",
"base_url":"https://127.0.0.1:40753/solr",
"force_set_state":"false",
"type":"TLOG"},
"core_node10":{
"core":"tlog_replica_test_remove_leader_shard1_replica_t9",
"state":"down",
"node_name":"127.0.0.1:40753_solr",
"base_url":"https://127.0.0.1:40753/solr",
"force_set_state":"false",
"type":"TLOG"}}}},
"router":{"name":"compositeId"},
"maxShardsPerNode":"100",
"autoAddReplicas":"false",
"nrtReplicas":"0",
"tlogReplicas":"2"}
at __randomizedtesting.SeedInfo.seed([4E9B597644CD04AF:D7DB9E12034464E5]:0)
at org.junit.Assert.fail(Assert.java:89)
at org.apache.solr.cloud.SolrCloudTestCase.waitForState(SolrCloudTestCase.java:336)
at org.apache.solr.cloud.SolrCloudTestCase.waitForState(SolrCloudTestCase.java:313)
at org.apache.solr.cloud.TestTlogReplica.doReplaceLeader(TestTlogReplica.java:425)
at org.apache.solr.cloud.TestTlogReplica.testRemoveLeader(TestTlogReplica.java:323)
at sun.reflect.NativeMethodAccessorImpl.invoke0(Native Method)
at sun.reflect.NativeMethodAccessorImpl.invoke(NativeMethodAccessorImpl.java:62)
at sun.reflect.DelegatingMethodAccessorImpl.invoke(DelegatingMethodAccessorImpl.java:43)
at java.lang.reflect.Method.invoke(Method.java:498)
at com.carrotsearch.randomizedtesting.RandomizedRunner.invoke(RandomizedRunner.java:1758)
at com.carrotsearch.randomizedtesting.RandomizedRunner$8.evaluate(RandomizedRunner.java:946)
at com.carrotsearch.randomizedtesting.RandomizedRunner$9.evaluate(RandomizedRunner.java:982)
at com.carrotsearch.randomizedtesting.RandomizedRunner$10.evaluate(RandomizedRunner.java:996)
at com.carrotsearch.randomizedtesting.rules.SystemPropertiesRestoreRule$1.evaluate(SystemPropertiesRestoreRule.java:80)
at org.junit.rules.RunRules.evaluate(RunRules.java:20)
at org.apache.lucene.util.TestRuleSetupTeardownChained$1.evaluate(TestRuleSetupTeardownChained.java:49)
at org.apache.lucene.util.AbstractBeforeAfterRule$1.evaluate(AbstractBeforeAfterRule.java:45)
at org.apache.lucene.util.TestRuleThreadAndTestName$1.evaluate(TestRuleThreadAndTestName.java:48)
at org.apache.lucene.util.TestRuleIgnoreAfterMaxFailures$1.evaluate(TestRuleIgnoreAfterMaxFailures.java:64)
at org.apache.lucene.util.TestRuleMarkFailure$1.evaluate(TestRuleMarkFailure.java:47)
at org.junit.rules.RunRules.evaluate(RunRules.java:20)
at com.carrotsearch.randomizedtesting.rules.StatementAdapter.evaluate(StatementAdapter.java:36)
at com.carrotsearch.randomizedtesting.ThreadLeakControl$StatementRunner.run(ThreadLeakControl.java:390)
at com.carrotsearch.randomizedtesting.ThreadLeakControl.forkTimeoutingTask(ThreadLeakControl.java:843)
at com.carrotsearch.randomizedtesting.ThreadLeakControl$3.evaluate(ThreadLeakControl.java:490)
at com.carrotsearch.randomizedtesting.RandomizedRunner.runSingleTest(RandomizedRunner.java:955)
at com.carrotsearch.randomizedtesting.RandomizedRunner$5.evaluate(RandomizedRunner.java:840)
at com.carrotsearch.randomizedtesting.RandomizedRunner$6.evaluate(RandomizedRunner.java:891)
at com.carrotsearch.randomizedtesting.RandomizedRunner$7.evaluate(RandomizedRunner.java:902)
at com.carrotsearch.randomizedtesting.rules.StatementAdapter.evaluate(StatementAdapter.java:36)
at com.carrotsearch.randomizedtesting.rules.SystemPropertiesRestoreRule$1.evaluate(SystemPropertiesRestoreRule.java:80)
at org.junit.rules.RunRules.evaluate(RunRules.java:20)
at org.apache.lucene.util.AbstractBeforeAfterRule$1.evaluate(AbstractBeforeAfterRule.java:45)
at com.carrotsearch.randomizedtesting.rules.StatementAdapter.evaluate(StatementAdapter.java:36)
at org.apache.lucene.util.TestRuleStoreClassName$1.evaluate(TestRuleStoreClassName.java:41)
at com.carrotsearch.randomizedtesting.rules.NoShadowingOrOverridesOnMethodsRule$1.evaluate(NoShadowingOrOverridesOnMethodsRule.java:40)
at com.carrotsearch.randomizedtesting.rules.NoShadowingOrOverridesOnMethodsRule$1.evaluate(NoShadowingOrOverridesOnMethodsRule.java:40)
at com.carrotsearch.randomizedtesting.rules.StatementAdapter.evaluate(StatementAdapter.java:36)
at com.carrotsearch.randomizedtesting.rules.StatementAdapter.evaluate(StatementAdapter.java:36)
at com.carrotsearch.randomizedtesting.rules.StatementAdapter.evaluate(StatementAdapter.java:36)
at org.apache.lucene.util.TestRuleAssertionsRequired$1.evaluate(TestRuleAssertionsRequired.java:53)
at org.apache.lucene.util.TestRuleMarkFailure$1.evaluate(TestRuleMarkFailure.java:47)
at org.apache.lucene.util.TestRuleIgnoreAfterMaxFailures$1.evaluate(TestRuleIgnoreAfterMaxFailures.java:64)
at org.apache.lucene.util.TestRuleIgnoreTestSuites$1.evaluate(TestRuleIgnoreTestSuites.java:54)
at org.junit.rules.RunRules.evaluate(RunRules.java:20)
at com.carrotsearch.randomizedtesting.rules.StatementAdapter.evaluate(StatementAdapter.java:36)
at com.carrotsearch.randomizedtesting.ThreadLeakControl$StatementRunner.run(ThreadLeakControl.java:390)
at com.carrotsearch.randomizedtesting.ThreadLeakControl.lambda$forkTimeoutingTask$0(ThreadLeakControl.java:850)
at java.lang.Thread.run(Thread.java:750)
Build Log:
[...truncated 15355 lines...]
[junit4] Suite: org.apache.solr.cloud.TestTlogReplica
[junit4] 2> 1547293 INFO (SUITE-TestTlogReplica-seed#[4E9B597644CD04AF]-worker) [ ] o.a.s.SolrTestCase Setting 'solr.default.confdir' system property to test-framework derived value of '/home/jenkins/jenkins-slave/workspace/Lucene/Lucene-Solr-Tests-8.11/solr/server/solr/configsets/_default/conf'
[junit4] 2> 1547294 INFO (SUITE-TestTlogReplica-seed#[4E9B597644CD04AF]-worker) [ ] o.a.s.u.ErrorLogMuter Closing ErrorLogMuter-regex-381 after mutting 0 log messages
[junit4] 2> 1547294 INFO (SUITE-TestTlogReplica-seed#[4E9B597644CD04AF]-worker) [ ] o.a.s.u.ErrorLogMuter Creating ErrorLogMuter-regex-382 for ERROR logs matching regex: ignore_exception
[junit4] 2> 1547294 INFO (SUITE-TestTlogReplica-seed#[4E9B597644CD04AF]-worker) [ ] o.a.s.SolrTestCaseJ4 Created dataDir: /home/jenkins/jenkins-slave/workspace/Lucene/Lucene-Solr-Tests-8.11/solr/build/solr-core/test/J2/temp/solr.cloud.TestTlogReplica_4E9B597644CD04AF-001/data-dir-134-001
[junit4] 2> 1547294 WARN (SUITE-TestTlogReplica-seed#[4E9B597644CD04AF]-worker) [ ] o.a.s.SolrTestCaseJ4 startTrackingSearchers: numOpens=1 numCloses=1
[junit4] 2> 1547295 INFO (SUITE-TestTlogReplica-seed#[4E9B597644CD04AF]-worker) [ ] o.a.s.SolrTestCaseJ4 Using TrieFields (NUMERIC_POINTS_SYSPROP=false) w/NUMERIC_DOCVALUES_SYSPROP=true
[junit4] 2> 1547297 INFO (SUITE-TestTlogReplica-seed#[4E9B597644CD04AF]-worker) [ ] o.a.s.SolrTestCaseJ4 Randomized ssl (true) and clientAuth (false) via: @org.apache.solr.util.RandomizeSSL(reason=, ssl=NaN, value=NaN, clientAuth=NaN)
[junit4] 2> 1547297 INFO (SUITE-TestTlogReplica-seed#[4E9B597644CD04AF]-worker) [ ] o.a.s.SolrTestCaseJ4 SecureRandom sanity checks: test.solr.allowed.securerandom=null & java.security.egd=file:/dev/./urandom
[junit4] 2> 1547297 INFO (SUITE-TestTlogReplica-seed#[4E9B597644CD04AF]-worker) [ ] o.a.s.c.SolrCloudTestCase Using per-replica state
[junit4] 2> 1547297 INFO (SUITE-TestTlogReplica-seed#[4E9B597644CD04AF]-worker) [ ] o.a.s.c.MiniSolrCloudCluster Starting cluster of 2 servers in /home/jenkins/jenkins-slave/workspace/Lucene/Lucene-Solr-Tests-8.11/solr/build/solr-core/test/J2/temp/solr.cloud.TestTlogReplica_4E9B597644CD04AF-001/tempDir-001
[junit4] 2> 1547298 INFO (SUITE-TestTlogReplica-seed#[4E9B597644CD04AF]-worker) [ ] o.a.s.c.ZkTestServer STARTING ZK TEST SERVER
[junit4] 2> 1547298 INFO (ZkTestServer Run Thread) [ ] o.a.s.c.ZkTestServer client port: 0.0.0.0/0.0.0.0:0
[junit4] 2> 1547298 INFO (ZkTestServer Run Thread) [ ] o.a.s.c.ZkTestServer Starting server
[junit4] 2> 1547299 WARN (ZkTestServer Run Thread) [ ] o.a.z.s.ServerCnxnFactory maxCnxns is not configured, using default value 0.
[junit4] 2> 1547398 INFO (SUITE-TestTlogReplica-seed#[4E9B597644CD04AF]-worker) [ ] o.a.s.c.ZkTestServer start zk server on port: 37353
[junit4] 2> 1547398 INFO (SUITE-TestTlogReplica-seed#[4E9B597644CD04AF]-worker) [ ] o.a.s.c.ZkTestServer waitForServerUp: 127.0.0.1:37353
[junit4] 2> 1547398 INFO (SUITE-TestTlogReplica-seed#[4E9B597644CD04AF]-worker) [ ] o.a.s.c.ZkTestServer parse host and port list: 127.0.0.1:37353
[junit4] 2> 1547398 INFO (SUITE-TestTlogReplica-seed#[4E9B597644CD04AF]-worker) [ ] o.a.s.c.ZkTestServer connecting to 127.0.0.1 37353
[junit4] 2> 1547400 INFO (SUITE-TestTlogReplica-seed#[4E9B597644CD04AF]-worker) [ ] o.a.s.c.c.ConnectionManager Waiting for client to connect to ZooKeeper
[junit4] 2> 1547401 INFO (zkConnectionManagerCallback-18654-thread-1) [ ] o.a.s.c.c.ConnectionManager zkClient has connected
[junit4] 2> 1547401 INFO (SUITE-TestTlogReplica-seed#[4E9B597644CD04AF]-worker) [ ] o.a.s.c.c.ConnectionManager Client is connected to ZooKeeper
[junit4] 2> 1547404 INFO (SUITE-TestTlogReplica-seed#[4E9B597644CD04AF]-worker) [ ] o.a.s.c.c.ConnectionManager Waiting for client to connect to ZooKeeper
[junit4] 2> 1547405 INFO (zkConnectionManagerCallback-18656-thread-1) [ ] o.a.s.c.c.ConnectionManager zkClient has connected
[junit4] 2> 1547405 INFO (SUITE-TestTlogReplica-seed#[4E9B597644CD04AF]-worker) [ ] o.a.s.c.c.ConnectionManager Client is connected to ZooKeeper
[junit4] 2> 1547405 INFO (SUITE-TestTlogReplica-seed#[4E9B597644CD04AF]-worker) [ ] o.a.s.c.c.ConnectionManager Waiting for client to connect to ZooKeeper
[junit4] 2> 1547406 INFO (zkConnectionManagerCallback-18658-thread-1) [ ] o.a.s.c.c.ConnectionManager zkClient has connected
[junit4] 2> 1547406 INFO (SUITE-TestTlogReplica-seed#[4E9B597644CD04AF]-worker) [ ] o.a.s.c.c.ConnectionManager Client is connected to ZooKeeper
[junit4] 2> 1547509 INFO (jetty-launcher-18659-thread-1) [ ] o.a.s.c.s.e.JettySolrRunner Start Jetty (configured port=0, binding port=0)
[junit4] 2> 1547509 INFO (jetty-launcher-18659-thread-2) [ ] o.a.s.c.s.e.JettySolrRunner Start Jetty (configured port=0, binding port=0)
[junit4] 2> 1547509 INFO (jetty-launcher-18659-thread-1) [ ] o.a.s.c.s.e.JettySolrRunner Trying to start Jetty on port 0 try number 2 ...
[junit4] 2> 1547509 INFO (jetty-launcher-18659-thread-2) [ ] o.a.s.c.s.e.JettySolrRunner Trying to start Jetty on port 0 try number 2 ...
[junit4] 2> 1547509 INFO (jetty-launcher-18659-thread-1) [ ] o.e.j.s.Server jetty-9.4.53.v20231009; built: 2023-10-09T12:29:09.265Z; git: 27bde00a0b95a1d5bbee0eae7984f891d2d0f8c9; jvm 1.8.0_362-b09
[junit4] 2> 1547510 INFO (jetty-launcher-18659-thread-2) [ ] o.e.j.s.Server jetty-9.4.53.v20231009; built: 2023-10-09T12:29:09.265Z; git: 27bde00a0b95a1d5bbee0eae7984f891d2d0f8c9; jvm 1.8.0_362-b09
[junit4] 2> 1547511 INFO (jetty-launcher-18659-thread-1) [ ] o.e.j.s.session DefaultSessionIdManager workerName=node0
[junit4] 2> 1547511 INFO (jetty-launcher-18659-thread-1) [ ] o.e.j.s.session No SessionScavenger set, using defaults
[junit4] 2> 1547511 INFO (jetty-launcher-18659-thread-2) [ ] o.e.j.s.session DefaultSessionIdManager workerName=node0
[junit4] 2> 1547511 INFO (jetty-launcher-18659-thread-2) [ ] o.e.j.s.session No SessionScavenger set, using defaults
[junit4] 2> 1547511 INFO (jetty-launcher-18659-thread-1) [ ] o.e.j.s.session node0 Scavenging every 600000ms
[junit4] 2> 1547511 INFO (jetty-launcher-18659-thread-2) [ ] o.e.j.s.session node0 Scavenging every 600000ms
[junit4] 2> 1547511 INFO (jetty-launcher-18659-thread-1) [ ] o.e.j.s.h.ContextHandler Started o.e.j.s.ServletContextHandler@23984a35{/solr,null,AVAILABLE}
[junit4] 2> 1547511 INFO (jetty-launcher-18659-thread-2) [ ] o.e.j.s.h.ContextHandler Started o.e.j.s.ServletContextHandler@32837735{/solr,null,AVAILABLE}
[junit4] 2> 1547512 INFO (jetty-launcher-18659-thread-2) [ ] o.e.j.s.AbstractConnector Started ServerConnector@4355053d{SSL, (ssl, http/1.1)}{127.0.0.1:44217}
[junit4] 2> 1547512 INFO (jetty-launcher-18659-thread-1) [ ] o.e.j.s.AbstractConnector Started ServerConnector@74eccfb6{SSL, (ssl, http/1.1)}{127.0.0.1:40753}
[junit4] 2> 1547512 INFO (jetty-launcher-18659-thread-2) [ ] o.e.j.s.Server Started @1547539ms
[junit4] 2> 1547512 INFO (jetty-launcher-18659-thread-1) [ ] o.e.j.s.Server Started @1547539ms
[junit4] 2> 1547512 INFO (jetty-launcher-18659-thread-2) [ ] o.a.s.c.s.e.JettySolrRunner Jetty properties: {hostContext=/solr, zkHost=127.0.0.1:37353/solr, hostPort=44217}
[junit4] 2> 1547512 INFO (jetty-launcher-18659-thread-1) [ ] o.a.s.c.s.e.JettySolrRunner Jetty properties: {hostContext=/solr, zkHost=127.0.0.1:37353/solr, hostPort=40753}
[junit4] 2> 1547512 ERROR (jetty-launcher-18659-thread-2) [ ] o.a.s.u.StartupLoggingUtils Missing Java Option solr.log.dir. Logging may be missing or incomplete.
[junit4] 2> 1547512 ERROR (jetty-launcher-18659-thread-1) [ ] o.a.s.u.StartupLoggingUtils Missing Java Option solr.log.dir. Logging may be missing or incomplete.
[junit4] 2> 1547512 INFO (jetty-launcher-18659-thread-2) [ ] o.a.s.s.SolrDispatchFilter Using logger factory org.apache.logging.slf4j.Log4jLoggerFactory
[junit4] 2> 1547512 INFO (jetty-launcher-18659-thread-1) [ ] o.a.s.s.SolrDispatchFilter Using logger factory org.apache.logging.slf4j.Log4jLoggerFactory
[junit4] 2> 1547512 INFO (jetty-launcher-18659-thread-1) [ ] o.a.s.s.SolrDispatchFilter ___ _ Welcome to Apache Solr™ version 8.11.4
[junit4] 2> 1547512 INFO (jetty-launcher-18659-thread-2) [ ] o.a.s.s.SolrDispatchFilter ___ _ Welcome to Apache Solr™ version 8.11.4
[junit4] 2> 1547512 INFO (jetty-launcher-18659-thread-2) [ ] o.a.s.s.SolrDispatchFilter / __| ___| |_ _ Starting in cloud mode on port null
[junit4] 2> 1547512 INFO (jetty-launcher-18659-thread-1) [ ] o.a.s.s.SolrDispatchFilter / __| ___| |_ _ Starting in cloud mode on port null
[junit4] 2> 1547512 INFO (jetty-launcher-18659-thread-2) [ ] o.a.s.s.SolrDispatchFilter \__ \/ _ \ | '_| Install dir: /home/jenkins/jenkins-slave/workspace/Lucene/Lucene-Solr-Tests-8.11/solr
[junit4] 2> 1547512 INFO (jetty-launcher-18659-thread-1) [ ] o.a.s.s.SolrDispatchFilter \__ \/ _ \ | '_| Install dir: /home/jenkins/jenkins-slave/workspace/Lucene/Lucene-Solr-Tests-8.11/solr
[junit4] 2> 1547512 INFO (jetty-launcher-18659-thread-2) [ ] o.a.s.s.SolrDispatchFilter |___/\___/_|_| Start time: 2024-02-11T02:51:37.902Z
[junit4] 2> 1547512 INFO (jetty-launcher-18659-thread-1) [ ] o.a.s.s.SolrDispatchFilter |___/\___/_|_| Start time: 2024-02-11T02:51:37.902Z
[junit4] 2> 1547514 INFO (jetty-launcher-18659-thread-2) [ ] o.a.s.c.c.ConnectionManager Waiting for client to connect to ZooKeeper
[junit4] 2> 1547514 INFO (jetty-launcher-18659-thread-1) [ ] o.a.s.c.c.ConnectionManager Waiting for client to connect to ZooKeeper
[junit4] 2> 1547515 INFO (zkConnectionManagerCallback-18662-thread-1) [ ] o.a.s.c.c.ConnectionManager zkClient has connected
[junit4] 2> 1547515 INFO (jetty-launcher-18659-thread-2) [ ] o.a.s.c.c.ConnectionManager Client is connected to ZooKeeper
[junit4] 2> 1547515 INFO (zkConnectionManagerCallback-18663-thread-1) [ ] o.a.s.c.c.ConnectionManager zkClient has connected
[junit4] 2> 1547515 INFO (jetty-launcher-18659-thread-1) [ ] o.a.s.c.c.ConnectionManager Client is connected to ZooKeeper
[junit4] 2> 1547515 INFO (jetty-launcher-18659-thread-1) [ ] o.a.s.s.SolrDispatchFilter solr.xml found in ZooKeeper. Loading...
[junit4] 2> 1547515 INFO (jetty-launcher-18659-thread-2) [ ] o.a.s.s.SolrDispatchFilter solr.xml found in ZooKeeper. Loading...
[junit4] 2> 1547520 WARN (jetty-launcher-18659-thread-1-SendThread(127.0.0.1:37353)) [ ] o.a.z.ClientCnxn An exception was thrown while closing send thread for session 0x1000eb43da30004.
[junit4] 2> => EndOfStreamException: Unable to read additional data from server sessionid 0x1000eb43da30004, likely server has closed socket
[junit4] 2> at org.apache.zookeeper.ClientCnxnSocketNIO.doIO(ClientCnxnSocketNIO.java:77)
[junit4] 2> org.apache.zookeeper.ClientCnxn$EndOfStreamException: Unable to read additional data from server sessionid 0x1000eb43da30004, likely server has closed socket
[junit4] 2> at org.apache.zookeeper.ClientCnxnSocketNIO.doIO(ClientCnxnSocketNIO.java:77) ~[zookeeper-3.6.2.jar:3.6.2]
[junit4] 2> at org.apache.zookeeper.ClientCnxnSocketNIO.doTransport(ClientCnxnSocketNIO.java:350) ~[zookeeper-3.6.2.jar:3.6.2]
[junit4] 2> at org.apache.zookeeper.ClientCnxn$SendThread.run(ClientCnxn.java:1275) [zookeeper-3.6.2.jar:3.6.2]
[junit4] 2> 1547520 WARN (jetty-launcher-18659-thread-2-SendThread(127.0.0.1:37353)) [ ] o.a.z.ClientCnxn An exception was thrown while closing send thread for session 0x1000eb43da30003.
[junit4] 2> => EndOfStreamException: Unable to read additional data from server sessionid 0x1000eb43da30003, likely server has closed socket
[junit4] 2> at org.apache.zookeeper.ClientCnxnSocketNIO.doIO(ClientCnxnSocketNIO.java:77)
[junit4] 2> org.apache.zookeeper.ClientCnxn$EndOfStreamException: Unable to read additional data from server sessionid 0x1000eb43da30003, likely server has closed socket
[junit4] 2> at org.apache.zookeeper.ClientCnxnSocketNIO.doIO(ClientCnxnSocketNIO.java:77) ~[zookeeper-3.6.2.jar:3.6.2]
[junit4] 2> at org.apache.zookeeper.ClientCnxnSocketNIO.doTransport(ClientCnxnSocketNIO.java:350) ~[zookeeper-3.6.2.jar:3.6.2]
[junit4] 2> at org.apache.zookeeper.ClientCnxn$SendThread.run(ClientCnxn.java:1275) [zookeeper-3.6.2.jar:3.6.2]
[junit4] 2> 1548058 INFO (jetty-launcher-18659-thread-2) [ ] o.a.s.h.c.HttpShardHandlerFactory Host whitelist initialized: WhitelistHostChecker [whitelistHosts=null, whitelistHostCheckingEnabled=true]
[junit4] 2> 1548059 WARN (jetty-launcher-18659-thread-2) [ ] o.a.s.c.s.i.Http2SolrClient Create Http2SolrClient with HTTP/1.1 transport since Java 8 or lower versions does not support SSL + HTTP/2
[junit4] 2> 1548059 WARN (jetty-launcher-18659-thread-2) [ ] o.e.j.u.s.S.config Trusting all certificates configured for Client@72754ae9[provider=null,keyStore=null,trustStore=null]
[junit4] 2> 1548059 WARN (jetty-launcher-18659-thread-2) [ ] o.e.j.u.s.S.config No Client EndPointIdentificationAlgorithm configured for Client@72754ae9[provider=null,keyStore=null,trustStore=null]
[junit4] 2> 1548063 WARN (jetty-launcher-18659-thread-2) [ ] o.a.s.c.s.i.Http2SolrClient Create Http2SolrClient with HTTP/1.1 transport since Java 8 or lower versions does not support SSL + HTTP/2
[junit4] 2> 1548083 WARN (jetty-launcher-18659-thread-2) [ ] o.e.j.u.s.S.config Trusting all certificates configured for Client@2ef769bf[provider=null,keyStore=null,trustStore=null]
[junit4] 2> 1548083 WARN (jetty-launcher-18659-thread-2) [ ] o.e.j.u.s.S.config No Client EndPointIdentificationAlgorithm configured for Client@2ef769bf[provider=null,keyStore=null,trustStore=null]
[junit4] 2> 1548084 INFO (jetty-launcher-18659-thread-2) [ ] o.a.s.c.ZkContainer Zookeeper client=127.0.0.1:37353/solr
[junit4] 2> 1548104 INFO (jetty-launcher-18659-thread-2) [ ] o.a.s.c.c.ConnectionManager Waiting for client to connect to ZooKeeper
[junit4] 2> 1548117 INFO (zkConnectionManagerCallback-18677-thread-1) [ ] o.a.s.c.c.ConnectionManager zkClient has connected
[junit4] 2> 1548117 INFO (jetty-launcher-18659-thread-2) [ ] o.a.s.c.c.ConnectionManager Client is connected to ZooKeeper
[junit4] 2> 1548233 INFO (jetty-launcher-18659-thread-2) [n:127.0.0.1:44217_solr ] o.a.s.c.c.ConnectionManager Waiting for client to connect to ZooKeeper
[junit4] 2> 1548238 INFO (zkConnectionManagerCallback-18679-thread-1) [ ] o.a.s.c.c.ConnectionManager zkClient has connected
[junit4] 2> 1548238 INFO (jetty-launcher-18659-thread-2) [n:127.0.0.1:44217_solr ] o.a.s.c.c.ConnectionManager Client is connected to ZooKeeper
[junit4] 2> 1548301 WARN (jetty-launcher-18659-thread-2) [n:127.0.0.1:44217_solr ] o.a.s.c.ZkController Contents of zookeeper /security.json are world-readable; consider setting up ACLs as described in https://solr.apache.org/guide/zookeeper-access-control.html
[junit4] 2> 1548305 INFO (jetty-launcher-18659-thread-2) [n:127.0.0.1:44217_solr ] o.a.s.c.OverseerElectionContext I am going to be the leader 127.0.0.1:44217_solr
[junit4] 2> 1548305 INFO (jetty-launcher-18659-thread-2) [n:127.0.0.1:44217_solr ] o.a.s.c.Overseer Overseer (id=72073761328922630-127.0.0.1:44217_solr-n_0000000000) starting
[junit4] 2> 1548327 INFO (OverseerStateUpdate-72073761328922630-127.0.0.1:44217_solr-n_0000000000) [n:127.0.0.1:44217_solr ] o.a.s.c.Overseer Starting to work on the main queue : 127.0.0.1:44217_solr
[junit4] 2> 1548365 INFO (jetty-launcher-18659-thread-2) [n:127.0.0.1:44217_solr ] o.a.s.c.ZkController Register node as live in ZooKeeper:/live_nodes/127.0.0.1:44217_solr
[junit4] 2> 1548368 INFO (jetty-launcher-18659-thread-2) [n:127.0.0.1:44217_solr ] o.a.s.c.ZkController non-data nodes now []
[junit4] 2> 1548371 INFO (jetty-launcher-18659-thread-2) [n:127.0.0.1:44217_solr ] o.a.s.p.PackageLoader /packages.json updated to version -1
[junit4] 2> 1548372 WARN (jetty-launcher-18659-thread-2) [n:127.0.0.1:44217_solr ] o.a.s.c.CoreContainer Not all security plugins configured! authentication=disabled authorization=disabled. Solr is only as secure as you make it. Consider configuring authentication/authorization before exposing Solr to users internal or external. See https://s.apache.org/solrsecurity for more info
[junit4] 2> 1548376 INFO (zkCallback-18678-thread-1) [ ] o.a.s.c.c.ZkStateReader Updated live nodes from ZooKeeper... (0) -> (1)
[junit4] 2> 1548469 INFO (jetty-launcher-18659-thread-2) [n:127.0.0.1:44217_solr ] o.a.s.h.a.MetricsHistoryHandler No .system collection, keeping metrics history in memory.
[junit4] 2> 1548531 INFO (jetty-launcher-18659-thread-2) [n:127.0.0.1:44217_solr ] o.a.s.m.r.SolrJmxReporter JMX monitoring for 'solr_44217.solr.node' (registry 'solr.node') enabled at server: com.sun.jmx.mbeanserver.JmxMBeanServer@297e0ab8
[junit4] 2> 1548550 INFO (jetty-launcher-18659-thread-2) [n:127.0.0.1:44217_solr ] o.a.s.m.r.SolrJmxReporter JMX monitoring for 'solr_44217.solr.jvm' (registry 'solr.jvm') enabled at server: com.sun.jmx.mbeanserver.JmxMBeanServer@297e0ab8
[junit4] 2> 1548550 INFO (jetty-launcher-18659-thread-2) [n:127.0.0.1:44217_solr ] o.a.s.m.r.SolrJmxReporter JMX monitoring for 'solr_44217.solr.jetty' (registry 'solr.jetty') enabled at server: com.sun.jmx.mbeanserver.JmxMBeanServer@297e0ab8
[junit4] 2> 1548551 INFO (jetty-launcher-18659-thread-2) [n:127.0.0.1:44217_solr ] o.a.s.c.CorePropertiesLocator Found 0 core definitions underneath /home/jenkins/jenkins-slave/workspace/Lucene/Lucene-Solr-Tests-8.11/solr/build/solr-core/test/J2/temp/solr.cloud.TestTlogReplica_4E9B597644CD04AF-001/tempDir-001/node2
[junit4] 2> 1550350 INFO (jetty-launcher-18659-thread-1) [ ] o.a.s.h.c.HttpShardHandlerFactory Host whitelist initialized: WhitelistHostChecker [whitelistHosts=null, whitelistHostCheckingEnabled=true]
[junit4] 2> 1550350 WARN (jetty-launcher-18659-thread-1) [ ] o.a.s.c.s.i.Http2SolrClient Create Http2SolrClient with HTTP/1.1 transport since Java 8 or lower versions does not support SSL + HTTP/2
[junit4] 2> 1550351 WARN (jetty-launcher-18659-thread-1) [ ] o.e.j.u.s.S.config Trusting all certificates configured for Client@2aaa18e7[provider=null,keyStore=null,trustStore=null]
[junit4] 2> 1550351 WARN (jetty-launcher-18659-thread-1) [ ] o.e.j.u.s.S.config No Client EndPointIdentificationAlgorithm configured for Client@2aaa18e7[provider=null,keyStore=null,trustStore=null]
[junit4] 2> 1550353 WARN (jetty-launcher-18659-thread-1) [ ] o.a.s.c.s.i.Http2SolrClient Create Http2SolrClient with HTTP/1.1 transport since Java 8 or lower versions does not support SSL + HTTP/2
[junit4] 2> 1550364 WARN (jetty-launcher-18659-thread-1) [ ] o.e.j.u.s.S.config Trusting all certificates configured for Client@12a7439b[provider=null,keyStore=null,trustStore=null]
[junit4] 2> 1550364 WARN (jetty-launcher-18659-thread-1) [ ] o.e.j.u.s.S.config No Client EndPointIdentificationAlgorithm configured for Client@12a7439b[provider=null,keyStore=null,trustStore=null]
[junit4] 2> 1550365 INFO (jetty-launcher-18659-thread-1) [ ] o.a.s.c.ZkContainer Zookeeper client=127.0.0.1:37353/solr
[junit4] 2> 1550385 INFO (jetty-launcher-18659-thread-1) [ ] o.a.s.c.c.ConnectionManager Waiting for client to connect to ZooKeeper
[junit4] 2> 1550385 INFO (zkConnectionManagerCallback-18699-thread-1) [ ] o.a.s.c.c.ConnectionManager zkClient has connected
[junit4] 2> 1550385 INFO (jetty-launcher-18659-thread-1) [ ] o.a.s.c.c.ConnectionManager Client is connected to ZooKeeper
[junit4] 2> 1550386 WARN (jetty-launcher-18659-thread-1-SendThread(127.0.0.1:37353)) [ ] o.a.z.ClientCnxn An exception was thrown while closing send thread for session 0x1000eb43da30007.
[junit4] 2> => EndOfStreamException: Unable to read additional data from server sessionid 0x1000eb43da30007, likely server has closed socket
[junit4] 2> at org.apache.zookeeper.ClientCnxnSocketNIO.doIO(ClientCnxnSocketNIO.java:77)
[junit4] 2> org.apache.zookeeper.ClientCnxn$EndOfStreamException: Unable to read additional data from server sessionid 0x1000eb43da30007, likely server has closed socket
[junit4] 2> at org.apache.zookeeper.ClientCnxnSocketNIO.doIO(ClientCnxnSocketNIO.java:77) ~[zookeeper-3.6.2.jar:3.6.2]
[junit4] 2> at org.apache.zookeeper.ClientCnxnSocketNIO.doTransport(ClientCnxnSocketNIO.java:350) ~[zookeeper-3.6.2.jar:3.6.2]
[junit4] 2> at org.apache.zookeeper.ClientCnxn$SendThread.run(ClientCnxn.java:1275) [zookeeper-3.6.2.jar:3.6.2]
[junit4] 2> 1550489 INFO (jetty-launcher-18659-thread-1) [n:127.0.0.1:40753_solr ] o.a.s.c.c.ConnectionManager Waiting for client to connect to ZooKeeper
[junit4] 2> 1550493 INFO (zkConnectionManagerCallback-18701-thread-1) [ ] o.a.s.c.c.ConnectionManager zkClient has connected
[junit4] 2> 1550493 INFO (jetty-launcher-18659-thread-1) [n:127.0.0.1:40753_solr ] o.a.s.c.c.ConnectionManager Client is connected to ZooKeeper
[junit4] 2> 1550500 WARN (jetty-launcher-18659-thread-1) [n:127.0.0.1:40753_solr ] o.a.s.c.ZkController Contents of zookeeper /security.json are world-readable; consider setting up ACLs as described in https://solr.apache.org/guide/zookeeper-access-control.html
[junit4] 2> 1550501 INFO (jetty-launcher-18659-thread-1) [n:127.0.0.1:40753_solr ] o.a.s.c.c.ZkStateReader Updated live nodes from ZooKeeper... (0) -> (1)
[junit4] 2> 1550506 INFO (jetty-launcher-18659-thread-1) [n:127.0.0.1:40753_solr ] o.a.s.c.ZkController Publish node=127.0.0.1:40753_solr as DOWN
[junit4] 2> 1550506 INFO (jetty-launcher-18659-thread-1) [n:127.0.0.1:40753_solr ] o.a.s.c.TransientSolrCoreCacheDefault Allocating transient core cache for max 2147483647 cores with initial capacity of 1024
[junit4] 2> 1550506 INFO (jetty-launcher-18659-thread-1) [n:127.0.0.1:40753_solr ] o.a.s.c.ZkController Register node as live in ZooKeeper:/live_nodes/127.0.0.1:40753_solr
[junit4] 2> 1550507 INFO (zkCallback-18678-thread-1) [ ] o.a.s.c.c.ZkStateReader Updated live nodes from ZooKeeper... (1) -> (2)
[junit4] 2> 1550508 INFO (jetty-launcher-18659-thread-1) [n:127.0.0.1:40753_solr ] o.a.s.c.ZkController non-data nodes now []
[junit4] 2> 1550514 INFO (zkCallback-18700-thread-1) [ ] o.a.s.c.c.ZkStateReader Updated live nodes from ZooKeeper... (1) -> (2)
[junit4] 2> 1550514 INFO (jetty-launcher-18659-thread-1) [n:127.0.0.1:40753_solr ] o.a.s.p.PackageLoader /packages.json updated to version -1
[junit4] 2> 1550515 WARN (jetty-launcher-18659-thread-1) [n:127.0.0.1:40753_solr ] o.a.s.c.CoreContainer Not all security plugins configured! authentication=disabled authorization=disabled. Solr is only as secure as you make it. Consider configuring authentication/authorization before exposing Solr to users internal or external. See https://s.apache.org/solrsecurity for more info
[junit4] 2> 1550541 INFO (jetty-launcher-18659-thread-1) [n:127.0.0.1:40753_solr ] o.a.s.h.a.MetricsHistoryHandler No .system collection, keeping metrics history in memory.
[junit4] 2> 1550596 INFO (jetty-launcher-18659-thread-1) [n:127.0.0.1:40753_solr ] o.a.s.m.r.SolrJmxReporter JMX monitoring for 'solr_40753.solr.node' (registry 'solr.node') enabled at server: com.sun.jmx.mbeanserver.JmxMBeanServer@297e0ab8
[junit4] 2> 1550605 INFO (jetty-launcher-18659-thread-1) [n:127.0.0.1:40753_solr ] o.a.s.m.r.SolrJmxReporter JMX monitoring for 'solr_40753.solr.jvm' (registry 'solr.jvm') enabled at server: com.sun.jmx.mbeanserver.JmxMBeanServer@297e0ab8
[junit4] 2> 1550605 INFO (jetty-launcher-18659-thread-1) [n:127.0.0.1:40753_solr ] o.a.s.m.r.SolrJmxReporter JMX monitoring for 'solr_40753.solr.jetty' (registry 'solr.jetty') enabled at server: com.sun.jmx.mbeanserver.JmxMBeanServer@297e0ab8
[junit4] 2> 1550606 INFO (jetty-launcher-18659-thread-1) [n:127.0.0.1:40753_solr ] o.a.s.c.CorePropertiesLocator Found 0 core definitions underneath /home/jenkins/jenkins-slave/workspace/Lucene/Lucene-Solr-Tests-8.11/solr/build/solr-core/test/J2/temp/solr.cloud.TestTlogReplica_4E9B597644CD04AF-001/tempDir-001/node1
[junit4] 2> 1550623 INFO (SUITE-TestTlogReplica-seed#[4E9B597644CD04AF]-worker) [ ] o.a.s.c.MiniSolrCloudCluster waitForAllNodes: numServers=2
[junit4] 2> 1550629 INFO (SUITE-TestTlogReplica-seed#[4E9B597644CD04AF]-worker) [ ] o.a.s.c.c.ConnectionManager Waiting for client to connect to ZooKeeper
[junit4] 2> 1550631 INFO (zkConnectionManagerCallback-18714-thread-1) [ ] o.a.s.c.c.ConnectionManager zkClient has connected
[junit4] 2> 1550631 INFO (SUITE-TestTlogReplica-seed#[4E9B597644CD04AF]-worker) [ ] o.a.s.c.c.ConnectionManager Client is connected to ZooKeeper
[junit4] 2> 1550632 INFO (SUITE-TestTlogReplica-seed#[4E9B597644CD04AF]-worker) [ ] o.a.s.c.c.ZkStateReader Updated live nodes from ZooKeeper... (0) -> (2)
[junit4] 2> 1550633 INFO (SUITE-TestTlogReplica-seed#[4E9B597644CD04AF]-worker) [ ] o.a.s.c.s.i.ZkClientClusterStateProvider Cluster at 127.0.0.1:37353/solr ready
[junit4] 2> 1550635 INFO (SUITE-TestTlogReplica-seed#[4E9B597644CD04AF]-worker) [ ] o.a.s.c.TestTlogReplica Using legacyCloud?: false
[junit4] 2> 1550675 INFO (qtp2115282118-28602) [n:127.0.0.1:40753_solr ] o.a.s.s.HttpSolrCall HttpSolrCall.init(https://127.0.0.1:40753/solr/admin/collections?action=CLUSTERPROP&name=legacyCloud&val=false&wt=javabin&version=2)
[junit4] 2> 1550677 INFO (qtp2115282118-28602) [n:127.0.0.1:40753_solr ] o.a.s.s.HttpSolrCall [admin] webapp=null path=/admin/collections params={val=false&name=legacyCloud&action=CLUSTERPROP&wt=javabin&version=2} status=0 QTime=1
[junit4] 2> 1550700 INFO (TEST-TestTlogReplica.testAddRemoveTlogReplica-seed#[4E9B597644CD04AF]) [ ] o.a.s.SolrTestCaseJ4 ###Starting testAddRemoveTlogReplica
[junit4] 2> 1550701 INFO (qtp2115282118-28604) [n:127.0.0.1:40753_solr ] o.a.s.s.HttpSolrCall HttpSolrCall.init(https://127.0.0.1:40753/solr/admin/collections?action=CREATE&name=tlog_replica_test_add_remove_tlog_replica&collection.configName=conf&numShards=2&maxShardsPerNode=100&nrtReplicas=0&pullReplicas=0&tlogReplicas=1&wt=javabin&version=2)
[junit4] 2> 1550708 INFO (OverseerThreadFactory-18686-thread-1-processing-n:127.0.0.1:44217_solr) [n:127.0.0.1:44217_solr ] o.a.s.c.a.c.CreateCollectionCmd Create collection tlog_replica_test_add_remove_tlog_replica
[junit4] 2> 1551103 INFO (OverseerStateUpdate-72073761328922630-127.0.0.1:44217_solr-n_0000000000) [n:127.0.0.1:44217_solr ] o.a.s.c.o.SliceMutator createReplica() {
[junit4] 2> "operation":"ADDREPLICA",
[junit4] 2> "collection":"tlog_replica_test_add_remove_tlog_replica",
[junit4] 2> "shard":"shard1",
[junit4] 2> "core":"tlog_replica_test_add_remove_tlog_replica_shard1_replica_t1",
[junit4] 2> "state":"down",
[junit4] 2> "node_name":"127.0.0.1:44217_solr",
[junit4] 2> "base_url":"https://127.0.0.1:44217/solr",
[junit4] 2> "type":"TLOG",
[junit4] 2> "waitForFinalState":"false"}
[junit4] 2> 1551114 INFO (OverseerStateUpdate-72073761328922630-127.0.0.1:44217_solr-n_0000000000) [n:127.0.0.1:44217_solr ] o.a.s.c.o.SliceMutator createReplica() {
[junit4] 2> "operation":"ADDREPLICA",
[junit4] 2> "collection":"tlog_replica_test_add_remove_tlog_replica",
[junit4] 2> "shard":"shard2",
[junit4] 2> "core":"tlog_replica_test_add_remove_tlog_replica_shard2_replica_t2",
[junit4] 2> "state":"down",
[junit4] 2> "node_name":"127.0.0.1:40753_solr",
[junit4] 2> "base_url":"https://127.0.0.1:40753/solr",
[junit4] 2> "type":"TLOG",
[junit4] 2> "waitForFinalState":"false"}
[junit4] 2> 1551370 INFO (qtp2115282118-28600) [n:127.0.0.1:40753_solr ] o.a.s.s.HttpSolrCall HttpSolrCall.init(https://127.0.0.1:40753/solr/admin/cores?null)
[junit4] 2> 1551370 INFO (qtp2115282118-28600) [n:127.0.0.1:40753_solr x:tlog_replica_test_add_remove_tlog_replica_shard2_replica_t2 ] o.a.s.h.a.CoreAdminOperation core create command qt=/admin/cores&coreNodeName=core_node4&collection.configName=conf&newCollection=true&name=tlog_replica_test_add_remove_tlog_replica_shard2_replica_t2&action=CREATE&numShards=2&collection=tlog_replica_test_add_remove_tlog_replica&shard=shard2&wt=javabin&version=2&replicaType=TLOG
[junit4] 2> 1551393 INFO (qtp2115282118-28600) [n:127.0.0.1:40753_solr c:tlog_replica_test_add_remove_tlog_replica s:shard2 r:core_node4 x:tlog_replica_test_add_remove_tlog_replica_shard2_replica_t2 ] o.a.s.c.SolrConfig Using Lucene MatchVersion: 8.11.4
[junit4] 2> 1551394 INFO (qtp2115282118-28600) [n:127.0.0.1:40753_solr c:tlog_replica_test_add_remove_tlog_replica s:shard2 r:core_node4 x:tlog_replica_test_add_remove_tlog_replica_shard2_replica_t2 ] o.a.s.s.IndexSchema Schema name=minimal
[junit4] 2> 1551394 INFO (qtp2115282118-28600) [n:127.0.0.1:40753_solr c:tlog_replica_test_add_remove_tlog_replica s:shard2 r:core_node4 x:tlog_replica_test_add_remove_tlog_replica_shard2_replica_t2 ] o.a.s.s.IndexSchema Loaded schema minimal/1.1 with uniqueid field id
[junit4] 2> 1551394 INFO (qtp2115282118-28600) [n:127.0.0.1:40753_solr c:tlog_replica_test_add_remove_tlog_replica s:shard2 r:core_node4 x:tlog_replica_test_add_remove_tlog_replica_shard2_replica_t2 ] o.a.s.c.CoreContainer Creating SolrCore 'tlog_replica_test_add_remove_tlog_replica_shard2_replica_t2' using configuration from configset conf, trusted=true
[junit4] 2> 1551395 INFO (qtp2115282118-28600) [n:127.0.0.1:40753_solr c:tlog_replica_test_add_remove_tlog_replica s:shard2 r:core_node4 x:tlog_replica_test_add_remove_tlog_replica_shard2_replica_t2 ] o.a.s.m.r.SolrJmxReporter JMX monitoring for 'solr_40753.solr.core.tlog_replica_test_add_remove_tlog_replica.shard2.replica_t2' (registry 'solr.core.tlog_replica_test_add_remove_tlog_replica.shard2.replica_t2') enabled at server: com.sun.jmx.mbeanserver.JmxMBeanServer@297e0ab8
[junit4] 2> 1551395 INFO (qtp2115282118-28600) [n:127.0.0.1:40753_solr c:tlog_replica_test_add_remove_tlog_replica s:shard2 r:core_node4 x:tlog_replica_test_add_remove_tlog_replica_shard2_replica_t2 ] o.a.s.c.SolrCore [[tlog_replica_test_add_remove_tlog_replica_shard2_replica_t2] ] Opening new SolrCore at [/home/jenkins/jenkins-slave/workspace/Lucene/Lucene-Solr-Tests-8.11/solr/build/solr-core/test/J2/temp/solr.cloud.TestTlogReplica_4E9B597644CD04AF-001/tempDir-001/node1/tlog_replica_test_add_remove_tlog_replica_shard2_replica_t2], dataDir=[/home/jenkins/jenkins-slave/workspace/Lucene/Lucene-Solr-Tests-8.11/solr/build/solr-core/test/J2/temp/solr.cloud.TestTlogReplica_4E9B597644CD04AF-001/tempDir-001/node1/tlog_replica_test_add_remove_tlog_replica_shard2_replica_t2/data/]
[junit4] 2> 1551401 INFO (qtp1236102733-28601) [n:127.0.0.1:44217_solr ] o.a.s.s.HttpSolrCall HttpSolrCall.init(https://127.0.0.1:44217/solr/admin/cores?null)
[junit4] 2> 1551401 INFO (qtp1236102733-28601) [n:127.0.0.1:44217_solr x:tlog_replica_test_add_remove_tlog_replica_shard1_replica_t1 ] o.a.s.h.a.CoreAdminOperation core create command qt=/admin/cores&coreNodeName=core_node3&collection.configName=conf&newCollection=true&name=tlog_replica_test_add_remove_tlog_replica_shard1_replica_t1&action=CREATE&numShards=2&collection=tlog_replica_test_add_remove_tlog_replica&shard=shard1&wt=javabin&version=2&replicaType=TLOG
[junit4] 2> 1551401 INFO (qtp1236102733-28601) [n:127.0.0.1:44217_solr x:tlog_replica_test_add_remove_tlog_replica_shard1_replica_t1 ] o.a.s.c.TransientSolrCoreCacheDefault Allocating transient core cache for max 2147483647 cores with initial capacity of 1024
[junit4] 2> 1551414 INFO (qtp1236102733-28601) [n:127.0.0.1:44217_solr c:tlog_replica_test_add_remove_tlog_replica s:shard1 r:core_node3 x:tlog_replica_test_add_remove_tlog_replica_shard1_replica_t1 ] o.a.s.c.SolrConfig Using Lucene MatchVersion: 8.11.4
[junit4] 2> 1551415 INFO (qtp1236102733-28601) [n:127.0.0.1:44217_solr c:tlog_replica_test_add_remove_tlog_replica s:shard1 r:core_node3 x:tlog_replica_test_add_remove_tlog_replica_shard1_replica_t1 ] o.a.s.s.IndexSchema Schema name=minimal
[junit4] 2> 1551416 INFO (qtp1236102733-28601) [n:127.0.0.1:44217_solr c:tlog_replica_test_add_remove_tlog_replica s:shard1 r:core_node3 x:tlog_replica_test_add_remove_tlog_replica_shard1_replica_t1 ] o.a.s.s.IndexSchema Loaded schema minimal/1.1 with uniqueid field id
[junit4] 2> 1551416 INFO (qtp1236102733-28601) [n:127.0.0.1:44217_solr c:tlog_replica_test_add_remove_tlog_replica s:shard1 r:core_node3 x:tlog_replica_test_add_remove_tlog_replica_shard1_replica_t1 ] o.a.s.c.CoreContainer Creating SolrCore 'tlog_replica_test_add_remove_tlog_replica_shard1_replica_t1' using configuration from configset conf, trusted=true
[junit4] 2> 1551416 INFO (qtp1236102733-28601) [n:127.0.0.1:44217_solr c:tlog_replica_test_add_remove_tlog_replica s:shard1 r:core_node3 x:tlog_replica_test_add_remove_tlog_replica_shard1_replica_t1 ] o.a.s.m.r.SolrJmxReporter JMX monitoring for 'solr_44217.solr.core.tlog_replica_test_add_remove_tlog_replica.shard1.replica_t1' (registry 'solr.core.tlog_replica_test_add_remove_tlog_replica.shard1.replica_t1') enabled at server: com.sun.jmx.mbeanserver.JmxMBeanServer@297e0ab8
[junit4] 2> 1551416 INFO (qtp1236102733-28601) [n:127.0.0.1:44217_solr c:tlog_replica_test_add_remove_tlog_replica s:shard1 r:core_node3 x:tlog_replica_test_add_remove_tlog_replica_shard1_replica_t1 ] o.a.s.c.SolrCore [[tlog_replica_test_add_remove_tlog_replica_shard1_replica_t1] ] Opening new SolrCore at [/home/jenkins/jenkins-slave/workspace/Lucene/Lucene-Solr-Tests-8.11/solr/build/solr-core/test/J2/temp/solr.cloud.TestTlogReplica_4E9B597644CD04AF-001/tempDir-001/node2/tlog_replica_test_add_remove_tlog_replica_shard1_replica_t1], dataDir=[/home/jenkins/jenkins-slave/workspace/Lucene/Lucene-Solr-Tests-8.11/solr/build/solr-core/test/J2/temp/solr.cloud.TestTlogReplica_4E9B597644CD04AF-001/tempDir-001/node2/tlog_replica_test_add_remove_tlog_replica_shard1_replica_t1/data/]
[junit4] 2> 1551481 INFO (qtp2115282118-28600) [n:127.0.0.1:40753_solr c:tlog_replica_test_add_remove_tlog_replica s:shard2 r:core_node4 x:tlog_replica_test_add_remove_tlog_replica_shard2_replica_t2 ] o.a.s.u.UpdateHandler Using UpdateLog implementation: org.apache.solr.update.UpdateLog
[junit4] 2> 1551481 INFO (qtp2115282118-28600) [n:127.0.0.1:40753_solr c:tlog_replica_test_add_remove_tlog_replica s:shard2 r:core_node4 x:tlog_replica_test_add_remove_tlog_replica_shard2_replica_t2 ] o.a.s.u.UpdateLog Initializing UpdateLog: dataDir=null defaultSyncLevel=FLUSH numRecordsToKeep=100 maxNumLogsToKeep=10 numVersionBuckets=65536
[junit4] 2> 1551482 INFO (qtp2115282118-28600) [n:127.0.0.1:40753_solr c:tlog_replica_test_add_remove_tlog_replica s:shard2 r:core_node4 x:tlog_replica_test_add_remove_tlog_replica_shard2_replica_t2 ] o.a.s.u.CommitTracker Hard AutoCommit: disabled
[junit4] 2> 1551482 INFO (qtp2115282118-28600) [n:127.0.0.1:40753_solr c:tlog_replica_test_add_remove_tlog_replica s:shard2 r:core_node4 x:tlog_replica_test_add_remove_tlog_replica_shard2_replica_t2 ] o.a.s.u.CommitTracker Soft AutoCommit: disabled
[junit4] 2> 1551484 INFO (qtp2115282118-28600) [n:127.0.0.1:40753_solr c:tlog_replica_test_add_remove_tlog_replica s:shard2 r:core_node4 x:tlog_replica_test_add_remove_tlog_replica_shard2_replica_t2 ] o.a.s.r.ManagedResourceStorage Configured ZooKeeperStorageIO with znodeBase: /configs/conf
[junit4] 2> 1551484 INFO (qtp2115282118-28600) [n:127.0.0.1:40753_solr c:tlog_replica_test_add_remove_tlog_replica s:shard2 r:core_node4 x:tlog_replica_test_add_remove_tlog_replica_shard2_replica_t2 ] o.a.s.r.ManagedResourceStorage Loaded null at path _rest_managed.json using ZooKeeperStorageIO:path=/configs/conf
[junit4] 2> 1551485 INFO (qtp2115282118-28600) [n:127.0.0.1:40753_solr c:tlog_replica_test_add_remove_tlog_replica s:shard2 r:core_node4 x:tlog_replica_test_add_remove_tlog_replica_shard2_replica_t2 ] o.a.s.h.ReplicationHandler Commits will be reserved for 10000 ms
[junit4] 2> 1551485 INFO (qtp2115282118-28600) [n:127.0.0.1:40753_solr c:tlog_replica_test_add_remove_tlog_replica s:shard2 r:core_node4 x:tlog_replica_test_add_remove_tlog_replica_shard2_replica_t2 ] o.a.s.u.UpdateLog Could not find max version in index or recent updates, using new clock 1790569246228480000
[junit4] 2> 1551490 INFO (qtp2115282118-28600) [n:127.0.0.1:40753_solr c:tlog_replica_test_add_remove_tlog_replica s:shard2 r:core_node4 x:tlog_replica_test_add_remove_tlog_replica_shard2_replica_t2 ] o.a.s.c.ZkShardTerms Successful update of terms at /collections/tlog_replica_test_add_remove_tlog_replica/terms/shard2 to Terms{values={core_node4=0}, version=0}
[junit4] 2> 1551490 INFO (qtp2115282118-28600) [n:127.0.0.1:40753_solr c:tlog_replica_test_add_remove_tlog_replica s:shard2 r:core_node4 x:tlog_replica_test_add_remove_tlog_replica_shard2_replica_t2 ] o.a.s.c.ShardLeaderElectionContextBase make sure parent is created /collections/tlog_replica_test_add_remove_tlog_replica/leaders/shard2
[junit4] 2> 1551490 INFO (searcherExecutor-18716-thread-1-processing-n:127.0.0.1:40753_solr x:tlog_replica_test_add_remove_tlog_replica_shard2_replica_t2 c:tlog_replica_test_add_remove_tlog_replica s:shard2 r:core_node4) [n:127.0.0.1:40753_solr c:tlog_replica_test_add_remove_tlog_replica s:shard2 r:core_node4 x:tlog_replica_test_add_remove_tlog_replica_shard2_replica_t2 ] o.a.s.c.SolrCore [tlog_replica_test_add_remove_tlog_replica_shard2_replica_t2] Registered new searcher autowarm time: 0 ms
[junit4] 2> 1551498 INFO (qtp2115282118-28600) [n:127.0.0.1:40753_solr c:tlog_replica_test_add_remove_tlog_replica s:shard2 r:core_node4 x:tlog_replica_test_add_remove_tlog_replica_shard2_replica_t2 ] o.a.s.c.ShardLeaderElectionContext Enough replicas found to continue.
[junit4] 2> 1551498 INFO (qtp2115282118-28600) [n:127.0.0.1:40753_solr c:tlog_replica_test_add_remove_tlog_replica s:shard2 r:core_node4 x:tlog_replica_test_add_remove_tlog_replica_shard2_replica_t2 ] o.a.s.c.ShardLeaderElectionContext I may be the new leader - try and sync
[junit4] 2> 1551498 INFO (qtp2115282118-28600) [n:127.0.0.1:40753_solr c:tlog_replica_test_add_remove_tlog_replica s:shard2 r:core_node4 x:tlog_replica_test_add_remove_tlog_replica_shard2_replica_t2 ] o.a.s.c.SyncStrategy Sync replicas to https://127.0.0.1:40753/solr/tlog_replica_test_add_remove_tlog_replica_shard2_replica_t2/
[junit4] 2> 1551498 INFO (qtp2115282118-28600) [n:127.0.0.1:40753_solr c:tlog_replica_test_add_remove_tlog_replica s:shard2 r:core_node4 x:tlog_replica_test_add_remove_tlog_replica_shard2_replica_t2 ] o.a.s.c.SyncStrategy Sync Success - now sync replicas to me
[junit4] 2> 1551498 INFO (qtp2115282118-28600) [n:127.0.0.1:40753_solr c:tlog_replica_test_add_remove_tlog_replica s:shard2 r:core_node4 x:tlog_replica_test_add_remove_tlog_replica_shard2_replica_t2 ] o.a.s.c.SyncStrategy https://127.0.0.1:40753/solr/tlog_replica_test_add_remove_tlog_replica_shard2_replica_t2/ has no replicas
[junit4] 2> 1551498 INFO (qtp2115282118-28600) [n:127.0.0.1:40753_solr c:tlog_replica_test_add_remove_tlog_replica s:shard2 r:core_node4 x:tlog_replica_test_add_remove_tlog_replica_shard2_replica_t2 ] o.a.s.c.ZkController tlog_replica_test_add_remove_tlog_replica_shard2_replica_t2 stopping background replication from leader
[junit4] 2> 1551498 INFO (qtp2115282118-28600) [n:127.0.0.1:40753_solr c:tlog_replica_test_add_remove_tlog_replica s:shard2 r:core_node4 x:tlog_replica_test_add_remove_tlog_replica_shard2_replica_t2 ] o.a.s.c.ShardLeaderElectionContextBase Creating leader registration node /collections/tlog_replica_test_add_remove_tlog_replica/leaders/shard2/leader after winning as /collections/tlog_replica_test_add_remove_tlog_replica/leader_elect/shard2/election/72073761328922632-core_node4-n_0000000000
[junit4] 2> 1551506 INFO (qtp2115282118-28600) [n:127.0.0.1:40753_solr c:tlog_replica_test_add_remove_tlog_replica s:shard2 r:core_node4 x:tlog_replica_test_add_remove_tlog_replica_shard2_replica_t2 ] o.a.s.c.ShardLeaderElectionContext I am the new leader: https://127.0.0.1:40753/solr/tlog_replica_test_add_remove_tlog_replica_shard2_replica_t2/ shard2
[junit4] 2> 1551731 INFO (zkCallback-18700-thread-1) [ ] o.a.s.c.c.ZkStateReader A cluster state change: [WatchedEvent state:SyncConnected type:NodeDataChanged path:/collections/tlog_replica_test_add_remove_tlog_replica/state.json] for collection [tlog_replica_test_add_remove_tlog_replica] has occurred - updating... (live nodes size: [2])
[junit4] 2> 1551732 INFO (qtp2115282118-28600) [n:127.0.0.1:40753_solr c:tlog_replica_test_add_remove_tlog_replica s:shard2 r:core_node4 x:tlog_replica_test_add_remove_tlog_replica_shard2_replica_t2 ] o.a.s.c.ZkController I am the leader, no recovery necessary
[junit4] 2> 1551735 INFO (qtp2115282118-28600) [n:127.0.0.1:40753_solr ] o.a.s.s.HttpSolrCall [admin] webapp=null path=/admin/cores params={qt=/admin/cores&coreNodeName=core_node4&collection.configName=conf&newCollection=true&name=tlog_replica_test_add_remove_tlog_replica_shard2_replica_t2&action=CREATE&numShards=2&collection=tlog_replica_test_add_remove_tlog_replica&shard=shard2&wt=javabin&version=2&replicaType=TLOG} status=0 QTime=364
[junit4] 2> 1551745 INFO (qtp1236102733-28601) [n:127.0.0.1:44217_solr c:tlog_replica_test_add_remove_tlog_replica s:shard1 r:core_node3 x:tlog_replica_test_add_remove_tlog_replica_shard1_replica_t1 ] o.a.s.u.UpdateHandler Using UpdateLog implementation: org.apache.solr.update.UpdateLog
[junit4] 2> 1551745 INFO (qtp1236102733-28601) [n:127.0.0.1:44217_solr c:tlog_replica_test_add_remove_tlog_replica s:shard1 r:core_node3 x:tlog_replica_test_add_remove_tlog_replica_shard1_replica_t1 ] o.a.s.u.UpdateLog Initializing UpdateLog: dataDir=null defaultSyncLevel=FLUSH numRecordsToKeep=100 maxNumLogsToKeep=10 numVersionBuckets=65536
[junit4] 2> 1551746 INFO (qtp1236102733-28601) [n:127.0.0.1:44217_solr c:tlog_replica_test_add_remove_tlog_replica s:shard1 r:core_node3 x:tlog_replica_test_add_remove_tlog_replica_shard1_replica_t1 ] o.a.s.u.CommitTracker Hard AutoCommit: disabled
[junit4] 2> 1551746 INFO (qtp1236102733-28601) [n:127.0.0.1:44217_solr c:tlog_replica_test_add_remove_tlog_replica s:shard1 r:core_node3 x:tlog_replica_test_add_remove_tlog_replica_shard1_replica_t1 ] o.a.s.u.CommitTracker Soft AutoCommit: disabled
[junit4] 2> 1551748 INFO (qtp1236102733-28601) [n:127.0.0.1:44217_solr c:tlog_replica_test_add_remove_tlog_replica s:shard1 r:core_node3 x:tlog_replica_test_add_remove_tlog_replica_shard1_replica_t1 ] o.a.s.r.ManagedResourceStorage Configured ZooKeeperStorageIO with znodeBase: /configs/conf
[junit4] 2> 1551748 INFO (qtp1236102733-28601) [n:127.0.0.1:44217_solr c:tlog_replica_test_add_remove_tlog_replica s:shard1 r:core_node3 x:tlog_replica_test_add_remove_tlog_replica_shard1_replica_t1 ] o.a.s.r.ManagedResourceStorage Loaded null at path _rest_managed.json using ZooKeeperStorageIO:path=/configs/conf
[junit4] 2> 1551749 INFO (qtp1236102733-28601) [n:127.0.0.1:44217_solr c:tlog_replica_test_add_remove_tlog_replica s:shard1 r:core_node3 x:tlog_replica_test_add_remove_tlog_replica_shard1_replica_t1 ] o.a.s.h.ReplicationHandler Commits will be reserved for 10000 ms
[junit4] 2> 1551749 INFO (qtp1236102733-28601) [n:127.0.0.1:44217_solr c:tlog_replica_test_add_remove_tlog_replica s:shard1 r:core_node3 x:tlog_replica_test_add_remove_tlog_replica_shard1_replica_t1 ] o.a.s.u.UpdateLog Could not find max version in index or recent updates, using new clock 1790569246505304064
[junit4] 2> 1551754 INFO (qtp1236102733-28601) [n:127.0.0.1:44217_solr c:tlog_replica_test_add_remove_tlog_replica s:shard1 r:core_node3 x:tlog_replica_test_add_remove_tlog_replica_shard1_replica_t1 ] o.a.s.c.ZkShardTerms Successful update of terms at /collections/tlog_replica_test_add_remove_tlog_replica/terms/shard1 to Terms{values={core_node3=0}, version=0}
[junit4] 2> 1551754 INFO (qtp1236102733-28601) [n:127.0.0.1:44217_solr c:tlog_replica_test_add_remove_tlog_replica s:shard1 r:core_node3 x:tlog_replica_test_add_remove_tlog_replica_shard1_replica_t1 ] o.a.s.c.ShardLeaderElectionContextBase make sure parent is created /collections/tlog_replica_test_add_remove_tlog_replica/leaders/shard1
[junit4] 2> 1551757 INFO (qtp1236102733-28601) [n:127.0.0.1:44217_solr c:tlog_replica_test_add_remove_tlog_replica s:shard1 r:core_node3 x:tlog_replica_test_add_remove_tlog_replica_shard1_replica_t1 ] o.a.s.c.ShardLeaderElectionContext Enough replicas found to continue.
[junit4] 2> 1551757 INFO (qtp1236102733-28601) [n:127.0.0.1:44217_solr c:tlog_replica_test_add_remove_tlog_replica s:shard1 r:core_node3 x:tlog_replica_test_add_remove_tlog_replica_shard1_replica_t1 ] o.a.s.c.ShardLeaderElectionContext I may be the new leader - try and sync
[junit4] 2> 1551757 INFO (qtp1236102733-28601) [n:127.0.0.1:44217_solr c:tlog_replica_test_add_remove_tlog_replica s:shard1 r:core_node3 x:tlog_replica_test_add_remove_tlog_replica_shard1_replica_t1 ] o.a.s.c.SyncStrategy Sync replicas to https://127.0.0.1:44217/solr/tlog_replica_test_add_remove_tlog_replica_shard1_replica_t1/
[junit4] 2> 1551757 INFO (qtp1236102733-28601) [n:127.0.0.1:44217_solr c:tlog_replica_test_add_remove_tlog_replica s:shard1 r:core_node3 x:tlog_replica_test_add_remove_tlog_replica_shard1_replica_t1 ] o.a.s.c.SyncStrategy Sync Success - now sync replicas to me
[junit4] 2> 1551757 INFO (qtp1236102733-28601) [n:127.0.0.1:44217_solr c:tlog_replica_test_add_remove_tlog_replica s:shard1 r:core_node3 x:tlog_replica_test_add_remove_tlog_replica_shard1_replica_t1 ] o.a.s.c.SyncStrategy https://127.0.0.1:44217/solr/tlog_replica_test_add_remove_tlog_replica_shard1_replica_t1/ has no replicas
[junit4] 2> 1551757 INFO (qtp1236102733-28601) [n:127.0.0.1:44217_solr c:tlog_replica_test_add_remove_tlog_replica s:shard1 r:core_node3 x:tlog_replica_test_add_remove_tlog_replica_shard1_replica_t1 ] o.a.s.c.ZkController tlog_replica_test_add_remove_tlog_replica_shard1_replica_t1 stopping background replication from leader
[junit4] 2> 1551757 INFO (qtp1236102733-28601) [n:127.0.0.1:44217_solr c:tlog_replica_test_add_remove_tlog_replica s:shard1 r:core_node3 x:tlog_replica_test_add_remove_tlog_replica_shard1_replica_t1 ] o.a.s.c.ShardLeaderElectionContextBase Creating leader registration node /collections/tlog_replica_test_add_remove_tlog_replica/leaders/shard1/leader after winning as /collections/tlog_replica_test_add_remove_tlog_replica/leader_elect/shard1/election/72073761328922630-core_node3-n_0000000000
[junit4] 2> 1551758 INFO (searcherExecutor-18718-thread-1-processing-n:127.0.0.1:44217_solr x:tlog_replica_test_add_remove_tlog_replica_shard1_replica_t1 c:tlog_replica_test_add_remove_tlog_replica s:shard1 r:core_node3) [n:127.0.0.1:44217_solr c:tlog_replica_test_add_remove_tlog_replica s:shard1 r:core_node3 x:tlog_replica_test_add_remove_tlog_replica_shard1_replica_t1 ] o.a.s.c.SolrCore [tlog_replica_test_add_remove_tlog_replica_shard1_replica_t1] Registered new searcher autowarm time: 0 ms
[junit4] 2> 1551759 INFO (qtp1236102733-28601) [n:127.0.0.1:44217_solr c:tlog_replica_test_add_remove_tlog_replica s:shard1 r:core_node3 x:tlog_replica_test_add_remove_tlog_replica_shard1_replica_t1 ] o.a.s.c.ShardLeaderElectionContext I am the new leader: https://127.0.0.1:44217/solr/tlog_replica_test_add_remove_tlog_replica_shard1_replica_t1/ shard1
[junit4] 2> 1551869 INFO (zkCallback-18678-thread-1) [ ] o.a.s.c.c.ZkStateReader A cluster state change: [WatchedEvent state:SyncConnected type:NodeDataChanged path:/collections/tlog_replica_test_add_remove_tlog_replica/state.json] for collection [tlog_replica_test_add_remove_tlog_replica] has occurred - updating... (live nodes size: [2])
[junit4] 2> 1551869 INFO (zkCallback-18700-thread-1) [ ] o.a.s.c.c.ZkStateReader A cluster state change: [WatchedEvent state:SyncConnected type:NodeDataChanged path:/collections/tlog_replica_test_add_remove_tlog_replica/state.json] for collection [tlog_replica_test_add_remove_tlog_replica] has occurred - updating... (live nodes size: [2])
[junit4] 2> 1551881 INFO (zkCallback-18700-thread-2) [ ] o.a.s.c.c.ZkStateReader A cluster state change: [WatchedEvent state:SyncConnected type:NodeDataChanged path:/collections/tlog_replica_test_add_remove_tlog_replica/state.json] for collection [tlog_replica_test_add_remove_tlog_replica] has occurred - updating... (live nodes size: [2])
[junit4] 2> 1551888 INFO (qtp1236102733-28601) [n:127.0.0.1:44217_solr c:tlog_replica_test_add_remove_tlog_replica s:shard1 r:core_node3 x:tlog_replica_test_add_remove_tlog_replica_shard1_replica_t1 ] o.a.s.c.ZkController I am the leader, no recovery necessary
[junit4] 2> 1551908 INFO (qtp1236102733-28601) [n:127.0.0.1:44217_solr ] o.a.s.s.HttpSolrCall [admin] webapp=null path=/admin/cores params={qt=/admin/cores&coreNodeName=core_node3&collection.configName=conf&newCollection=true&name=tlog_replica_test_add_remove_tlog_replica_shard1_replica_t1&action=CREATE&numShards=2&collection=tlog_replica_test_add_remove_tlog_replica&shard=shard1&wt=javabin&version=2&replicaType=TLOG} status=0 QTime=507
[junit4] 2> 1551916 INFO (qtp2115282118-28604) [n:127.0.0.1:40753_solr ] o.a.s.h.a.CollectionsHandler Wait for new collection to be active for at most 45 seconds. Check all shard replicas
[junit4] 2> 1552226 INFO (zkCallback-18700-thread-2) [ ] o.a.s.c.c.ZkStateReader A cluster state change: [WatchedEvent state:SyncConnected type:NodeDataChanged path:/collections/tlog_replica_test_add_remove_tlog_replica/state.json] for collection [tlog_replica_test_add_remove_tlog_replica] has occurred - updating... (live nodes size: [2])
[junit4] 2> 1552226 INFO (zkCallback-18700-thread-1) [ ] o.a.s.c.c.ZkStateReader A cluster state change: [WatchedEvent state:SyncConnected type:NodeDataChanged path:/collections/tlog_replica_test_add_remove_tlog_replica/state.json] for collection [tlog_replica_test_add_remove_tlog_replica] has occurred - updating... (live nodes size: [2])
[junit4] 2> 1552226 INFO (zkCallback-18678-thread-2) [ ] o.a.s.c.c.ZkStateReader A cluster state change: [WatchedEvent state:SyncConnected type:NodeDataChanged path:/collections/tlog_replica_test_add_remove_tlog_replica/state.json] for collection [tlog_replica_test_add_remove_tlog_replica] has occurred - updating... (live nodes size: [2])
[junit4] 2> 1552226 INFO (zkCallback-18678-thread-1) [ ] o.a.s.c.c.ZkStateReader A cluster state change: [WatchedEvent state:SyncConnected type:NodeDataChanged path:/collections/tlog_replica_test_add_remove_tlog_replica/state.json] for collection [tlog_replica_test_add_remove_tlog_replica] has occurred - updating... (live nodes size: [2])
[junit4] 2> 1552227 INFO (qtp2115282118-28604) [n:127.0.0.1:40753_solr ] o.a.s.s.HttpSolrCall [admin] webapp=null path=/admin/collections params={pullReplicas=0&collection.configName=conf&maxShardsPerNode=100&name=tlog_replica_test_add_remove_tlog_replica&nrtReplicas=0&action=CREATE&numShards=2&tlogReplicas=1&wt=javabin&version=2} status=0 QTime=1525
[junit4] 2> 1552227 INFO (TEST-TestTlogReplica.testAddRemoveTlogReplica-seed#[4E9B597644CD04AF]) [ ] o.a.s.c.SolrCloudTestCase waitForState (tlog_replica_test_add_remove_tlog_replica): Expected collection to be created with 2 shards and 1 replicas
[junit4] 2> 1552228 INFO (TEST-TestTlogReplica.testAddRemoveTlogReplica-seed#[4E9B597644CD04AF]) [ ] o.a.s.c.SolrCloudTestCase active replica count: 2 expected replica count: 2
[junit4] 2> 1552255 INFO (OverseerCollectionConfigSetProcessor-72073761328922630-127.0.0.1:44217_solr-n_0000000000) [n:127.0.0.1:44217_solr ] o.a.s.c.OverseerTaskQueue Response ZK path: /overseer/collection-queue-work/qnr-0000000000 doesn't exist. Requestor may have disconnected from ZooKeeper
[junit4] 2> 1552265 INFO (OverseerThreadFactory-18686-thread-2-processing-n:127.0.0.1:44217_solr) [n:127.0.0.1:44217_solr c:tlog_replica_test_add_remove_tlog_replica s:shard1 ] o.a.s.c.a.c.AddReplicaCmd Node Identified 127.0.0.1:44217_solr for creating new replica of shard shard1 for collection tlog_replica_test_add_remove_tlog_replica
[junit4] 2> 1552266 INFO (OverseerThreadFactory-18686-thread-2-processing-n:127.0.0.1:44217_solr) [n:127.0.0.1:44217_solr c:tlog_replica_test_add_remove_tlog_replica s:shard1 ] o.a.s.c.a.c.AddReplicaCmd Returning CreateReplica command.
[junit4] 2> 1552268 INFO (OverseerStateUpdate-72073761328922630-127.0.0.1:44217_solr-n_0000000000) [n:127.0.0.1:44217_solr ] o.a.s.c.o.SliceMutator createReplica() {
[junit4] 2> "operation":"addreplica",
[junit4] 2> "collection":"tlog_replica_test_add_remove_tlog_replica",
[junit4] 2> "shard":"shard1",
[junit4] 2> "core":"tlog_replica_test_add_remove_tlog_replica_shard1_replica_t5",
[junit4] 2> "state":"down",
[junit4] 2> "node_name":"127.0.0.1:44217_solr",
[junit4] 2> "type":"TLOG"}
[junit4] 2> 1552370 INFO (zkCallback-18700-thread-1) [ ] o.a.s.c.c.ZkStateReader A cluster state change: [WatchedEvent state:SyncConnected type:NodeDataChanged path:/collections/tlog_replica_test_add_remove_tlog_replica/state.json] for collection [tlog_replica_test_add_remove_tlog_replica] has occurred - updating... (live nodes size: [2])
[junit4] 2> 1552370 INFO (zkCallback-18700-thread-2) [ ] o.a.s.c.c.ZkStateReader A cluster state change: [WatchedEvent state:SyncConnected type:NodeDataChanged path:/collections/tlog_replica_test_add_remove_tlog_replica/state.json] for collection [tlog_replica_test_add_remove_tlog_replica] has occurred - updating... (live nodes size: [2])
[junit4] 2> 1552371 INFO (zkCallback-18678-thread-2) [ ] o.a.s.c.c.ZkStateReader A cluster state change: [WatchedEvent state:SyncConnected type:NodeDataChanged path:/collections/tlog_replica_test_add_remove_tlog_replica/state.json] for collection [tlog_replica_test_add_remove_tlog_replica] has occurred - updating... (live nodes size: [2])
[junit4] 2> 1552371 INFO (zkCallback-18678-thread-3) [ ] o.a.s.c.c.ZkStateReader A cluster state change: [WatchedEvent state:SyncConnected type:NodeDataChanged path:/collections/tlog_replica_test_add_remove_tlog_replica/state.json] for collection [tlog_replica_test_add_remove_tlog_replica] has occurred - updating... (live nodes size: [2])
[junit4] 2> 1552540 INFO (qtp1236102733-28599) [n:127.0.0.1:44217_solr ] o.a.s.s.HttpSolrCall HttpSolrCall.init(https://127.0.0.1:44217/solr/admin/cores?null)
[junit4] 2> 1552540 INFO (qtp1236102733-28599) [n:127.0.0.1:44217_solr x:tlog_replica_test_add_remove_tlog_replica_shard1_replica_t5 ] o.a.s.h.a.CoreAdminOperation core create command qt=/admin/cores&coreNodeName=core_node6&collection.configName=conf&name=tlog_replica_test_add_remove_tlog_replica_shard1_replica_t5&action=CREATE&collection=tlog_replica_test_add_remove_tlog_replica&shard=shard1&wt=javabin&version=2&replicaType=TLOG
[junit4] 2> 1552549 INFO (qtp1236102733-28599) [n:127.0.0.1:44217_solr c:tlog_replica_test_add_remove_tlog_replica s:shard1 r:core_node6 x:tlog_replica_test_add_remove_tlog_replica_shard1_replica_t5 ] o.a.s.c.SolrConfig Using Lucene MatchVersion: 8.11.4
[junit4] 2> 1552550 INFO (qtp1236102733-28599) [n:127.0.0.1:44217_solr c:tlog_replica_test_add_remove_tlog_replica s:shard1 r:core_node6 x:tlog_replica_test_add_remove_tlog_replica_shard1_replica_t5 ] o.a.s.s.IndexSchema Schema name=minimal
[junit4] 2> 1552554 INFO (qtp1236102733-28599) [n:127.0.0.1:44217_solr c:tlog_replica_test_add_remove_tlog_replica s:shard1 r:core_node6 x:tlog_replica_test_add_remove_tlog_replica_shard1_replica_t5 ] o.a.s.s.IndexSchema Loaded schema minimal/1.1 with uniqueid field id
[junit4] 2> 1552554 INFO (qtp1236102733-28599) [n:127.0.0.1:44217_solr c:tlog_replica_test_add_remove_tlog_replica s:shard1 r:core_node6 x:tlog_replica_test_add_remove_tlog_replica_shard1_replica_t5 ] o.a.s.c.CoreContainer Creating SolrCore 'tlog_replica_test_add_remove_tlog_replica_shard1_replica_t5' using configuration from configset conf, trusted=true
[junit4] 2> 1552558 INFO (qtp1236102733-28599) [n:127.0.0.1:44217_solr c:tlog_replica_test_add_remove_tlog_replica s:shard1 r:core_node6 x:tlog_replica_test_add_remove_tlog_replica_shard1_replica_t5 ] o.a.s.m.r.SolrJmxReporter JMX monitoring for 'solr_44217.solr.core.tlog_replica_test_add_remove_tlog_replica.shard1.replica_t5' (registry 'solr.core.tlog_replica_test_add_remove_tlog_replica.shard1.replica_t5') enabled at server: com.sun.jmx.mbeanserver.JmxMBeanServer@297e0ab8
[junit4] 2> 1552560 INFO (qtp1236102733-28599) [n:127.0.0.1:44217_solr c:tlog_replica_test_add_remove_tlog_replica s:shard1 r:core_node6 x:tlog_replica_test_add_remove_tlog_replica_shard1_replica_t5 ] o.a.s.c.SolrCore [[tlog_replica_test_add_remove_tlog_replica_shard1_replica_t5] ] Opening new SolrCore at [/home/jenkins/jenkins-slave/workspace/Lucene/Lucene-Solr-Tests-8.11/solr/build/solr-core/test/J2/temp/solr.cloud.TestTlogReplica_4E9B597644CD04AF-001/tempDir-001/node2/tlog_replica_test_add_remove_tlog_replica_shard1_replica_t5], dataDir=[/home/jenkins/jenkins-slave/workspace/Lucene/Lucene-Solr-Tests-8.11/solr/build/solr-core/test/J2/temp/solr.cloud.TestTlogReplica_4E9B597644CD04AF-001/tempDir-001/node2/tlog_replica_test_add_remove_tlog_replica_shard1_replica_t5/data/]
[junit4] 2> 1552825 INFO (zkCallback-18700-thread-1) [ ] o.a.s.c.c.ZkStateReader A cluster state change: [WatchedEvent state:SyncConnected type:NodeDataChanged path:/collections/tlog_replica_test_add_remove_tlog_replica/state.json] for collection [tlog_replica_test_add_remove_tlog_replica] has occurred - updating... (live nodes size: [2])
[junit4] 2> 1552825 INFO (zkCallback-18678-thread-3) [ ] o.a.s.c.c.ZkStateReader A cluster state change: [WatchedEvent state:SyncConnected type:NodeDataChanged path:/collections/tlog_replica_test_add_remove_tlog_replica/state.json] for collection [tlog_replica_test_add_remove_tlog_replica] has occurred - updating... (live nodes size: [2])
[junit4] 2> 1552825 INFO (zkCallback-18700-thread-2) [ ] o.a.s.c.c.ZkStateReader A cluster state change: [WatchedEvent state:SyncConnected type:NodeDataChanged path:/collections/tlog_replica_test_add_remove_tlog_replica/state.json] for collection [tlog_replica_test_add_remove_tlog_replica] has occurred - updating... (live nodes size: [2])
[junit4] 2> 1552825 INFO (zkCallback-18678-thread-2) [ ] o.a.s.c.c.ZkStateReader A cluster state change: [WatchedEvent state:SyncConnected type:NodeDataChanged path:/collections/tlog_replica_test_add_remove_tlog_replica/state.json] for collection [tlog_replica_test_add_remove_tlog_replica] has occurred - updating... (live nodes size: [2])
[junit4] 2> 1552849 INFO (qtp1236102733-28599) [n:127.0.0.1:44217_solr c:tlog_replica_test_add_remove_tlog_replica s:shard1 r:core_node6 x:tlog_replica_test_add_remove_tlog_replica_shard1_replica_t5 ] o.a.s.u.UpdateHandler Using UpdateLog implementation: org.apache.solr.update.UpdateLog
[junit4] 2> 1552849 INFO (qtp1236102733-28599) [n:127.0.0.1:44217_solr c:tlog_replica_test_add_remove_tlog_replica s:shard1 r:core_node6 x:tlog_replica_test_add_remove_tlog_replica_shard1_replica_t5 ] o.a.s.u.UpdateLog Initializing UpdateLog: dataDir=null defaultSyncLevel=FLUSH numRecordsToKeep=100 maxNumLogsToKeep=10 numVersionBuckets=65536
[junit4] 2> 1552850 INFO (qtp1236102733-28599) [n:127.0.0.1:44217_solr c:tlog_replica_test_add_remove_tlog_replica s:shard1 r:core_node6 x:tlog_replica_test_add_remove_tlog_replica_shard1_replica_t5 ] o.a.s.u.CommitTracker Hard AutoCommit: disabled
[junit4] 2> 1552850 INFO (qtp1236102733-28599) [n:127.0.0.1:44217_solr c:tlog_replica_test_add_remove_tlog_replica s:shard1 r:core_node6 x:tlog_replica_test_add_remove_tlog_replica_shard1_replica_t5 ] o.a.s.u.CommitTracker Soft AutoCommit: disabled
[junit4] 2> 1552852 INFO (qtp1236102733-28599) [n:127.0.0.1:44217_solr c:tlog_replica_test_add_remove_tlog_replica s:shard1 r:core_node6 x:tlog_replica_test_add_remove_tlog_replica_shard1_replica_t5 ] o.a.s.r.ManagedResourceStorage Configured ZooKeeperStorageIO with znodeBase: /configs/conf
[junit4] 2> 1552853 INFO (qtp1236102733-28599) [n:127.0.0.1:44217_solr c:tlog_replica_test_add_remove_tlog_replica s:shard1 r:core_node6 x:tlog_replica_test_add_remove_tlog_replica_shard1_replica_t5 ] o.a.s.r.ManagedResourceStorage Loaded null at path _rest_managed.json using ZooKeeperStorageIO:path=/configs/conf
[junit4] 2> 1552853 INFO (qtp1236102733-28599) [n:127.0.0.1:44217_solr c:tlog_replica_test_add_remove_tlog_replica s:shard1 r:core_node6 x:tlog_replica_test_add_remove_tlog_replica_shard1_replica_t5 ] o.a.s.h.ReplicationHandler Commits will be reserved for 10000 ms
[junit4] 2> 1552853 INFO (qtp1236102733-28599) [n:127.0.0.1:44217_solr c:tlog_replica_test_add_remove_tlog_replica s:shard1 r:core_node6 x:tlog_replica_test_add_remove_tlog_replica_shard1_replica_t5 ] o.a.s.u.UpdateLog Could not find max version in index or recent updates, using new clock 1790569247662931968
[junit4] 2> 1552855 INFO (searcherExecutor-18728-thread-1-processing-n:127.0.0.1:44217_solr x:tlog_replica_test_add_remove_tlog_replica_shard1_replica_t5 c:tlog_replica_test_add_remove_tlog_replica s:shard1 r:core_node6) [n:127.0.0.1:44217_solr c:tlog_replica_test_add_remove_tlog_replica s:shard1 r:core_node6 x:tlog_replica_test_add_remove_tlog_replica_shard1_replica_t5 ] o.a.s.c.SolrCore [tlog_replica_test_add_remove_tlog_replica_shard1_replica_t5] Registered new searcher autowarm time: 0 ms
[junit4] 2> 1552856 INFO (qtp1236102733-28599) [n:127.0.0.1:44217_solr c:tlog_replica_test_add_remove_tlog_replica s:shard1 r:core_node6 x:tlog_replica_test_add_remove_tlog_replica_shard1_replica_t5 ] o.a.s.c.ZkShardTerms Successful update of terms at /collections/tlog_replica_test_add_remove_tlog_replica/terms/shard1 to Terms{values={core_node6=0, core_node3=0}, version=1}
[junit4] 2> 1552856 INFO (qtp1236102733-28599) [n:127.0.0.1:44217_solr c:tlog_replica_test_add_remove_tlog_replica s:shard1 r:core_node6 x:tlog_replica_test_add_remove_tlog_replica_shard1_replica_t5 ] o.a.s.c.ShardLeaderElectionContextBase make sure parent is created /collections/tlog_replica_test_add_remove_tlog_replica/leaders/shard1
[junit4] 2> 1552858 INFO (qtp1236102733-28599) [n:127.0.0.1:44217_solr c:tlog_replica_test_add_remove_tlog_replica s:shard1 r:core_node6 x:tlog_replica_test_add_remove_tlog_replica_shard1_replica_t5 ] o.a.s.c.ZkController Core needs to recover:tlog_replica_test_add_remove_tlog_replica_shard1_replica_t5
[junit4] 2> 1552859 INFO (qtp1236102733-28599) [n:127.0.0.1:44217_solr ] o.a.s.s.HttpSolrCall [admin] webapp=null path=/admin/cores params={qt=/admin/cores&coreNodeName=core_node6&collection.configName=conf&name=tlog_replica_test_add_remove_tlog_replica_shard1_replica_t5&action=CREATE&collection=tlog_replica_test_add_remove_tlog_replica&shard=shard1&wt=javabin&version=2&replicaType=TLOG} status=0 QTime=319
[junit4] 2> 1552860 INFO (updateExecutor-18673-thread-1-processing-n:127.0.0.1:44217_solr x:tlog_replica_test_add_remove_tlog_replica_shard1_replica_t5 c:tlog_replica_test_add_remove_tlog_replica s:shard1 r:core_node6) [n:127.0.0.1:44217_solr c:tlog_replica_test_add_remove_tlog_replica s:shard1 r:core_node6 x:tlog_replica_test_add_remove_tlog_replica_shard1_replica_t5 ] o.a.s.u.DefaultSolrCoreState Running recovery
[junit4] 2> 1552867 INFO (qtp2115282118-28600) [n:127.0.0.1:40753_solr ] o.a.s.s.HttpSolrCall [admin] webapp=null path=/c/tlog_replica_test_add_remove_tlog_replica/shards params={} status=0 QTime=622
[junit4] 2> 1552868 INFO (recoveryExecutor-18675-thread-1-processing-n:127.0.0.1:44217_solr x:tlog_replica_test_add_remove_tlog_replica_shard1_replica_t5 c:tlog_replica_test_add_remove_tlog_replica s:shard1 r:core_node6) [n:127.0.0.1:44217_solr c:tlog_replica_test_add_remove_tlog_replica s:shard1 r:core_node6 x:tlog_replica_test_add_remove_tlog_replica_shard1_replica_t5 ] o.a.s.c.RecoveryStrategy Starting recovery process. recoveringAfterStartup=true
[junit4] 2> 1552868 INFO (recoveryExecutor-18675-thread-1-processing-n:127.0.0.1:44217_solr x:tlog_replica_test_add_remove_tlog_replica_shard1_replica_t5 c:tlog_replica_test_add_remove_tlog_replica s:shard1 r:core_node6) [n:127.0.0.1:44217_solr c:tlog_replica_test_add_remove_tlog_replica s:shard1 r:core_node6 x:tlog_replica_test_add_remove_tlog_replica_shard1_replica_t5 ] o.a.s.c.RecoveryStrategy startupVersions is empty
[junit4] 2> 1552868 INFO (recoveryExecutor-18675-thread-1-processing-n:127.0.0.1:44217_solr x:tlog_replica_test_add_remove_tlog_replica_shard1_replica_t5 c:tlog_replica_test_add_remove_tlog_replica s:shard1 r:core_node6) [n:127.0.0.1:44217_solr c:tlog_replica_test_add_remove_tlog_replica s:shard1 r:core_node6 x:tlog_replica_test_add_remove_tlog_replica_shard1_replica_t5 ] o.a.s.c.ZkController tlog_replica_test_add_remove_tlog_replica_shard1_replica_t5 stopping background replication from leader
[junit4] 2> 1552892 INFO (qtp1236102733-28606) [n:127.0.0.1:44217_solr ] o.a.s.s.HttpSolrCall HttpSolrCall.init(https://127.0.0.1:44217/solr/tlog_replica_test_add_remove_tlog_replica_shard1_replica_t1/admin/ping?wt=javabin&version=2)
[junit4] 2> 1552892 INFO (qtp1236102733-28606) [n:127.0.0.1:44217_solr c:tlog_replica_test_add_remove_tlog_replica s:shard1 r:core_node3 x:tlog_replica_test_add_remove_tlog_replica_shard1_replica_t1 ] o.a.s.c.S.Request [tlog_replica_test_add_remove_tlog_replica_shard1_replica_t1] webapp=/solr path=/admin/ping params={wt=javabin&version=2} hits=0 status=0 QTime=0
[junit4] 2> 1552892 INFO (qtp1236102733-28606) [n:127.0.0.1:44217_solr c:tlog_replica_test_add_remove_tlog_replica s:shard1 r:core_node3 x:tlog_replica_test_add_remove_tlog_replica_shard1_replica_t1 ] o.a.s.c.S.Request [tlog_replica_test_add_remove_tlog_replica_shard1_replica_t1] webapp=/solr path=/admin/ping params={wt=javabin&version=2} status=0 QTime=0
[junit4] 2> 1552892 INFO (recoveryExecutor-18675-thread-1-processing-n:127.0.0.1:44217_solr x:tlog_replica_test_add_remove_tlog_replica_shard1_replica_t5 c:tlog_replica_test_add_remove_tlog_replica s:shard1 r:core_node6) [n:127.0.0.1:44217_solr c:tlog_replica_test_add_remove_tlog_replica s:shard1 r:core_node6 x:tlog_replica_test_add_remove_tlog_replica_shard1_replica_t5 ] o.a.s.c.RecoveryStrategy Begin buffering updates. core=[tlog_replica_test_add_remove_tlog_replica_shard1_replica_t5]
[junit4] 2> 1552892 INFO (recoveryExecutor-18675-thread-1-processing-n:127.0.0.1:44217_solr x:tlog_replica_test_add_remove_tlog_replica_shard1_replica_t5 c:tlog_replica_test_add_remove_tlog_replica s:shard1 r:core_node6) [n:127.0.0.1:44217_solr c:tlog_replica_test_add_remove_tlog_replica s:shard1 r:core_node6 x:tlog_replica_test_add_remove_tlog_replica_shard1_replica_t5 ] o.a.s.u.UpdateLog Starting to buffer updates. FSUpdateLog{state=ACTIVE, tlog=null}
[junit4] 2> 1552892 INFO (recoveryExecutor-18675-thread-1-processing-n:127.0.0.1:44217_solr x:tlog_replica_test_add_remove_tlog_replica_shard1_replica_t5 c:tlog_replica_test_add_remove_tlog_replica s:shard1 r:core_node6) [n:127.0.0.1:44217_solr c:tlog_replica_test_add_remove_tlog_replica s:shard1 r:core_node6 x:tlog_replica_test_add_remove_tlog_replica_shard1_replica_t5 ] o.a.s.c.RecoveryStrategy Publishing state of core [tlog_replica_test_add_remove_tlog_replica_shard1_replica_t5] as recovering, leader is [https://127.0.0.1:44217/solr/tlog_replica_test_add_remove_tlog_replica_shard1_replica_t1/] and I am [https://127.0.0.1:44217/solr/tlog_replica_test_add_remove_tlog_replica_shard1_replica_t5/]
[junit4] 2> 1552904 INFO (qtp1236102733-28605) [n:127.0.0.1:44217_solr ] o.a.s.s.HttpSolrCall HttpSolrCall.init(https://127.0.0.1:44217/solr/admin/collections?action=ADDREPLICA&collection=tlog_replica_test_add_remove_tlog_replica&shard=shard2&type=TLOG)
[junit4] 2> 1552905 INFO (recoveryExecutor-18675-thread-1-processing-n:127.0.0.1:44217_solr x:tlog_replica_test_add_remove_tlog_replica_shard1_replica_t5 c:tlog_replica_test_add_remove_tlog_replica s:shard1 r:core_node6) [n:127.0.0.1:44217_solr c:tlog_replica_test_add_remove_tlog_replica s:shard1 r:core_node6 x:tlog_replica_test_add_remove_tlog_replica_shard1_replica_t5 ] o.a.s.c.RecoveryStrategy Sending prep recovery command to [https://127.0.0.1:44217/solr]; [WaitForState: action=PREPRECOVERY&core=tlog_replica_test_add_remove_tlog_replica_shard1_replica_t1&nodeName=127.0.0.1:44217_solr&coreNodeName=core_node6&state=recovering&checkLive=true&onlyIfLeader=true&onlyIfLeaderActive=true]
[junit4] 2> 1552905 INFO (qtp1236102733-28606) [n:127.0.0.1:44217_solr ] o.a.s.s.HttpSolrCall HttpSolrCall.init(https://127.0.0.1:44217/solr/admin/cores?action=PREPRECOVERY&core=tlog_replica_test_add_remove_tlog_replica_shard1_replica_t1&nodeName=127.0.0.1%3A44217_solr&coreNodeName=core_node6&state=recovering&checkLive=true&onlyIfLeader=true&onlyIfLeaderActive=true&wt=javabin&version=2)
[junit4] 2> 1552905 INFO (qtp1236102733-28606) [n:127.0.0.1:44217_solr x:tlog_replica_test_add_remove_tlog_replica_shard1_replica_t1 ] o.a.s.h.a.PrepRecoveryOp Going to wait for coreNodeName: core_node6, state: recovering, checkLive: true, onlyIfLeader: true, onlyIfLeaderActive: true
[junit4] 2> 1552905 INFO (qtp1236102733-28606) [n:127.0.0.1:44217_solr ] o.a.s.h.a.PrepRecoveryOp In WaitForState(recovering): collection=tlog_replica_test_add_remove_tlog_replica, shard=shard1, thisCore=tlog_replica_test_add_remove_tlog_replica_shard1_replica_t1, leaderDoesNotNeedRecovery=false, isLeader? true, live=true, checkLive=true, currentState=down, localState=active, nodeName=127.0.0.1:44217_solr, coreNodeName=core_node6, onlyIfActiveCheckResult=false, nodeProps: core_node6:{
[junit4] 2> "core":"tlog_replica_test_add_remove_tlog_replica_shard1_replica_t5",
[junit4] 2> "node_name":"127.0.0.1:44217_solr",
[junit4] 2> "base_url":"https://127.0.0.1:44217/solr",
[junit4] 2> "state":"down",
[junit4] 2> "type":"TLOG",
[junit4] 2> "force_set_state":"false"}
[junit4] 2> 1552905 INFO (qtp1236102733-28606) [n:127.0.0.1:44217_solr ] o.a.s.h.a.PrepRecoveryOp In WaitForState(recovering): collection=tlog_replica_test_add_remove_tlog_replica, shard=shard1, thisCore=tlog_replica_test_add_remove_tlog_replica_shard1_replica_t1, leaderDoesNotNeedRecovery=false, isLeader? true, live=true, checkLive=true, currentState=down, localState=active, nodeName=127.0.0.1:44217_solr, coreNodeName=core_node6, onlyIfActiveCheckResult=false, nodeProps: core_node6:{
[junit4] 2> "core":"tlog_replica_test_add_remove_tlog_replica_shard1_replica_t5",
[junit4] 2> "node_name":"127.0.0.1:44217_solr",
[junit4] 2> "base_url":"https://127.0.0.1:44217/solr",
[junit4] 2> "state":"down",
[junit4] 2> "type":"TLOG",
[junit4] 2> "force_set_state":"false"}
[junit4] 2> 1552905 INFO (qtp1236102733-28606) [n:127.0.0.1:44217_solr ] o.a.s.h.a.PrepRecoveryOp In WaitForState(recovering): collection=tlog_replica_test_add_remove_tlog_replica, shard=shard1, thisCore=tlog_replica_test_add_remove_tlog_replica_shard1_replica_t1, leaderDoesNotNeedRecovery=false, isLeader? true, live=true, checkLive=true, currentState=down, localState=active, nodeName=127.0.0.1:44217_solr, coreNodeName=core_node6, onlyIfActiveCheckResult=false, nodeProps: core_node6:{
[junit4] 2> "core":"tlog_replica_test_add_remove_tlog_replica_shard1_replica_t5",
[junit4] 2> "node_name":"127.0.0.1:44217_solr",
[junit4] 2> "base_url":"https://127.0.0.1:44217/solr",
[junit4] 2> "state":"down",
[junit4] 2> "type":"TLOG",
[junit4] 2> "force_set_state":"false"}
[junit4] 2> 1552905 INFO (qtp1236102733-28606) [n:127.0.0.1:44217_solr ] o.a.s.h.a.PrepRecoveryOp In WaitForState(recovering): collection=tlog_replica_test_add_remove_tlog_replica, shard=shard1, thisCore=tlog_replica_test_add_remove_tlog_replica_shard1_replica_t1, leaderDoesNotNeedRecovery=false, isLeader? true, live=true, checkLive=true, currentState=down, localState=active, nodeName=127.0.0.1:44217_solr, coreNodeName=core_node6, onlyIfActiveCheckResult=false, nodeProps: core_node6:{
[junit4] 2> "core":"tlog_replica_test_add_remove_tlog_replica_shard1_replica_t5",
[junit4] 2> "node_name":"127.0.0.1:44217_solr",
[junit4] 2> "base_url":"https://127.0.0.1:44217/solr",
[junit4] 2> "state":"down",
[junit4] 2> "type":"TLOG",
[junit4] 2> "force_set_state":"false"}
[junit4] 2> 1552912 INFO (OverseerCollectionConfigSetProcessor-72073761328922630-127.0.0.1:44217_solr-n_0000000000) [n:127.0.0.1:44217_solr ] o.a.s.c.OverseerTaskQueue Response ZK path: /overseer/collection-queue-work/qnr-0000000002 doesn't exist. Requestor may have disconnected from ZooKeeper
[junit4] 2> 1552912 INFO (OverseerThreadFactory-18686-thread-3-processing-n:127.0.0.1:44217_solr) [n:127.0.0.1:44217_solr c:tlog_replica_test_add_remove_tlog_replica s:shard2 ] o.a.s.c.a.c.AddReplicaCmd Node Identified 127.0.0.1:40753_solr for creating new replica of shard shard2 for collection tlog_replica_test_add_remove_tlog_replica
[junit4] 2> 1552916 INFO (OverseerThreadFactory-18686-thread-3-processing-n:127.0.0.1:44217_solr) [n:127.0.0.1:44217_solr c:tlog_replica_test_add_remove_tlog_replica s:shard2 ] o.a.s.c.a.c.AddReplicaCmd Returning CreateReplica command.
[junit4] 2> 1552919 INFO (OverseerStateUpdate-72073761328922630-127.0.0.1:44217_solr-n_0000000000) [n:127.0.0.1:44217_solr ] o.a.s.c.o.SliceMutator createReplica() {
[junit4] 2> "operation":"addreplica",
[junit4] 2> "collection":"tlog_replica_test_add_remove_tlog_replica",
[junit4] 2> "shard":"shard2",
[junit4] 2> "core":"tlog_replica_test_add_remove_tlog_replica_shard2_replica_t7",
[junit4] 2> "state":"down",
[junit4] 2> "node_name":"127.0.0.1:40753_solr",
[junit4] 2> "type":"TLOG"}
[junit4] 2> 1553021 INFO (zkCallback-18700-thread-1) [ ] o.a.s.c.c.ZkStateReader A cluster state change: [WatchedEvent state:SyncConnected type:NodeDataChanged path:/collections/tlog_replica_test_add_remove_tlog_replica/state.json] for collection [tlog_replica_test_add_remove_tlog_replica] has occurred - updating... (live nodes size: [2])
[junit4] 2> 1553021 INFO (zkCallback-18700-thread-2) [ ] o.a.s.c.c.ZkStateReader A cluster state change: [WatchedEvent state:SyncConnected type:NodeDataChanged path:/collections/tlog_replica_test_add_remove_tlog_replica/state.json] for collection [tlog_replica_test_add_remove_tlog_replica] has occurred - updating... (live nodes size: [2])
[junit4] 2> 1553021 INFO (zkCallback-18678-thread-2) [ ] o.a.s.c.c.ZkStateReader A cluster state change: [WatchedEvent state:SyncConnected type:NodeDataChanged path:/collections/tlog_replica_test_add_remove_tlog_replica/state.json] for collection [tlog_replica_test_add_remove_tlog_replica] has occurred - updating... (live nodes size: [2])
[junit4] 2> 1553021 INFO (zkCallback-18678-thread-3) [ ] o.a.s.c.c.ZkStateReader A cluster state change: [WatchedEvent state:SyncConnected type:NodeDataChanged path:/collections/tlog_replica_test_add_remove_tlog_replica/state.json] for collection [tlog_replica_test_add_remove_tlog_replica] has occurred - updating... (live nodes size: [2])
[junit4] 2> 1553022 INFO (watches-18680-thread-2) [n:127.0.0.1:44217_solr ] o.a.s.h.a.PrepRecoveryOp In WaitForState(recovering): collection=tlog_replica_test_add_remove_tlog_replica, shard=shard1, thisCore=tlog_replica_test_add_remove_tlog_replica_shard1_replica_t1, leaderDoesNotNeedRecovery=false, isLeader? true, live=true, checkLive=true, currentState=recovering, localState=active, nodeName=127.0.0.1:44217_solr, coreNodeName=core_node6, onlyIfActiveCheckResult=false, nodeProps: core_node6:{
[junit4] 2> "core":"tlog_replica_test_add_remove_tlog_replica_shard1_replica_t5",
[junit4] 2> "node_name":"127.0.0.1:44217_solr",
[junit4] 2> "base_url":"https://127.0.0.1:44217/solr",
[junit4] 2> "state":"recovering",
[junit4] 2> "type":"TLOG",
[junit4] 2> "force_set_state":"false"}
[junit4] 2> 1553022 INFO (watches-18680-thread-1) [n:127.0.0.1:44217_solr ] o.a.s.h.a.PrepRecoveryOp In WaitForState(recovering): collection=tlog_replica_test_add_remove_tlog_replica, shard=shard1, thisCore=tlog_replica_test_add_remove_tlog_replica_shard1_replica_t1, leaderDoesNotNeedRecovery=false, isLeader? true, live=true, checkLive=true, currentState=recovering, localState=active, nodeName=127.0.0.1:44217_solr, coreNodeName=core_node6, onlyIfActiveCheckResult=false, nodeProps: core_node6:{
[junit4] 2> "core":"tlog_replica_test_add_remove_tlog_replica_shard1_replica_t5",
[junit4] 2> "node_name":"127.0.0.1:44217_solr",
[junit4] 2> "base_url":"https://127.0.0.1:44217/solr",
[junit4] 2> "state":"recovering",
[junit4] 2> "type":"TLOG",
[junit4] 2> "force_set_state":"false"}
[junit4]
[...truncated too long message...]
ctionprops.json
[junit4] 2> 2 /solr/collections/tlog_replica_test_real_time_get/collectionprops.json
[junit4] 2> 2 /solr/collections/tlog_replica_test_add_remove_tlog_replica/collectionprops.json
[junit4] 2> 2 /solr/collections/tlog_replica_test_basic_leader_election/state.json
[junit4] 2> 2 /solr/collections/tlog_replica_test_add_docs/collectionprops.json
[junit4] 2> 2 /solr/collections/tlog_replica_test_remove_leader/collectionprops.json
[junit4] 2> 2 /solr/collections/tlog_replica_test_only_leader_indexes/collectionprops.json
[junit4] 2>
[junit4] 2> Maximum concurrent data watches above limit:
[junit4] 2>
[junit4] 2> 49 /solr/collections/tlog_replica_test_add_remove_tlog_replica/state.json
[junit4] 2> 44 /solr/collections/tlog_replica_test_recovery/state.json
[junit4] 2> 28 /solr/collections/tlog_replica_test_kill_leader/state.json
[junit4] 2> 28 /solr/collections/tlog_replica_test_create_delete/state.json
[junit4] 2> 23 /solr/collections/tlog_replica_test_out_of_order_db_qwith_in_place_updates/state.json
[junit4] 2> 23 /solr/collections/tlog_replica_test_basic_leader_election/state.json
[junit4] 2> 21 /solr/collections/tlog_replica_test_remove_leader/state.json
[junit4] 2> 18 /solr/collections/tlog_replica_test_rebalance_leaders/state.json
[junit4] 2> 13 /solr/collections/tlog_replica_test_only_leader_indexes/state.json
[junit4] 2> 12 /solr/clusterprops.json
[junit4] 2> 9 /solr/collections/tlog_replica_test_add_docs/state.json
[junit4] 2> 9 /solr/clusterstate.json
[junit4] 2> 9 /solr/collections/tlog_replica_test_real_time_get/state.json
[junit4] 2> 9 /solr/collections/tlog_replica_test_delete_by_id/state.json
[junit4] 2> 4 /solr/collections/tlog_replica_test_recovery/leader_elect/shard1/election/72073761328922642-core_node3-n_0000000000
[junit4] 2> 3 /solr/collections/tlog_replica_test_create_delete/leader_elect/shard2/election/72073761328922639-core_node16-n_0000000000
[junit4] 2> 3 /solr/overseer_elect/election/72073761328922632-127.0.0.1:40753_solr-n_0000000001
[junit4] 2> 3 /solr/autoscaling.json
[junit4] 2> 3 /solr/overseer_elect/election/72073761328922642-127.0.0.1:44217_solr-n_0000000004
[junit4] 2> 2 /solr/collections/tlog_replica_test_create_delete/leader_elect/shard1/election/72073761328922632-core_node3-n_0000000000
[junit4] 2> 2 /solr/collections/tlog_replica_test_create_delete/leader_elect/shard1/election/72073761328922632-core_node4-n_0000000000
[junit4] 2> 2 /solr/collections/tlog_replica_test_create_delete/leader_elect/shard2/election/72073761328922639-core_node11-n_0000000000
[junit4] 2> 2 /solr/collections/tlog_replica_test_create_delete/leader_elect/shard1/election/72073761328922639-core_node3-n_0000000001
[junit4] 2>
[junit4] 2> Maximum concurrent children watches above limit:
[junit4] 2>
[junit4] 2> 369 /solr/overseer/queue
[junit4] 2> 129 /solr/overseer/collection-queue-work
[junit4] 2> 87 /solr/collections
[junit4] 2> 42 /solr/live_nodes
[junit4] 2> 9 /solr/collections/tlog_replica_test_recovery/state.json
[junit4] 2> 8 /solr/collections/tlog_replica_test_create_delete/state.json
[junit4] 2> 7 /solr/collections/tlog_replica_test_kill_leader/state.json
[junit4] 2> 6 /solr/collections/tlog_replica_test_out_of_order_db_qwith_in_place_updates/state.json
[junit4] 2> 6 /solr/collections/tlog_replica_test_basic_leader_election/state.json
[junit4] 2> 6 /solr/collections/tlog_replica_test_add_remove_tlog_replica/state.json
[junit4] 2> 6 /solr/collections/tlog_replica_test_remove_leader/state.json
[junit4] 2> 4 /solr/collections/tlog_replica_test_only_leader_indexes/state.json
[junit4] 2> 3 /solr/autoscaling/events/.auto_add_replicas
[junit4] 2> 3 /solr/collections/tlog_replica_test_rebalance_leaders/state.json
[junit4] 2> 3 /solr/collections/tlog_replica_test_add_docs/state.json
[junit4] 2> 3 /solr/autoscaling/events/.scheduled_maintenance
[junit4] 2> 3 /solr/overseer/queue-work
[junit4] 2> 3 /solr/collections/tlog_replica_test_real_time_get/state.json
[junit4] 2> 3 /solr/collections/tlog_replica_test_delete_by_id/state.json
[junit4] 2>
[junit4] 2> 1764863 INFO (SUITE-TestTlogReplica-seed#[4E9B597644CD04AF]-worker) [n:127.0.0.1:44217_solr ] o.a.s.c.ZkTestServer waitForServerDown: 127.0.0.1:37353
[junit4] 2> 1764863 INFO (SUITE-TestTlogReplica-seed#[4E9B597644CD04AF]-worker) [n:127.0.0.1:44217_solr ] o.a.s.c.ZkTestServer parse host and port list: 127.0.0.1:37353
[junit4] 2> 1764863 INFO (SUITE-TestTlogReplica-seed#[4E9B597644CD04AF]-worker) [n:127.0.0.1:44217_solr ] o.a.s.c.ZkTestServer connecting to 127.0.0.1 37353
[junit4] 2> 1764866 INFO (SUITE-TestTlogReplica-seed#[4E9B597644CD04AF]-worker) [n:127.0.0.1:44217_solr ] o.a.s.u.ErrorLogMuter Closing ErrorLogMuter-regex-382 after mutting 0 log messages
[junit4] 2> 1764866 INFO (SUITE-TestTlogReplica-seed#[4E9B597644CD04AF]-worker) [n:127.0.0.1:44217_solr ] o.a.s.u.ErrorLogMuter Creating ErrorLogMuter-regex-383 for ERROR logs matching regex: ignore_exception
[junit4] 2> NOTE: leaving temporary files on disk at: /home/jenkins/jenkins-slave/workspace/Lucene/Lucene-Solr-Tests-8.11/solr/build/solr-core/test/J2/temp/solr.cloud.TestTlogReplica_4E9B597644CD04AF-001
[junit4] 2> Feb 11, 2024 2:55:15 AM com.carrotsearch.randomizedtesting.ThreadLeakControl checkThreadLeaks
[junit4] 2> WARNING: Will linger awaiting termination of 1 leaked thread(s).
[junit4] 2> NOTE: test params are: codec=Asserting(Lucene87): {foo=PostingsFormat(name=Direct), _root_=PostingsFormat(name=Direct), title_s=TestBloomFilteredLucenePostings(BloomFilteringPostingsFormat(Lucene84)), id=FST50, foo_s=PostingsFormat(name=Direct)}, docValues:{_version_=DocValuesFormat(name=Direct), id=DocValuesFormat(name=Asserting), inplace_updatable_int=DocValuesFormat(name=Lucene80)}, maxPointsInLeafNode=57, maxMBSortInHeap=7.442371237954657, sim=Asserting(RandomSimilarity(queryNorm=false): {}), locale=en-PH, timezone=America/Resolute
[junit4] 2> NOTE: Linux 5.4.0-171-generic amd64/Temurin 1.8.0_362 (64-bit)/cpus=4,threads=1,free=195992208,total=519045120
[junit4] 2> NOTE: All tests run in this JVM: [NodeMutatorTest, ThreadDumpHandlerTest, TestRawResponseWriter, TestManagedSynonymFilterFactory, PeerSyncReplicationTest, TestBM25SimilarityFactory, SolrInfoBeanTest, ChaosMonkeyNothingIsSafeWithPullReplicasTest, CoreAdminOperationTest, TestRTGBase, BackupIdTest, DOMUtilTest, TestInPlaceUpdatesRequiredField, TestMacroExpander, DeleteByIdWithRouterFieldTest, HttpTriggerListenerTest, LukeRequestHandlerTest, TestSimNodeLostTrigger, IndexSchemaTest, SolrCloudExampleTest, TestLegacyField, TestApiFramework, JavaBinAtomicUpdateMultivalueTest, CleanupOldIndexTest, HdfsBasicDistributedZkTest, SolrGraphiteReporterTest, PluginInfoTest, TestRealTimeGet, TestFieldCacheSort, TestUnifiedSolrHighlighter, TestSafeXMLParsing, BooleanFieldTest, TestRebalanceLeaders, OpenExchangeRatesOrgProviderTest, TestJsonFacetsWithNestedObjects, TestQuerySenderListener, MoreLikeThisHandlerTest, TestConfigSets, TestCursorMarkWithoutUniqueKey, HttpPartitionTest, TestSolrCloudSnapshots, EmbeddedSolrNoSerializeTest, CSVRequestHandlerTest, TestAnalyzedSuggestions, ForceLeaderTest, TestExtendedDismaxParser, VMParamsZkACLAndCredentialsProvidersTest, OverseerStatusTest, TestRandomDVFaceting, TestUpdate, PrimitiveFieldTypeTest, SystemCollectionCompatTest, TestCloudNestedDocsSort, TestTermQParserPlugin, SchemaVersionSpecificBehaviorTest, TestLazyCores, JWTVerificationkeyResolverTest, TestSimComputePlanAction, ZkNodePropsTest, CdcrBootstrapTest, QueryEqualityTest, AddBlockUpdateTest, TestStressReorder, TestDynamicFieldResource, LeaderElectionTest, MoveReplicaTest, ShardTermsTest, RegexBoostProcessorTest, NumberUtilsTest, TestSchemaDesignerSettingsDAO, ConcurrentCreateRoutedAliasTest, TestMultiValuedNumericRangeQuery, NodeLostTriggerIntegrationTest, TestTextField, PropertiesRequestHandlerTest, HttpSolrCallCloudTest, ByteBuffersDirectoryFactoryTest, DirectoryFactoriesTest, ClusterStateUpdateTest, BasicDistributedZk2Test, AsyncCallRequestStatusResponseTest, SpatialHeatmapFacetsTest, TolerantUpdateProcessorTest, CustomCollectionTest, StressHdfsTest, EchoParamsTest, TestManagedSchemaAPI, TestFastOutputStream, SolrCloudReportersTest, UpdateLogCloudTest, TestSolrCoreParser, SpatialFilterTest, DistributedFacetExistsSmallTest, TestFunctionQuery, CloneFieldUpdateProcessorFactoryTest, AdminHandlersProxyTest, TestStressLiveNodes, BJQFilterAccessibleTest, TestReplicaProperties, TestFacetMethods, TestCharFilters, ZkDynamicConfigTest, TestSimExtremeIndexing, TestExpandComponent, TestImplicitCoreProperties, MigrateRouteKeyTest, TestShortCircuitedRequests, TestZkChroot, TestWordDelimiterFilterFactory, TestSubQueryTransformerCrossCore, TestHttpServletCarrier, DeleteShardTest, TestCustomStream, OverseerModifyCollectionTest, DistributedTermsComponentTest, ExplicitHLLTest, TestTolerantSearch, TestDocumentBuilder, TestGroupingSearch, TestTrie, TestDeprecatedFilters, TokenizerChainTest, TestLuceneIndexBackCompat, DistribCursorPagingTest, LeaderFailoverAfterPartitionTest, LeaderFailureAfterFreshStartTest, OutOfBoxZkACLAndCredentialsProvidersTest, RecoveryZkTest, ReindexCollectionTest, TestCloudPivotFacet, TestCloudRecovery2, TestConfigSetsAPI, TestDeleteCollectionOnDownNodes, TestDistributedMap, TestDownShardTolerantSearch, TestExclusionRuleCollectionAccess, TestLockTree, TestMiniSolrCloudClusterSSL, TestQueryingOnDownCollection, TestRequestForwarding, TestSolrCloudWithDelegationTokens, TestSolrCloudWithSecureImpersonation, TestTlogReplica]
[junit4] Completed [582/959 (1!)] on J2 in 217.81s, 14 tests, 1 failure, 1 skipped <<< FAILURES!
[...truncated 55661 lines...]