You are viewing a plain text version of this content. The canonical link for it is here.
Posted to builds@beam.apache.org by Apache Jenkins Server <je...@builds.apache.org> on 2023/03/08 00:37:26 UTC
Build failed in Jenkins: beam_PerformanceTests_PubsubIOIT_Python_Streaming #1002
See <https://ci-beam.apache.org/job/beam_PerformanceTests_PubsubIOIT_Python_Streaming/1002/display/redirect>
Changes:
------------------------------------------
[...truncated 30.47 KB...]
Using cached idna-3.4-py3-none-any.whl (61 kB)
Collecting urllib3<1.27,>=1.21.1
Using cached urllib3-1.26.14-py2.py3-none-any.whl (140 kB)
Collecting charset-normalizer<4,>=2
Using cached charset_normalizer-3.1.0-cp37-cp37m-manylinux_2_17_x86_64.manylinux2014_x86_64.whl (171 kB)
Collecting certifi>=2017.4.17
Using cached certifi-2022.12.7-py3-none-any.whl (155 kB)
Collecting scipy>=1.1.0
Using cached scipy-1.7.3-cp37-cp37m-manylinux_2_12_x86_64.manylinux2010_x86_64.whl (38.1 MB)
Collecting threadpoolctl>=2.0.0
Using cached threadpoolctl-3.1.0-py3-none-any.whl (14 kB)
Collecting greenlet!=0.4.17
Using cached greenlet-2.0.2-cp37-cp37m-manylinux_2_17_x86_64.manylinux2014_x86_64.whl (566 kB)
Collecting deprecation
Using cached deprecation-2.1.0-py2.py3-none-any.whl (11 kB)
Collecting wrapt
Using cached wrapt-1.15.0-cp37-cp37m-manylinux_2_5_x86_64.manylinux1_x86_64.manylinux_2_17_x86_64.manylinux2014_x86_64.whl (75 kB)
Collecting docker>=4.0.0
Using cached docker-6.0.1-py3-none-any.whl (147 kB)
Collecting pymysql
Using cached PyMySQL-1.0.2-py3-none-any.whl (43 kB)
Collecting pycparser
Using cached pycparser-2.21-py2.py3-none-any.whl (118 kB)
Collecting websocket-client>=0.32.0
Using cached websocket_client-1.5.1-py3-none-any.whl (55 kB)
Collecting googleapis-common-protos<2.0dev,>=1.56.2
Using cached googleapis_common_protos-1.58.0-py2.py3-none-any.whl (223 kB)
Collecting google-crc32c<2.0dev,>=1.0
Using cached google_crc32c-1.5.0-cp37-cp37m-manylinux_2_17_x86_64.manylinux2014_x86_64.whl (32 kB)
Collecting grpcio-status>=1.33.2
Using cached grpcio_status-1.51.1-py3-none-any.whl (5.1 kB)
Using cached grpcio_status-1.50.0-py3-none-any.whl (14 kB)
Using cached grpcio_status-1.49.1-py3-none-any.whl (14 kB)
Using cached grpcio_status-1.48.2-py3-none-any.whl (14 kB)
Requirement already satisfied: zipp>=0.5 in <https://ci-beam.apache.org/job/beam_PerformanceTests_PubsubIOIT_Python_Streaming/ws/src/build/gradleenv/1329484227/lib/python3.7/site-packages> (from importlib-metadata>=0.12->pytest<8.0,>=7.1.2->apache-beam==2.47.0.dev0) (3.15.0)
Collecting PyJWT[crypto]<3,>=1.0.0
Using cached PyJWT-2.6.0-py3-none-any.whl (20 kB)
Collecting portalocker<3,>=1.0
Using cached portalocker-2.7.0-py2.py3-none-any.whl (15 kB)
Collecting pyasn1>=0.1.7
Using cached pyasn1-0.4.8-py2.py3-none-any.whl (77 kB)
Requirement already satisfied: py in <https://ci-beam.apache.org/job/beam_PerformanceTests_PubsubIOIT_Python_Streaming/ws/src/build/gradleenv/1329484227/lib/python3.7/site-packages> (from pytest-forked->pytest-xdist<3,>=2.5.0->apache-beam==2.47.0.dev0) (1.11.0)
Building wheels for collected packages: apache-beam
Building wheel for apache-beam (setup.py): started
Building wheel for apache-beam (setup.py): finished with status 'done'
Created wheel for apache-beam: filename=apache_beam-2.47.0.dev0-py3-none-any.whl size=3034641 sha256=ff28768166b3f8ac86e8aef9488c9301dfa72fe1eb7213a5026ec492bc01c13f
Stored in directory: /home/jenkins/.cache/pip/wheels/ab/30/db/7a1d878abb34081c011192312e662d364ee443467dfb553778
Successfully built apache-beam
Installing collected packages: sortedcontainers, pytz, pyasn1, parameterized, docopt, crcmod, zstandard, wrapt, websocket-client, urllib3, tomli, threadpoolctl, tenacity, sqlparse, scipy, rsa, regex, pyyaml, python-dateutil, pyparsing, pymysql, pymongo, PyJWT, pyhamcrest, pycparser, pyasn1-modules, pyarrow, psycopg2-binary, proto-plus, portalocker, overrides, orjson, objsize, mock, joblib, jmespath, isodate, iniconfig, idna, greenlet, googleapis-common-protos, google-crc32c, fasteners, fastavro, execnet, exceptiongroup, dill, deprecation, cloudpickle, charset-normalizer, certifi, cachetools, attrs, sqlalchemy, scikit-learn, requests, pydot, pandas, hypothesis, httplib2, grpcio-status, google-resumable-media, google-auth, freezegun, cffi, botocore, s3transfer, requests_mock, pytest, oauth2client, hdfs, grpc-google-iam-v1, google-auth-httplib2, google-api-core, docker, cryptography, azure-core, testcontainers, pytest-timeout, pytest-forked, google-cloud-core, google-apitools, boto3, azure-storage-blob, apache-beam, pytest-xdist, msal, google-cloud-vision, google-cloud-videointelligence, google-cloud-spanner, google-cloud-recommendations-ai, google-cloud-pubsub, google-cloud-language, google-cloud-dlp, google-cloud-datastore, google-cloud-bigtable, google-cloud-bigquery-storage, google-cloud-bigquery, msal-extensions, google-cloud-pubsublite, azure-identity
Successfully installed PyJWT-2.6.0 apache-beam-2.47.0.dev0 attrs-22.2.0 azure-core-1.26.3 azure-identity-1.12.0 azure-storage-blob-12.15.0 boto3-1.26.86 botocore-1.29.86 cachetools-4.2.4 certifi-2022.12.7 cffi-1.15.1 charset-normalizer-3.1.0 cloudpickle-2.2.1 crcmod-1.7 cryptography-39.0.2 deprecation-2.1.0 dill-0.3.1.1 docker-6.0.1 docopt-0.6.2 exceptiongroup-1.1.0 execnet-1.9.0 fastavro-1.7.2 fasteners-0.18 freezegun-1.2.2 google-api-core-2.11.0 google-apitools-0.5.31 google-auth-2.16.2 google-auth-httplib2-0.1.0 google-cloud-bigquery-3.6.0 google-cloud-bigquery-storage-2.16.2 google-cloud-bigtable-1.7.3 google-cloud-core-2.3.2 google-cloud-datastore-1.15.5 google-cloud-dlp-3.12.0 google-cloud-language-1.3.2 google-cloud-pubsub-2.15.0 google-cloud-pubsublite-1.7.0 google-cloud-recommendations-ai-0.7.1 google-cloud-spanner-3.28.0 google-cloud-videointelligence-1.16.3 google-cloud-vision-3.4.0 google-crc32c-1.5.0 google-resumable-media-2.4.1 googleapis-common-protos-1.58.0 greenlet-2.0.2 grpc-google-iam-v1-0.12.6 grpcio-status-1.48.2 hdfs-2.7.0 httplib2-0.21.0 hypothesis-6.68.2 idna-3.4 iniconfig-2.0.0 isodate-0.6.1 jmespath-1.0.1 joblib-1.2.0 mock-5.0.1 msal-1.21.0 msal-extensions-1.0.0 oauth2client-4.1.3 objsize-0.6.1 orjson-3.8.7 overrides-6.5.0 pandas-1.3.5 parameterized-0.8.1 portalocker-2.7.0 proto-plus-1.22.2 psycopg2-binary-2.9.5 pyarrow-9.0.0 pyasn1-0.4.8 pyasn1-modules-0.2.8 pycparser-2.21 pydot-1.4.2 pyhamcrest-1.10.1 pymongo-3.13.0 pymysql-1.0.2 pyparsing-3.0.9 pytest-7.2.2 pytest-forked-1.6.0 pytest-timeout-2.1.0 pytest-xdist-2.5.0 python-dateutil-2.8.2 pytz-2022.7.1 pyyaml-6.0 regex-2022.10.31 requests-2.28.2 requests_mock-1.10.0 rsa-4.9 s3transfer-0.6.0 scikit-learn-1.0.2 scipy-1.7.3 sortedcontainers-2.4.0 sqlalchemy-1.4.46 sqlparse-0.4.3 tenacity-5.1.5 testcontainers-3.7.1 threadpoolctl-3.1.0 tomli-2.0.1 urllib3-1.26.14 websocket-client-1.5.1 wrapt-1.15.0 zstandard-0.20.0
> Task :sdks:python:apache_beam:testing:load_tests:run
INFO:apache_beam.runners.portability.stager:Copying Beam SDK "<https://ci-beam.apache.org/job/beam_PerformanceTests_PubsubIOIT_Python_Streaming/ws/src/sdks/python/build/apache-beam.tar.gz"> to staging location.
INFO:apache_beam.runners.dataflow.dataflow_runner:Pipeline has additional dependencies to be installed in SDK **** container, consider using the SDK container image pre-building workflow to avoid repetitive installations. Learn more on https://cloud.google.com/dataflow/docs/guides/using-custom-containers#prebuild
INFO:root:Default Python SDK image for environment is apache/beam_python3.7_sdk:2.47.0.dev
INFO:root:Using provided Python SDK container image: gcr.io/cloud-dataflow/v1beta3/python37-fnapi:beam-master-20230126
INFO:root:Python SDK container image set to "gcr.io/cloud-dataflow/v1beta3/python37-fnapi:beam-master-20230126" for Docker environment
INFO:apache_beam.runners.dataflow.internal.apiclient:Defaulting to the temp_location as staging_location: gs://temp-storage-for-perf-tests/loadtests
INFO:apache_beam.internal.gcp.auth:Setting socket default timeout to 60 seconds.
INFO:apache_beam.internal.gcp.auth:socket default timeout is 60.0 seconds.
INFO:apache_beam.runners.dataflow.internal.apiclient:Starting GCS upload to gs://temp-storage-for-perf-tests/loadtests/performance-tests-psio-python-2gb0307200443.1678233119.417742/pickled_main_session...
INFO:apache_beam.runners.dataflow.internal.apiclient:Completed GCS upload to gs://temp-storage-for-perf-tests/loadtests/performance-tests-psio-python-2gb0307200443.1678233119.417742/pickled_main_session in 0 seconds.
INFO:apache_beam.runners.dataflow.internal.apiclient:Starting GCS upload to gs://temp-storage-for-perf-tests/loadtests/performance-tests-psio-python-2gb0307200443.1678233119.417742/dataflow_python_sdk.tar...
INFO:apache_beam.runners.dataflow.internal.apiclient:Completed GCS upload to gs://temp-storage-for-perf-tests/loadtests/performance-tests-psio-python-2gb0307200443.1678233119.417742/dataflow_python_sdk.tar in 0 seconds.
INFO:apache_beam.runners.dataflow.internal.apiclient:Starting GCS upload to gs://temp-storage-for-perf-tests/loadtests/performance-tests-psio-python-2gb0307200443.1678233119.417742/pipeline.pb...
INFO:apache_beam.runners.dataflow.internal.apiclient:Completed GCS upload to gs://temp-storage-for-perf-tests/loadtests/performance-tests-psio-python-2gb0307200443.1678233119.417742/pipeline.pb in 0 seconds.
INFO:apache_beam.runners.dataflow.internal.apiclient:Create job: <Job
clientRequestId: '20230307235159419371-9461'
createTime: '2023-03-07T23:52:00.819622Z'
currentStateTime: '1970-01-01T00:00:00Z'
id: '2023-03-07_15_52_00-15040664462230718775'
location: 'us-central1'
name: 'performance-tests-psio-python-2gb0307200443'
projectId: 'apache-beam-testing'
stageStates: []
startTime: '2023-03-07T23:52:00.819622Z'
steps: []
tempFiles: []
type: TypeValueValuesEnum(JOB_TYPE_STREAMING, 2)>
INFO:apache_beam.runners.dataflow.internal.apiclient:Created job with id: [2023-03-07_15_52_00-15040664462230718775]
INFO:apache_beam.runners.dataflow.internal.apiclient:Submitted job: 2023-03-07_15_52_00-15040664462230718775
INFO:apache_beam.runners.dataflow.internal.apiclient:To access the Dataflow monitoring console, please navigate to https://console.cloud.google.com/dataflow/jobs/us-central1/2023-03-07_15_52_00-15040664462230718775?project=apache-beam-testing
INFO:apache_beam.runners.dataflow.test_dataflow_runner:Console log:
INFO:apache_beam.runners.dataflow.test_dataflow_runner:https://console.cloud.google.com/dataflow/jobs/us-central1/2023-03-07_15_52_00-15040664462230718775?project=apache-beam-testing
INFO:apache_beam.runners.dataflow.dataflow_runner:Job 2023-03-07_15_52_00-15040664462230718775 is in state JOB_STATE_RUNNING
INFO:apache_beam.runners.dataflow.dataflow_runner:2023-03-07T23:52:09.893Z: JOB_MESSAGE_BASIC: Worker configuration: e2-standard-2 in us-central1-b.
INFO:apache_beam.runners.dataflow.dataflow_runner:2023-03-07T23:52:16.230Z: JOB_MESSAGE_DETAILED: Expanding SplittableParDo operations into optimizable parts.
INFO:apache_beam.runners.dataflow.dataflow_runner:2023-03-07T23:52:21.256Z: JOB_MESSAGE_DETAILED: Expanding CollectionToSingleton operations into optimizable parts.
INFO:apache_beam.runners.dataflow.dataflow_runner:2023-03-07T23:52:21.325Z: JOB_MESSAGE_DETAILED: Expanding CoGroupByKey operations into optimizable parts.
INFO:apache_beam.runners.dataflow.dataflow_runner:2023-03-07T23:52:21.367Z: JOB_MESSAGE_DETAILED: Expanding SplittableProcessKeyed operations into optimizable parts.
INFO:apache_beam.runners.dataflow.dataflow_runner:2023-03-07T23:52:21.397Z: JOB_MESSAGE_DETAILED: Expanding GroupByKey operations into streaming Read/Write steps
INFO:apache_beam.runners.dataflow.dataflow_runner:2023-03-07T23:52:21.432Z: JOB_MESSAGE_DETAILED: Lifting ValueCombiningMappingFns into MergeBucketsMappingFns
INFO:apache_beam.runners.dataflow.dataflow_runner:2023-03-07T23:52:21.457Z: JOB_MESSAGE_DEBUG: Annotating graph with Autotuner information.
INFO:apache_beam.runners.dataflow.dataflow_runner:2023-03-07T23:52:21.499Z: JOB_MESSAGE_DETAILED: Fusing adjacent ParDo, Read, Write, and Flatten operations
INFO:apache_beam.runners.dataflow.dataflow_runner:2023-03-07T23:52:21.533Z: JOB_MESSAGE_DETAILED: Fusing consumer Create input/Map(<lambda at iobase.py:908>) into Create input/Impulse
INFO:apache_beam.runners.dataflow.dataflow_runner:2023-03-07T23:52:21.559Z: JOB_MESSAGE_DETAILED: Fusing consumer ref_AppliedPTransform_Create-input-SDFBoundedSourceReader-ParDo-SDFBoundedSourceDoFn-_6/PairWithRestriction into Create input/Map(<lambda at iobase.py:908>)
INFO:apache_beam.runners.dataflow.dataflow_runner:2023-03-07T23:52:21.590Z: JOB_MESSAGE_DETAILED: Fusing consumer ref_AppliedPTransform_Create-input-SDFBoundedSourceReader-ParDo-SDFBoundedSourceDoFn-_6/SplitWithSizing into ref_AppliedPTransform_Create-input-SDFBoundedSourceReader-ParDo-SDFBoundedSourceDoFn-_6/PairWithRestriction
INFO:apache_beam.runners.dataflow.dataflow_runner:2023-03-07T23:52:21.622Z: JOB_MESSAGE_DETAILED: Fusing consumer Format to pubsub message in bytes into ref_AppliedPTransform_Create-input-SDFBoundedSourceReader-ParDo-SDFBoundedSourceDoFn-_6/ProcessElementAndRestrictionWithSizing
INFO:apache_beam.runners.dataflow.dataflow_runner:2023-03-07T23:52:21.656Z: JOB_MESSAGE_DETAILED: Fusing consumer Measure time into Format to pubsub message in bytes
INFO:apache_beam.runners.dataflow.dataflow_runner:2023-03-07T23:52:21.683Z: JOB_MESSAGE_DETAILED: Fusing consumer Write to Pubsub/ToProtobuf into Measure time
INFO:apache_beam.runners.dataflow.dataflow_runner:2023-03-07T23:52:21.708Z: JOB_MESSAGE_DETAILED: Fusing consumer Write to Pubsub/Write into Write to Pubsub/ToProtobuf
INFO:apache_beam.runners.dataflow.dataflow_runner:2023-03-07T23:52:21.796Z: JOB_MESSAGE_BASIC: Running job using Streaming Engine
INFO:apache_beam.runners.dataflow.dataflow_runner:2023-03-07T23:52:21.829Z: JOB_MESSAGE_DEBUG: Workflow config is missing a default resource spec.
INFO:apache_beam.runners.dataflow.dataflow_runner:2023-03-07T23:52:21.856Z: JOB_MESSAGE_DEBUG: Adding StepResource setup and teardown to workflow graph.
INFO:apache_beam.runners.dataflow.dataflow_runner:2023-03-07T23:52:21.881Z: JOB_MESSAGE_DEBUG: Adding workflow start and stop steps.
INFO:apache_beam.runners.dataflow.dataflow_runner:2023-03-07T23:52:21.905Z: JOB_MESSAGE_DEBUG: Assigning stage ids.
INFO:apache_beam.runners.dataflow.dataflow_runner:2023-03-07T23:52:22.981Z: JOB_MESSAGE_DEBUG: Starting **** pool setup.
INFO:apache_beam.runners.dataflow.dataflow_runner:2023-03-07T23:52:23.006Z: JOB_MESSAGE_BASIC: Starting 5 ****s in us-central1-b...
INFO:apache_beam.runners.dataflow.dataflow_runner:2023-03-07T23:52:23.042Z: JOB_MESSAGE_DEBUG: Starting **** pool setup.
INFO:apache_beam.runners.dataflow.dataflow_runner:2023-03-07T23:52:35.242Z: JOB_MESSAGE_BASIC: Your project already contains 100 Dataflow-created metric descriptors, so new user metrics of the form custom.googleapis.com/* will not be created. However, all user metrics are also available in the metric dataflow.googleapis.com/job/user_counter. If you rely on the custom metrics, you can delete old / unused metric descriptors. See https://developers.google.com/apis-explorer/#p/monitoring/v3/monitoring.projects.metricDescriptors.list and https://developers.google.com/apis-explorer/#p/monitoring/v3/monitoring.projects.metricDescriptors.delete
INFO:apache_beam.runners.dataflow.dataflow_runner:2023-03-07T23:53:02.543Z: JOB_MESSAGE_DETAILED: Autoscaling: Raised the number of ****s to 5 so that the pipeline can catch up with its backlog and keep up with its input rate.
INFO:apache_beam.runners.dataflow.dataflow_runner:2023-03-07T23:53:35.882Z: JOB_MESSAGE_DETAILED: Workers have started successfully.
INFO:apache_beam.runners.dataflow.dataflow_runner:2023-03-07T23:53:43.268Z: JOB_MESSAGE_DETAILED: All ****s have finished the startup processes and began to receive work requests.
INFO:apache_beam.runners.dataflow.dataflow_runner:2023-03-08T00:01:03.202Z: JOB_MESSAGE_ERROR: generic::aborted: SDK harness sdk-0-1 disconnected.
with MessageCode:
(e6f8753ff8aa0691): SDK disconnect.
passed through:
==>
dist_proc/dax/workflow/****/fnapi_control_service.cc:217
WARNING:apache_beam.runners.dataflow.dataflow_runner:Timing out on waiting for job 2023-03-07_15_52_00-15040664462230718775 after 721 seconds
INFO:apache_beam.runners.portability.stager:Copying Beam SDK "<https://ci-beam.apache.org/job/beam_PerformanceTests_PubsubIOIT_Python_Streaming/ws/src/sdks/python/build/apache-beam.tar.gz"> to staging location.
INFO:apache_beam.runners.dataflow.dataflow_runner:Pipeline has additional dependencies to be installed in SDK **** container, consider using the SDK container image pre-building workflow to avoid repetitive installations. Learn more on https://cloud.google.com/dataflow/docs/guides/using-custom-containers#prebuild
INFO:root:Default Python SDK image for environment is apache/beam_python3.7_sdk:2.47.0.dev
INFO:root:Using provided Python SDK container image: gcr.io/cloud-dataflow/v1beta3/python37-fnapi:beam-master-20230126
INFO:root:Python SDK container image set to "gcr.io/cloud-dataflow/v1beta3/python37-fnapi:beam-master-20230126" for Docker environment
INFO:apache_beam.runners.dataflow.internal.apiclient:Defaulting to the temp_location as staging_location: gs://temp-storage-for-perf-tests/loadtests
INFO:apache_beam.runners.dataflow.internal.apiclient:Starting GCS upload to gs://temp-storage-for-perf-tests/loadtests/performance-tests-psio-python-2gb0307200443.1678234042.215806/pickled_main_session...
INFO:apache_beam.runners.dataflow.internal.apiclient:Completed GCS upload to gs://temp-storage-for-perf-tests/loadtests/performance-tests-psio-python-2gb0307200443.1678234042.215806/pickled_main_session in 0 seconds.
INFO:apache_beam.runners.dataflow.internal.apiclient:Starting GCS upload to gs://temp-storage-for-perf-tests/loadtests/performance-tests-psio-python-2gb0307200443.1678234042.215806/dataflow_python_sdk.tar...
INFO:apache_beam.runners.dataflow.internal.apiclient:Completed GCS upload to gs://temp-storage-for-perf-tests/loadtests/performance-tests-psio-python-2gb0307200443.1678234042.215806/dataflow_python_sdk.tar in 0 seconds.
INFO:apache_beam.runners.dataflow.internal.apiclient:Starting GCS upload to gs://temp-storage-for-perf-tests/loadtests/performance-tests-psio-python-2gb0307200443.1678234042.215806/pipeline.pb...
INFO:apache_beam.runners.dataflow.internal.apiclient:Completed GCS upload to gs://temp-storage-for-perf-tests/loadtests/performance-tests-psio-python-2gb0307200443.1678234042.215806/pipeline.pb in 0 seconds.
INFO:apache_beam.runners.dataflow.internal.apiclient:Create job: <Job
clientRequestId: '20230308000722216834-6011'
createTime: '2023-03-08T00:07:23.321326Z'
currentStateTime: '1970-01-01T00:00:00Z'
id: '2023-03-07_16_07_22-15830125275059384585'
location: 'us-central1'
name: 'performance-tests-psio-python-2gb0307200443'
projectId: 'apache-beam-testing'
stageStates: []
startTime: '2023-03-08T00:07:23.321326Z'
steps: []
tempFiles: []
type: TypeValueValuesEnum(JOB_TYPE_STREAMING, 2)>
INFO:apache_beam.runners.dataflow.internal.apiclient:Created job with id: [2023-03-07_16_07_22-15830125275059384585]
INFO:apache_beam.runners.dataflow.internal.apiclient:Submitted job: 2023-03-07_16_07_22-15830125275059384585
INFO:apache_beam.runners.dataflow.internal.apiclient:To access the Dataflow monitoring console, please navigate to https://console.cloud.google.com/dataflow/jobs/us-central1/2023-03-07_16_07_22-15830125275059384585?project=apache-beam-testing
INFO:apache_beam.runners.dataflow.test_dataflow_runner:Console log:
INFO:apache_beam.runners.dataflow.test_dataflow_runner:https://console.cloud.google.com/dataflow/jobs/us-central1/2023-03-07_16_07_22-15830125275059384585?project=apache-beam-testing
INFO:apache_beam.runners.dataflow.dataflow_runner:Job 2023-03-07_16_07_22-15830125275059384585 is in state JOB_STATE_RUNNING
INFO:apache_beam.runners.dataflow.dataflow_runner:2023-03-08T00:07:33.046Z: JOB_MESSAGE_BASIC: Worker configuration: e2-standard-2 in us-central1-b.
INFO:apache_beam.runners.dataflow.dataflow_runner:2023-03-08T00:07:35.242Z: JOB_MESSAGE_DETAILED: Expanding SplittableParDo operations into optimizable parts.
INFO:apache_beam.runners.dataflow.dataflow_runner:2023-03-08T00:07:35.283Z: JOB_MESSAGE_DETAILED: Expanding CollectionToSingleton operations into optimizable parts.
INFO:apache_beam.runners.dataflow.dataflow_runner:2023-03-08T00:07:35.360Z: JOB_MESSAGE_DETAILED: Expanding CoGroupByKey operations into optimizable parts.
INFO:apache_beam.runners.dataflow.dataflow_runner:2023-03-08T00:07:35.437Z: JOB_MESSAGE_DETAILED: Expanding SplittableProcessKeyed operations into optimizable parts.
INFO:apache_beam.runners.dataflow.dataflow_runner:2023-03-08T00:07:35.491Z: JOB_MESSAGE_DETAILED: Expanding GroupByKey operations into streaming Read/Write steps
INFO:apache_beam.runners.dataflow.dataflow_runner:2023-03-08T00:07:35.565Z: JOB_MESSAGE_DETAILED: Lifting ValueCombiningMappingFns into MergeBucketsMappingFns
INFO:apache_beam.runners.dataflow.dataflow_runner:2023-03-08T00:07:35.628Z: JOB_MESSAGE_DEBUG: Annotating graph with Autotuner information.
INFO:apache_beam.runners.dataflow.dataflow_runner:2023-03-08T00:07:35.672Z: JOB_MESSAGE_DETAILED: Fusing adjacent ParDo, Read, Write, and Flatten operations
INFO:apache_beam.runners.dataflow.dataflow_runner:2023-03-08T00:07:35.704Z: JOB_MESSAGE_DETAILED: Fusing consumer Read from pubsub/Map(_from_proto_str) into Read from pubsub/Read
INFO:apache_beam.runners.dataflow.dataflow_runner:2023-03-08T00:07:35.734Z: JOB_MESSAGE_DETAILED: Fusing consumer Map(<lambda at pubsub_io_perf_test.py:170>) into Read from pubsub/Map(_from_proto_str)
INFO:apache_beam.runners.dataflow.dataflow_runner:2023-03-08T00:07:35.766Z: JOB_MESSAGE_DETAILED: Fusing consumer Measure time into Map(<lambda at pubsub_io_perf_test.py:170>)
INFO:apache_beam.runners.dataflow.dataflow_runner:2023-03-08T00:07:35.798Z: JOB_MESSAGE_DETAILED: Fusing consumer Window into Measure time
INFO:apache_beam.runners.dataflow.dataflow_runner:2023-03-08T00:07:35.830Z: JOB_MESSAGE_DETAILED: Fusing consumer Count messages/KeyWithVoid into Window
INFO:apache_beam.runners.dataflow.dataflow_runner:2023-03-08T00:07:35.861Z: JOB_MESSAGE_DETAILED: Fusing consumer Count messages/CombinePerKey/Combine/ConvertToAccumulators into Count messages/KeyWithVoid
INFO:apache_beam.runners.dataflow.dataflow_runner:2023-03-08T00:07:35.892Z: JOB_MESSAGE_DETAILED: Fusing consumer Count messages/CombinePerKey/GroupByKey/WriteStream into Count messages/CombinePerKey/Combine/ConvertToAccumulators
INFO:apache_beam.runners.dataflow.dataflow_runner:2023-03-08T00:07:35.945Z: JOB_MESSAGE_DETAILED: Fusing consumer Count messages/CombinePerKey/Combine into Count messages/CombinePerKey/GroupByKey/ReadStream
INFO:apache_beam.runners.dataflow.dataflow_runner:2023-03-08T00:07:35.977Z: JOB_MESSAGE_DETAILED: Fusing consumer Count messages/CombinePerKey/Combine/Extract into Count messages/CombinePerKey/Combine
INFO:apache_beam.runners.dataflow.dataflow_runner:2023-03-08T00:07:36.011Z: JOB_MESSAGE_DETAILED: Fusing consumer Count messages/UnKey into Count messages/CombinePerKey/Combine/Extract
INFO:apache_beam.runners.dataflow.dataflow_runner:2023-03-08T00:07:36.034Z: JOB_MESSAGE_DETAILED: Fusing consumer Convert to bytes into Count messages/UnKey
INFO:apache_beam.runners.dataflow.dataflow_runner:2023-03-08T00:07:36.066Z: JOB_MESSAGE_DETAILED: Fusing consumer Write to Pubsub/ToProtobuf into Convert to bytes
INFO:apache_beam.runners.dataflow.dataflow_runner:2023-03-08T00:07:36.086Z: JOB_MESSAGE_DETAILED: Fusing consumer Write to Pubsub/Write into Write to Pubsub/ToProtobuf
INFO:apache_beam.runners.dataflow.dataflow_runner:2023-03-08T00:07:36.127Z: JOB_MESSAGE_BASIC: Running job using Streaming Engine
INFO:apache_beam.runners.dataflow.dataflow_runner:2023-03-08T00:07:36.155Z: JOB_MESSAGE_DEBUG: Workflow config is missing a default resource spec.
INFO:apache_beam.runners.dataflow.dataflow_runner:2023-03-08T00:07:36.178Z: JOB_MESSAGE_DEBUG: Adding StepResource setup and teardown to workflow graph.
INFO:apache_beam.runners.dataflow.dataflow_runner:2023-03-08T00:07:36.203Z: JOB_MESSAGE_DEBUG: Adding workflow start and stop steps.
INFO:apache_beam.runners.dataflow.dataflow_runner:2023-03-08T00:07:36.236Z: JOB_MESSAGE_DEBUG: Assigning stage ids.
INFO:apache_beam.runners.dataflow.dataflow_runner:2023-03-08T00:07:37.304Z: JOB_MESSAGE_DEBUG: Starting **** pool setup.
INFO:apache_beam.runners.dataflow.dataflow_runner:2023-03-08T00:07:37.343Z: JOB_MESSAGE_BASIC: Starting 5 ****s in us-central1-b...
INFO:apache_beam.runners.dataflow.dataflow_runner:2023-03-08T00:07:37.383Z: JOB_MESSAGE_DEBUG: Starting **** pool setup.
INFO:apache_beam.runners.dataflow.dataflow_runner:2023-03-08T00:08:02.374Z: JOB_MESSAGE_BASIC: Your project already contains 100 Dataflow-created metric descriptors, so new user metrics of the form custom.googleapis.com/* will not be created. However, all user metrics are also available in the metric dataflow.googleapis.com/job/user_counter. If you rely on the custom metrics, you can delete old / unused metric descriptors. See https://developers.google.com/apis-explorer/#p/monitoring/v3/monitoring.projects.metricDescriptors.list and https://developers.google.com/apis-explorer/#p/monitoring/v3/monitoring.projects.metricDescriptors.delete
INFO:apache_beam.runners.dataflow.dataflow_runner:2023-03-08T00:08:17.729Z: JOB_MESSAGE_DETAILED: Autoscaling: Raised the number of ****s to 1 so that the pipeline can catch up with its backlog and keep up with its input rate.
INFO:apache_beam.runners.dataflow.dataflow_runner:2023-03-08T00:08:17.755Z: JOB_MESSAGE_DETAILED: Autoscaling: Resized **** pool to 1, though goal was 5. This could be a quota issue.
INFO:apache_beam.runners.dataflow.dataflow_runner:2023-03-08T00:08:27.258Z: JOB_MESSAGE_DETAILED: Autoscaling: Raised the number of ****s to 5 so that the pipeline can catch up with its backlog and keep up with its input rate.
INFO:apache_beam.runners.dataflow.dataflow_runner:2023-03-08T00:08:53.626Z: JOB_MESSAGE_DETAILED: Workers have started successfully.
INFO:apache_beam.runners.dataflow.dataflow_runner:2023-03-08T00:09:05.270Z: JOB_MESSAGE_DETAILED: All ****s have finished the startup processes and began to receive work requests.
WARNING:apache_beam.runners.dataflow.dataflow_runner:Timing out on waiting for job 2023-03-07_16_07_22-15830125275059384585 after 721 seconds
ERROR:apache_beam.io.gcp.tests.pubsub_matcher:Timeout after 900 sec. Received 0 messages from projects/apache-beam-testing/subscriptions/pubsub_io_performance_29734622-6cb9-4b84-9615-c10ab0b54f1b_read_matcher.
Traceback (most recent call last):
File "/usr/lib/python3.7/runpy.py", line 193, in _run_module_as_main
"__main__", mod_spec)
File "/usr/lib/python3.7/runpy.py", line 85, in _run_code
exec(code, run_globals)
Worker logs: https://console.cloud.google.com/dataflow/jobs/us-central1/2023-03-07_15_52_00-15040664462230718775?project=apache-beam-testing
Worker logs: https://console.cloud.google.com/dataflow/jobs/us-central1/2023-03-07_16_07_22-15830125275059384585?project=apache-beam-testing
File "<https://ci-beam.apache.org/job/beam_PerformanceTests_PubsubIOIT_Python_Streaming/ws/src/sdks/python/apache_beam/io/gcp/pubsub_io_perf_test.py",> line 222, in <module>
PubsubReadPerfTest().run()
File "<https://ci-beam.apache.org/job/beam_PerformanceTests_PubsubIOIT_Python_Streaming/ws/src/sdks/python/apache_beam/testing/load_tests/load_test.py",> line 150, in run
self.result = self.pipeline.run()
File "<https://ci-beam.apache.org/job/beam_PerformanceTests_PubsubIOIT_Python_Streaming/ws/src/sdks/python/apache_beam/testing/test_pipeline.py",> line 114, in run
False if self.not_use_test_runner_api else test_runner_api))
File "<https://ci-beam.apache.org/job/beam_PerformanceTests_PubsubIOIT_Python_Streaming/ws/src/sdks/python/apache_beam/pipeline.py",> line 577, in run
return self.runner.run_pipeline(self, self._options)
File "<https://ci-beam.apache.org/job/beam_PerformanceTests_PubsubIOIT_Python_Streaming/ws/src/sdks/python/apache_beam/runners/dataflow/test_dataflow_runner.py",> line 70, in run_pipeline
hc_assert_that(self.result, pickler.loads(on_success_matcher))
File "<https://ci-beam.apache.org/job/beam_PerformanceTests_PubsubIOIT_Python_Streaming/ws/src/build/gradleenv/1329484227/lib/python3.7/site-packages/hamcrest/core/assert_that.py",> line 44, in assert_that
_assert_match(actual=arg1, matcher=arg2, reason=arg3)
File "<https://ci-beam.apache.org/job/beam_PerformanceTests_PubsubIOIT_Python_Streaming/ws/src/build/gradleenv/1329484227/lib/python3.7/site-packages/hamcrest/core/assert_that.py",> line 60, in _assert_match
raise AssertionError(description)
AssertionError:
Expected: (Expected 1 messages.)
but: Expected 1 messages. Got 0 messages. Diffs (item, count):
Expected but not in actual: dict_items([(b'2097152', 1)])
Unexpected: dict_items([])
Unexpected (with all details): []
> Task :sdks:python:apache_beam:testing:load_tests:run FAILED
FAILURE: Build failed with an exception.
* Where:
Build file '<https://ci-beam.apache.org/job/beam_PerformanceTests_PubsubIOIT_Python_Streaming/ws/src/sdks/python/apache_beam/testing/load_tests/build.gradle'> line: 63
* What went wrong:
Execution failed for task ':sdks:python:apache_beam:testing:load_tests:run'.
> error occurred
* Try:
> Run with --stacktrace option to get the stack trace.
> Run with --info or --debug option to get more log output.
* Get more help at https://help.gradle.org
Deprecated Gradle features were used in this build, making it incompatible with Gradle 8.0.
You can use '--warning-mode all' to show the individual deprecation warnings and determine if they come from your own scripts or plugins.
See https://docs.gradle.org/7.5.1/userguide/command_line_interface.html#sec:command_line_warnings
BUILD FAILED in 48m
15 actionable tasks: 9 executed, 4 from cache, 2 up-to-date
Publishing build scan...
https://gradle.com/s/6n4vj4crdv7wa
Build step 'Invoke Gradle script' changed build result to FAILURE
Build step 'Invoke Gradle script' marked build as failure
---------------------------------------------------------------------
To unsubscribe, e-mail: builds-unsubscribe@beam.apache.org
For additional commands, e-mail: builds-help@beam.apache.org
Jenkins build is back to normal : beam_PerformanceTests_PubsubIOIT_Python_Streaming #1008
Posted by Apache Jenkins Server <je...@builds.apache.org>.
See <https://ci-beam.apache.org/job/beam_PerformanceTests_PubsubIOIT_Python_Streaming/1008/display/redirect?page=changes>
---------------------------------------------------------------------
To unsubscribe, e-mail: builds-unsubscribe@beam.apache.org
For additional commands, e-mail: builds-help@beam.apache.org
Build failed in Jenkins: beam_PerformanceTests_PubsubIOIT_Python_Streaming #1007
Posted by Apache Jenkins Server <je...@builds.apache.org>.
See <https://ci-beam.apache.org/job/beam_PerformanceTests_PubsubIOIT_Python_Streaming/1007/display/redirect>
Changes:
------------------------------------------
[...truncated 30.45 KB...]
Using cached charset_normalizer-3.1.0-cp37-cp37m-manylinux_2_17_x86_64.manylinux2014_x86_64.whl (171 kB)
Collecting idna<4,>=2.5
Using cached idna-3.4-py3-none-any.whl (61 kB)
Collecting urllib3<1.27,>=1.21.1
Using cached urllib3-1.26.15-py2.py3-none-any.whl (140 kB)
Collecting certifi>=2017.4.17
Using cached certifi-2022.12.7-py3-none-any.whl (155 kB)
Collecting scipy>=1.1.0
Using cached scipy-1.7.3-cp37-cp37m-manylinux_2_12_x86_64.manylinux2010_x86_64.whl (38.1 MB)
Collecting threadpoolctl>=2.0.0
Using cached threadpoolctl-3.1.0-py3-none-any.whl (14 kB)
Collecting greenlet!=0.4.17
Using cached greenlet-2.0.2-cp37-cp37m-manylinux_2_17_x86_64.manylinux2014_x86_64.whl (566 kB)
Collecting wrapt
Using cached wrapt-1.15.0-cp37-cp37m-manylinux_2_5_x86_64.manylinux1_x86_64.manylinux_2_17_x86_64.manylinux2014_x86_64.whl (75 kB)
Collecting deprecation
Using cached deprecation-2.1.0-py2.py3-none-any.whl (11 kB)
Collecting docker>=4.0.0
Using cached docker-6.0.1-py3-none-any.whl (147 kB)
Collecting pymysql
Using cached PyMySQL-1.0.2-py3-none-any.whl (43 kB)
Collecting pycparser
Using cached pycparser-2.21-py2.py3-none-any.whl (118 kB)
Collecting websocket-client>=0.32.0
Using cached websocket_client-1.5.1-py3-none-any.whl (55 kB)
Collecting googleapis-common-protos<2.0dev,>=1.56.2
Using cached googleapis_common_protos-1.58.0-py2.py3-none-any.whl (223 kB)
Collecting google-crc32c<2.0dev,>=1.0
Using cached google_crc32c-1.5.0-cp37-cp37m-manylinux_2_17_x86_64.manylinux2014_x86_64.whl (32 kB)
Collecting grpcio-status>=1.33.2
Using cached grpcio_status-1.51.1-py3-none-any.whl (5.1 kB)
Using cached grpcio_status-1.50.0-py3-none-any.whl (14 kB)
Using cached grpcio_status-1.49.1-py3-none-any.whl (14 kB)
Using cached grpcio_status-1.48.2-py3-none-any.whl (14 kB)
Requirement already satisfied: zipp>=0.5 in <https://ci-beam.apache.org/job/beam_PerformanceTests_PubsubIOIT_Python_Streaming/ws/src/build/gradleenv/1329484227/lib/python3.7/site-packages> (from importlib-metadata>=0.12->pytest<8.0,>=7.1.2->apache-beam==2.47.0.dev0) (3.15.0)
Collecting PyJWT[crypto]<3,>=1.0.0
Using cached PyJWT-2.6.0-py3-none-any.whl (20 kB)
Collecting portalocker<3,>=1.0
Using cached portalocker-2.7.0-py2.py3-none-any.whl (15 kB)
Collecting pyasn1>=0.1.7
Using cached pyasn1-0.4.8-py2.py3-none-any.whl (77 kB)
Requirement already satisfied: py in <https://ci-beam.apache.org/job/beam_PerformanceTests_PubsubIOIT_Python_Streaming/ws/src/build/gradleenv/1329484227/lib/python3.7/site-packages> (from pytest-forked->pytest-xdist<3,>=2.5.0->apache-beam==2.47.0.dev0) (1.11.0)
Building wheels for collected packages: apache-beam
Building wheel for apache-beam (setup.py): started
Building wheel for apache-beam (setup.py): finished with status 'done'
Created wheel for apache-beam: filename=apache_beam-2.47.0.dev0-py3-none-any.whl size=3044410 sha256=847b2950e0f5ee306889e264db63e7555245fb4746f6646b45cf824ad263edc7
Stored in directory: /home/jenkins/.cache/pip/wheels/ab/30/db/7a1d878abb34081c011192312e662d364ee443467dfb553778
Successfully built apache-beam
Installing collected packages: sortedcontainers, pytz, pyasn1, parameterized, docopt, crcmod, zstandard, wrapt, websocket-client, urllib3, tomli, threadpoolctl, tenacity, sqlparse, scipy, rsa, regex, pyyaml, python-dateutil, pyparsing, pymysql, PyJWT, pyhamcrest, pycparser, pyasn1-modules, pyarrow, psycopg2-binary, proto-plus, portalocker, overrides, orjson, objsize, mock, joblib, jmespath, isodate, iniconfig, idna, greenlet, googleapis-common-protos, google-crc32c, fasteners, fastavro, execnet, exceptiongroup, dnspython, dill, deprecation, cloudpickle, charset-normalizer, certifi, cachetools, attrs, sqlalchemy, scikit-learn, requests, pymongo, pydot, pandas, hypothesis, httplib2, grpcio-status, google-resumable-media, google-auth, freezegun, cffi, botocore, s3transfer, requests_mock, pytest, oauth2client, hdfs, grpc-google-iam-v1, google-auth-httplib2, google-api-core, docker, cryptography, azure-core, testcontainers, pytest-timeout, pytest-forked, google-cloud-core, google-apitools, boto3, azure-storage-blob, apache-beam, pytest-xdist, msal, google-cloud-vision, google-cloud-videointelligence, google-cloud-spanner, google-cloud-recommendations-ai, google-cloud-pubsub, google-cloud-language, google-cloud-dlp, google-cloud-datastore, google-cloud-bigtable, google-cloud-bigquery-storage, google-cloud-bigquery, msal-extensions, google-cloud-pubsublite, azure-identity
Successfully installed PyJWT-2.6.0 apache-beam-2.47.0.dev0 attrs-22.2.0 azure-core-1.26.3 azure-identity-1.12.0 azure-storage-blob-12.15.0 boto3-1.26.89 botocore-1.29.89 cachetools-4.2.4 certifi-2022.12.7 cffi-1.15.1 charset-normalizer-3.1.0 cloudpickle-2.2.1 crcmod-1.7 cryptography-39.0.2 deprecation-2.1.0 dill-0.3.1.1 dnspython-2.3.0 docker-6.0.1 docopt-0.6.2 exceptiongroup-1.1.1 execnet-1.9.0 fastavro-1.7.3 fasteners-0.18 freezegun-1.2.2 google-api-core-2.11.0 google-apitools-0.5.31 google-auth-2.16.2 google-auth-httplib2-0.1.0 google-cloud-bigquery-3.6.0 google-cloud-bigquery-storage-2.16.2 google-cloud-bigtable-1.7.3 google-cloud-core-2.3.2 google-cloud-datastore-1.15.5 google-cloud-dlp-3.12.0 google-cloud-language-1.3.2 google-cloud-pubsub-2.15.0 google-cloud-pubsublite-1.7.0 google-cloud-recommendations-ai-0.7.1 google-cloud-spanner-3.28.0 google-cloud-videointelligence-1.16.3 google-cloud-vision-3.4.0 google-crc32c-1.5.0 google-resumable-media-2.4.1 googleapis-common-protos-1.58.0 greenlet-2.0.2 grpc-google-iam-v1-0.12.6 grpcio-status-1.48.2 hdfs-2.7.0 httplib2-0.21.0 hypothesis-6.68.2 idna-3.4 iniconfig-2.0.0 isodate-0.6.1 jmespath-1.0.1 joblib-1.2.0 mock-5.0.1 msal-1.21.0 msal-extensions-1.0.0 oauth2client-4.1.3 objsize-0.6.1 orjson-3.8.7 overrides-6.5.0 pandas-1.3.5 parameterized-0.8.1 portalocker-2.7.0 proto-plus-1.22.2 psycopg2-binary-2.9.5 pyarrow-9.0.0 pyasn1-0.4.8 pyasn1-modules-0.2.8 pycparser-2.21 pydot-1.4.2 pyhamcrest-1.10.1 pymongo-4.3.3 pymysql-1.0.2 pyparsing-3.0.9 pytest-7.2.2 pytest-forked-1.6.0 pytest-timeout-2.1.0 pytest-xdist-2.5.0 python-dateutil-2.8.2 pytz-2022.7.1 pyyaml-6.0 regex-2022.10.31 requests-2.28.2 requests_mock-1.10.0 rsa-4.9 s3transfer-0.6.0 scikit-learn-1.0.2 scipy-1.7.3 sortedcontainers-2.4.0 sqlalchemy-1.4.46 sqlparse-0.4.3 tenacity-5.1.5 testcontainers-3.7.1 threadpoolctl-3.1.0 tomli-2.0.1 urllib3-1.26.15 websocket-client-1.5.1 wrapt-1.15.0 zstandard-0.20.0
> Task :sdks:python:apache_beam:testing:load_tests:run
INFO:apache_beam.runners.portability.stager:Copying Beam SDK "<https://ci-beam.apache.org/job/beam_PerformanceTests_PubsubIOIT_Python_Streaming/ws/src/sdks/python/build/apache-beam.tar.gz"> to staging location.
INFO:apache_beam.runners.dataflow.dataflow_runner:Pipeline has additional dependencies to be installed in SDK **** container, consider using the SDK container image pre-building workflow to avoid repetitive installations. Learn more on https://cloud.google.com/dataflow/docs/guides/using-custom-containers#prebuild
INFO:root:Default Python SDK image for environment is apache/beam_python3.7_sdk:2.47.0.dev
INFO:root:Using provided Python SDK container image: gcr.io/cloud-dataflow/v1beta3/python37-fnapi:beam-master-20230126
INFO:root:Python SDK container image set to "gcr.io/cloud-dataflow/v1beta3/python37-fnapi:beam-master-20230126" for Docker environment
INFO:apache_beam.runners.dataflow.internal.apiclient:Defaulting to the temp_location as staging_location: gs://temp-storage-for-perf-tests/loadtests
INFO:apache_beam.internal.gcp.auth:Setting socket default timeout to 60 seconds.
INFO:apache_beam.internal.gcp.auth:socket default timeout is 60.0 seconds.
INFO:apache_beam.runners.dataflow.internal.apiclient:Starting GCS upload to gs://temp-storage-for-perf-tests/loadtests/performance-tests-psio-python-2gb0312200429.1678665052.456804/pickled_main_session...
INFO:apache_beam.runners.dataflow.internal.apiclient:Completed GCS upload to gs://temp-storage-for-perf-tests/loadtests/performance-tests-psio-python-2gb0312200429.1678665052.456804/pickled_main_session in 0 seconds.
INFO:apache_beam.runners.dataflow.internal.apiclient:Starting GCS upload to gs://temp-storage-for-perf-tests/loadtests/performance-tests-psio-python-2gb0312200429.1678665052.456804/dataflow_python_sdk.tar...
INFO:apache_beam.runners.dataflow.internal.apiclient:Completed GCS upload to gs://temp-storage-for-perf-tests/loadtests/performance-tests-psio-python-2gb0312200429.1678665052.456804/dataflow_python_sdk.tar in 0 seconds.
INFO:apache_beam.runners.dataflow.internal.apiclient:Starting GCS upload to gs://temp-storage-for-perf-tests/loadtests/performance-tests-psio-python-2gb0312200429.1678665052.456804/pipeline.pb...
INFO:apache_beam.runners.dataflow.internal.apiclient:Completed GCS upload to gs://temp-storage-for-perf-tests/loadtests/performance-tests-psio-python-2gb0312200429.1678665052.456804/pipeline.pb in 0 seconds.
INFO:apache_beam.runners.dataflow.internal.apiclient:Create job: <Job
clientRequestId: '20230312235052457789-7704'
createTime: '2023-03-12T23:50:53.569989Z'
currentStateTime: '1970-01-01T00:00:00Z'
id: '2023-03-12_16_50_53-1462986658314697399'
location: 'us-central1'
name: 'performance-tests-psio-python-2gb0312200429'
projectId: 'apache-beam-testing'
stageStates: []
startTime: '2023-03-12T23:50:53.569989Z'
steps: []
tempFiles: []
type: TypeValueValuesEnum(JOB_TYPE_STREAMING, 2)>
INFO:apache_beam.runners.dataflow.internal.apiclient:Created job with id: [2023-03-12_16_50_53-1462986658314697399]
INFO:apache_beam.runners.dataflow.internal.apiclient:Submitted job: 2023-03-12_16_50_53-1462986658314697399
INFO:apache_beam.runners.dataflow.internal.apiclient:To access the Dataflow monitoring console, please navigate to https://console.cloud.google.com/dataflow/jobs/us-central1/2023-03-12_16_50_53-1462986658314697399?project=apache-beam-testing
INFO:apache_beam.runners.dataflow.test_dataflow_runner:Console log:
INFO:apache_beam.runners.dataflow.test_dataflow_runner:https://console.cloud.google.com/dataflow/jobs/us-central1/2023-03-12_16_50_53-1462986658314697399?project=apache-beam-testing
INFO:apache_beam.runners.dataflow.dataflow_runner:Job 2023-03-12_16_50_53-1462986658314697399 is in state JOB_STATE_RUNNING
INFO:apache_beam.runners.dataflow.dataflow_runner:2023-03-12T23:50:58.699Z: JOB_MESSAGE_BASIC: Worker configuration: e2-standard-2 in us-central1-b.
INFO:apache_beam.runners.dataflow.dataflow_runner:2023-03-12T23:50:59.513Z: JOB_MESSAGE_DETAILED: Expanding SplittableParDo operations into optimizable parts.
INFO:apache_beam.runners.dataflow.dataflow_runner:2023-03-12T23:50:59.543Z: JOB_MESSAGE_DETAILED: Expanding CollectionToSingleton operations into optimizable parts.
INFO:apache_beam.runners.dataflow.dataflow_runner:2023-03-12T23:50:59.605Z: JOB_MESSAGE_DETAILED: Expanding CoGroupByKey operations into optimizable parts.
INFO:apache_beam.runners.dataflow.dataflow_runner:2023-03-12T23:50:59.678Z: JOB_MESSAGE_DETAILED: Expanding SplittableProcessKeyed operations into optimizable parts.
INFO:apache_beam.runners.dataflow.dataflow_runner:2023-03-12T23:50:59.709Z: JOB_MESSAGE_DETAILED: Expanding GroupByKey operations into streaming Read/Write steps
INFO:apache_beam.runners.dataflow.dataflow_runner:2023-03-12T23:50:59.742Z: JOB_MESSAGE_DETAILED: Lifting ValueCombiningMappingFns into MergeBucketsMappingFns
INFO:apache_beam.runners.dataflow.dataflow_runner:2023-03-12T23:50:59.775Z: JOB_MESSAGE_DEBUG: Annotating graph with Autotuner information.
INFO:apache_beam.runners.dataflow.dataflow_runner:2023-03-12T23:50:59.819Z: JOB_MESSAGE_DETAILED: Fusing adjacent ParDo, Read, Write, and Flatten operations
INFO:apache_beam.runners.dataflow.dataflow_runner:2023-03-12T23:50:59.847Z: JOB_MESSAGE_DETAILED: Fusing consumer Create input/Map(<lambda at iobase.py:908>) into Create input/Impulse
INFO:apache_beam.runners.dataflow.dataflow_runner:2023-03-12T23:50:59.876Z: JOB_MESSAGE_DETAILED: Fusing consumer ref_AppliedPTransform_Create-input-SDFBoundedSourceReader-ParDo-SDFBoundedSourceDoFn-_6/PairWithRestriction into Create input/Map(<lambda at iobase.py:908>)
INFO:apache_beam.runners.dataflow.dataflow_runner:2023-03-12T23:50:59.897Z: JOB_MESSAGE_DETAILED: Fusing consumer ref_AppliedPTransform_Create-input-SDFBoundedSourceReader-ParDo-SDFBoundedSourceDoFn-_6/SplitWithSizing into ref_AppliedPTransform_Create-input-SDFBoundedSourceReader-ParDo-SDFBoundedSourceDoFn-_6/PairWithRestriction
INFO:apache_beam.runners.dataflow.dataflow_runner:2023-03-12T23:50:59.922Z: JOB_MESSAGE_DETAILED: Fusing consumer Format to pubsub message in bytes into ref_AppliedPTransform_Create-input-SDFBoundedSourceReader-ParDo-SDFBoundedSourceDoFn-_6/ProcessElementAndRestrictionWithSizing
INFO:apache_beam.runners.dataflow.dataflow_runner:2023-03-12T23:50:59.949Z: JOB_MESSAGE_DETAILED: Fusing consumer Measure time into Format to pubsub message in bytes
INFO:apache_beam.runners.dataflow.dataflow_runner:2023-03-12T23:50:59.972Z: JOB_MESSAGE_DETAILED: Fusing consumer Write to Pubsub/ToProtobuf into Measure time
INFO:apache_beam.runners.dataflow.dataflow_runner:2023-03-12T23:51:00.006Z: JOB_MESSAGE_DETAILED: Fusing consumer Write to Pubsub/Write into Write to Pubsub/ToProtobuf
INFO:apache_beam.runners.dataflow.dataflow_runner:2023-03-12T23:51:00.085Z: JOB_MESSAGE_BASIC: Running job using Streaming Engine
INFO:apache_beam.runners.dataflow.dataflow_runner:2023-03-12T23:51:00.125Z: JOB_MESSAGE_DEBUG: Workflow config is missing a default resource spec.
INFO:apache_beam.runners.dataflow.dataflow_runner:2023-03-12T23:51:00.144Z: JOB_MESSAGE_DEBUG: Adding StepResource setup and teardown to workflow graph.
INFO:apache_beam.runners.dataflow.dataflow_runner:2023-03-12T23:51:00.164Z: JOB_MESSAGE_DEBUG: Adding workflow start and stop steps.
INFO:apache_beam.runners.dataflow.dataflow_runner:2023-03-12T23:51:00.190Z: JOB_MESSAGE_DEBUG: Assigning stage ids.
INFO:apache_beam.runners.dataflow.dataflow_runner:2023-03-12T23:51:01.264Z: JOB_MESSAGE_DEBUG: Starting **** pool setup.
INFO:apache_beam.runners.dataflow.dataflow_runner:2023-03-12T23:51:01.292Z: JOB_MESSAGE_BASIC: Starting 5 ****s in us-central1-b...
INFO:apache_beam.runners.dataflow.dataflow_runner:2023-03-12T23:51:01.357Z: JOB_MESSAGE_DEBUG: Starting **** pool setup.
INFO:apache_beam.runners.dataflow.dataflow_runner:2023-03-12T23:51:13.115Z: JOB_MESSAGE_BASIC: Your project already contains 100 Dataflow-created metric descriptors, so new user metrics of the form custom.googleapis.com/* will not be created. However, all user metrics are also available in the metric dataflow.googleapis.com/job/user_counter. If you rely on the custom metrics, you can delete old / unused metric descriptors. See https://developers.google.com/apis-explorer/#p/monitoring/v3/monitoring.projects.metricDescriptors.list and https://developers.google.com/apis-explorer/#p/monitoring/v3/monitoring.projects.metricDescriptors.delete
INFO:apache_beam.runners.dataflow.dataflow_runner:2023-03-12T23:51:41.548Z: JOB_MESSAGE_DETAILED: Autoscaling: Raised the number of ****s to 4 so that the pipeline can catch up with its backlog and keep up with its input rate.
INFO:apache_beam.runners.dataflow.dataflow_runner:2023-03-12T23:51:41.565Z: JOB_MESSAGE_DETAILED: Autoscaling: Resized **** pool to 4, though goal was 5. This could be a quota issue.
INFO:apache_beam.runners.dataflow.dataflow_runner:2023-03-12T23:51:51.420Z: JOB_MESSAGE_DETAILED: Autoscaling: Raised the number of ****s to 5 so that the pipeline can catch up with its backlog and keep up with its input rate.
INFO:apache_beam.runners.dataflow.dataflow_runner:2023-03-12T23:52:15.944Z: JOB_MESSAGE_DETAILED: Workers have started successfully.
INFO:apache_beam.runners.dataflow.dataflow_runner:2023-03-12T23:52:25.977Z: JOB_MESSAGE_DETAILED: All ****s have finished the startup processes and began to receive work requests.
INFO:apache_beam.runners.dataflow.dataflow_runner:2023-03-13T00:00:02.586Z: JOB_MESSAGE_ERROR: generic::aborted: SDK harness sdk-0-0 disconnected.
with MessageCode:
(15128736f36a99fd): SDK disconnect.
passed through:
==>
dist_proc/dax/workflow/****/fnapi_control_service.cc:217
WARNING:apache_beam.runners.dataflow.dataflow_runner:Timing out on waiting for job 2023-03-12_16_50_53-1462986658314697399 after 723 seconds
INFO:apache_beam.runners.portability.stager:Copying Beam SDK "<https://ci-beam.apache.org/job/beam_PerformanceTests_PubsubIOIT_Python_Streaming/ws/src/sdks/python/build/apache-beam.tar.gz"> to staging location.
INFO:apache_beam.runners.dataflow.dataflow_runner:Pipeline has additional dependencies to be installed in SDK **** container, consider using the SDK container image pre-building workflow to avoid repetitive installations. Learn more on https://cloud.google.com/dataflow/docs/guides/using-custom-containers#prebuild
INFO:root:Default Python SDK image for environment is apache/beam_python3.7_sdk:2.47.0.dev
INFO:root:Using provided Python SDK container image: gcr.io/cloud-dataflow/v1beta3/python37-fnapi:beam-master-20230126
INFO:root:Python SDK container image set to "gcr.io/cloud-dataflow/v1beta3/python37-fnapi:beam-master-20230126" for Docker environment
INFO:apache_beam.runners.dataflow.internal.apiclient:Defaulting to the temp_location as staging_location: gs://temp-storage-for-perf-tests/loadtests
INFO:apache_beam.runners.dataflow.internal.apiclient:Starting GCS upload to gs://temp-storage-for-perf-tests/loadtests/performance-tests-psio-python-2gb0312200429.1678665970.445932/pickled_main_session...
INFO:apache_beam.runners.dataflow.internal.apiclient:Completed GCS upload to gs://temp-storage-for-perf-tests/loadtests/performance-tests-psio-python-2gb0312200429.1678665970.445932/pickled_main_session in 0 seconds.
INFO:apache_beam.runners.dataflow.internal.apiclient:Starting GCS upload to gs://temp-storage-for-perf-tests/loadtests/performance-tests-psio-python-2gb0312200429.1678665970.445932/dataflow_python_sdk.tar...
INFO:apache_beam.runners.dataflow.internal.apiclient:Completed GCS upload to gs://temp-storage-for-perf-tests/loadtests/performance-tests-psio-python-2gb0312200429.1678665970.445932/dataflow_python_sdk.tar in 0 seconds.
INFO:apache_beam.runners.dataflow.internal.apiclient:Starting GCS upload to gs://temp-storage-for-perf-tests/loadtests/performance-tests-psio-python-2gb0312200429.1678665970.445932/pipeline.pb...
INFO:apache_beam.runners.dataflow.internal.apiclient:Completed GCS upload to gs://temp-storage-for-perf-tests/loadtests/performance-tests-psio-python-2gb0312200429.1678665970.445932/pipeline.pb in 0 seconds.
INFO:apache_beam.runners.dataflow.internal.apiclient:Create job: <Job
clientRequestId: '20230313000610447350-4366'
createTime: '2023-03-13T00:06:11.882494Z'
currentStateTime: '1970-01-01T00:00:00Z'
id: '2023-03-12_17_06_11-6459110268577837041'
location: 'us-central1'
name: 'performance-tests-psio-python-2gb0312200429'
projectId: 'apache-beam-testing'
stageStates: []
startTime: '2023-03-13T00:06:11.882494Z'
steps: []
tempFiles: []
type: TypeValueValuesEnum(JOB_TYPE_STREAMING, 2)>
INFO:apache_beam.runners.dataflow.internal.apiclient:Created job with id: [2023-03-12_17_06_11-6459110268577837041]
INFO:apache_beam.runners.dataflow.internal.apiclient:Submitted job: 2023-03-12_17_06_11-6459110268577837041
INFO:apache_beam.runners.dataflow.internal.apiclient:To access the Dataflow monitoring console, please navigate to https://console.cloud.google.com/dataflow/jobs/us-central1/2023-03-12_17_06_11-6459110268577837041?project=apache-beam-testing
INFO:apache_beam.runners.dataflow.test_dataflow_runner:Console log:
INFO:apache_beam.runners.dataflow.test_dataflow_runner:https://console.cloud.google.com/dataflow/jobs/us-central1/2023-03-12_17_06_11-6459110268577837041?project=apache-beam-testing
INFO:apache_beam.runners.dataflow.dataflow_runner:Job 2023-03-12_17_06_11-6459110268577837041 is in state JOB_STATE_RUNNING
INFO:apache_beam.runners.dataflow.dataflow_runner:2023-03-13T00:06:19.212Z: JOB_MESSAGE_BASIC: Worker configuration: e2-standard-2 in us-central1-b.
INFO:apache_beam.runners.dataflow.dataflow_runner:2023-03-13T00:06:20.797Z: JOB_MESSAGE_DETAILED: Expanding SplittableParDo operations into optimizable parts.
INFO:apache_beam.runners.dataflow.dataflow_runner:2023-03-13T00:06:20.833Z: JOB_MESSAGE_DETAILED: Expanding CollectionToSingleton operations into optimizable parts.
INFO:apache_beam.runners.dataflow.dataflow_runner:2023-03-13T00:06:20.913Z: JOB_MESSAGE_DETAILED: Expanding CoGroupByKey operations into optimizable parts.
INFO:apache_beam.runners.dataflow.dataflow_runner:2023-03-13T00:06:20.995Z: JOB_MESSAGE_DETAILED: Expanding SplittableProcessKeyed operations into optimizable parts.
INFO:apache_beam.runners.dataflow.dataflow_runner:2023-03-13T00:06:21.031Z: JOB_MESSAGE_DETAILED: Expanding GroupByKey operations into streaming Read/Write steps
INFO:apache_beam.runners.dataflow.dataflow_runner:2023-03-13T00:06:21.088Z: JOB_MESSAGE_DETAILED: Lifting ValueCombiningMappingFns into MergeBucketsMappingFns
INFO:apache_beam.runners.dataflow.dataflow_runner:2023-03-13T00:06:21.158Z: JOB_MESSAGE_DEBUG: Annotating graph with Autotuner information.
INFO:apache_beam.runners.dataflow.dataflow_runner:2023-03-13T00:06:21.205Z: JOB_MESSAGE_DETAILED: Fusing adjacent ParDo, Read, Write, and Flatten operations
INFO:apache_beam.runners.dataflow.dataflow_runner:2023-03-13T00:06:21.238Z: JOB_MESSAGE_DETAILED: Fusing consumer Read from pubsub/Map(_from_proto_str) into Read from pubsub/Read
INFO:apache_beam.runners.dataflow.dataflow_runner:2023-03-13T00:06:21.275Z: JOB_MESSAGE_DETAILED: Fusing consumer Map(<lambda at pubsub_io_perf_test.py:170>) into Read from pubsub/Map(_from_proto_str)
INFO:apache_beam.runners.dataflow.dataflow_runner:2023-03-13T00:06:21.309Z: JOB_MESSAGE_DETAILED: Fusing consumer Measure time into Map(<lambda at pubsub_io_perf_test.py:170>)
INFO:apache_beam.runners.dataflow.dataflow_runner:2023-03-13T00:06:21.335Z: JOB_MESSAGE_DETAILED: Fusing consumer Window into Measure time
INFO:apache_beam.runners.dataflow.dataflow_runner:2023-03-13T00:06:21.369Z: JOB_MESSAGE_DETAILED: Fusing consumer Count messages/KeyWithVoid into Window
INFO:apache_beam.runners.dataflow.dataflow_runner:2023-03-13T00:06:21.402Z: JOB_MESSAGE_DETAILED: Fusing consumer Count messages/CombinePerKey/Combine/ConvertToAccumulators into Count messages/KeyWithVoid
INFO:apache_beam.runners.dataflow.dataflow_runner:2023-03-13T00:06:21.435Z: JOB_MESSAGE_DETAILED: Fusing consumer Count messages/CombinePerKey/GroupByKey/WriteStream into Count messages/CombinePerKey/Combine/ConvertToAccumulators
INFO:apache_beam.runners.dataflow.dataflow_runner:2023-03-13T00:06:21.467Z: JOB_MESSAGE_DETAILED: Fusing consumer Count messages/CombinePerKey/Combine into Count messages/CombinePerKey/GroupByKey/ReadStream
INFO:apache_beam.runners.dataflow.dataflow_runner:2023-03-13T00:06:21.489Z: JOB_MESSAGE_DETAILED: Fusing consumer Count messages/CombinePerKey/Combine/Extract into Count messages/CombinePerKey/Combine
INFO:apache_beam.runners.dataflow.dataflow_runner:2023-03-13T00:06:21.513Z: JOB_MESSAGE_DETAILED: Fusing consumer Count messages/UnKey into Count messages/CombinePerKey/Combine/Extract
INFO:apache_beam.runners.dataflow.dataflow_runner:2023-03-13T00:06:21.546Z: JOB_MESSAGE_DETAILED: Fusing consumer Convert to bytes into Count messages/UnKey
INFO:apache_beam.runners.dataflow.dataflow_runner:2023-03-13T00:06:21.578Z: JOB_MESSAGE_DETAILED: Fusing consumer Write to Pubsub/ToProtobuf into Convert to bytes
INFO:apache_beam.runners.dataflow.dataflow_runner:2023-03-13T00:06:21.614Z: JOB_MESSAGE_DETAILED: Fusing consumer Write to Pubsub/Write into Write to Pubsub/ToProtobuf
INFO:apache_beam.runners.dataflow.dataflow_runner:2023-03-13T00:06:21.653Z: JOB_MESSAGE_BASIC: Running job using Streaming Engine
INFO:apache_beam.runners.dataflow.dataflow_runner:2023-03-13T00:06:21.692Z: JOB_MESSAGE_DEBUG: Workflow config is missing a default resource spec.
INFO:apache_beam.runners.dataflow.dataflow_runner:2023-03-13T00:06:21.722Z: JOB_MESSAGE_DEBUG: Adding StepResource setup and teardown to workflow graph.
INFO:apache_beam.runners.dataflow.dataflow_runner:2023-03-13T00:06:21.755Z: JOB_MESSAGE_DEBUG: Adding workflow start and stop steps.
INFO:apache_beam.runners.dataflow.dataflow_runner:2023-03-13T00:06:21.787Z: JOB_MESSAGE_DEBUG: Assigning stage ids.
INFO:apache_beam.runners.dataflow.dataflow_runner:2023-03-13T00:06:22.866Z: JOB_MESSAGE_DEBUG: Starting **** pool setup.
INFO:apache_beam.runners.dataflow.dataflow_runner:2023-03-13T00:06:22.902Z: JOB_MESSAGE_BASIC: Starting 5 ****s in us-central1-b...
INFO:apache_beam.runners.dataflow.dataflow_runner:2023-03-13T00:06:22.950Z: JOB_MESSAGE_DEBUG: Starting **** pool setup.
INFO:apache_beam.runners.dataflow.dataflow_runner:2023-03-13T00:06:53.698Z: JOB_MESSAGE_BASIC: Your project already contains 100 Dataflow-created metric descriptors, so new user metrics of the form custom.googleapis.com/* will not be created. However, all user metrics are also available in the metric dataflow.googleapis.com/job/user_counter. If you rely on the custom metrics, you can delete old / unused metric descriptors. See https://developers.google.com/apis-explorer/#p/monitoring/v3/monitoring.projects.metricDescriptors.list and https://developers.google.com/apis-explorer/#p/monitoring/v3/monitoring.projects.metricDescriptors.delete
INFO:apache_beam.runners.dataflow.dataflow_runner:2023-03-13T00:07:01.834Z: JOB_MESSAGE_DETAILED: Autoscaling: Raised the number of ****s to 5 so that the pipeline can catch up with its backlog and keep up with its input rate.
INFO:apache_beam.runners.dataflow.dataflow_runner:2023-03-13T00:07:35.953Z: JOB_MESSAGE_DETAILED: Workers have started successfully.
INFO:apache_beam.runners.dataflow.dataflow_runner:2023-03-13T00:07:46.630Z: JOB_MESSAGE_DETAILED: All ****s have finished the startup processes and began to receive work requests.
WARNING:apache_beam.runners.dataflow.dataflow_runner:Timing out on waiting for job 2023-03-12_17_06_11-6459110268577837041 after 723 seconds
ERROR:apache_beam.io.gcp.tests.pubsub_matcher:Timeout after 900 sec. Received 0 messages from projects/apache-beam-testing/subscriptions/pubsub_io_performance_51c80113-c2d6-4c54-994b-4d03fa5b1b5a_read_matcher.
Traceback (most recent call last):
Worker logs: https://console.cloud.google.com/dataflow/jobs/us-central1/2023-03-12_16_50_53-1462986658314697399?project=apache-beam-testing
File "/usr/lib/python3.7/runpy.py", line 193, in _run_module_as_main
"__main__", mod_spec)
File "/usr/lib/python3.7/runpy.py", line 85, in _run_code
exec(code, run_globals)
File "<https://ci-beam.apache.org/job/beam_PerformanceTests_PubsubIOIT_Python_Streaming/ws/src/sdks/python/apache_beam/io/gcp/pubsub_io_perf_test.py",> line 222, in <module>
PubsubReadPerfTest().run()
Worker logs: https://console.cloud.google.com/dataflow/jobs/us-central1/2023-03-12_17_06_11-6459110268577837041?project=apache-beam-testing
File "<https://ci-beam.apache.org/job/beam_PerformanceTests_PubsubIOIT_Python_Streaming/ws/src/sdks/python/apache_beam/testing/load_tests/load_test.py",> line 150, in run
self.result = self.pipeline.run()
File "<https://ci-beam.apache.org/job/beam_PerformanceTests_PubsubIOIT_Python_Streaming/ws/src/sdks/python/apache_beam/testing/test_pipeline.py",> line 114, in run
False if self.not_use_test_runner_api else test_runner_api))
File "<https://ci-beam.apache.org/job/beam_PerformanceTests_PubsubIOIT_Python_Streaming/ws/src/sdks/python/apache_beam/pipeline.py",> line 577, in run
return self.runner.run_pipeline(self, self._options)
File "<https://ci-beam.apache.org/job/beam_PerformanceTests_PubsubIOIT_Python_Streaming/ws/src/sdks/python/apache_beam/runners/dataflow/test_dataflow_runner.py",> line 70, in run_pipeline
hc_assert_that(self.result, pickler.loads(on_success_matcher))
File "<https://ci-beam.apache.org/job/beam_PerformanceTests_PubsubIOIT_Python_Streaming/ws/src/build/gradleenv/1329484227/lib/python3.7/site-packages/hamcrest/core/assert_that.py",> line 44, in assert_that
_assert_match(actual=arg1, matcher=arg2, reason=arg3)
File "<https://ci-beam.apache.org/job/beam_PerformanceTests_PubsubIOIT_Python_Streaming/ws/src/build/gradleenv/1329484227/lib/python3.7/site-packages/hamcrest/core/assert_that.py",> line 60, in _assert_match
raise AssertionError(description)
AssertionError:
Expected: (Expected 1 messages.)
but: Expected 1 messages. Got 0 messages. Diffs (item, count):
Expected but not in actual: dict_items([(b'2097152', 1)])
Unexpected: dict_items([])
Unexpected (with all details): []
> Task :sdks:python:apache_beam:testing:load_tests:run FAILED
FAILURE: Build failed with an exception.
* Where:
Build file '<https://ci-beam.apache.org/job/beam_PerformanceTests_PubsubIOIT_Python_Streaming/ws/src/sdks/python/apache_beam/testing/load_tests/build.gradle'> line: 63
* What went wrong:
Execution failed for task ':sdks:python:apache_beam:testing:load_tests:run'.
> error occurred
* Try:
> Run with --stacktrace option to get the stack trace.
> Run with --info or --debug option to get more log output.
* Get more help at https://help.gradle.org
Deprecated Gradle features were used in this build, making it incompatible with Gradle 8.0.
You can use '--warning-mode all' to show the individual deprecation warnings and determine if they come from your own scripts or plugins.
See https://docs.gradle.org/7.5.1/userguide/command_line_interface.html#sec:command_line_warnings
BUILD FAILED in 46m 53s
15 actionable tasks: 9 executed, 4 from cache, 2 up-to-date
Publishing build scan...
https://gradle.com/s/3bibt3ay6on7k
Build step 'Invoke Gradle script' changed build result to FAILURE
Build step 'Invoke Gradle script' marked build as failure
---------------------------------------------------------------------
To unsubscribe, e-mail: builds-unsubscribe@beam.apache.org
For additional commands, e-mail: builds-help@beam.apache.org
Build failed in Jenkins: beam_PerformanceTests_PubsubIOIT_Python_Streaming #1006
Posted by Apache Jenkins Server <je...@builds.apache.org>.
See <https://ci-beam.apache.org/job/beam_PerformanceTests_PubsubIOIT_Python_Streaming/1006/display/redirect>
Changes:
------------------------------------------
[...truncated 30.49 KB...]
Using cached execnet-1.9.0-py2.py3-none-any.whl (39 kB)
Collecting idna<4,>=2.5
Using cached idna-3.4-py3-none-any.whl (61 kB)
Collecting urllib3<1.27,>=1.21.1
Using cached urllib3-1.26.15-py2.py3-none-any.whl (140 kB)
Collecting charset-normalizer<4,>=2
Using cached charset_normalizer-3.1.0-cp37-cp37m-manylinux_2_17_x86_64.manylinux2014_x86_64.whl (171 kB)
Collecting certifi>=2017.4.17
Using cached certifi-2022.12.7-py3-none-any.whl (155 kB)
Collecting scipy>=1.1.0
Using cached scipy-1.7.3-cp37-cp37m-manylinux_2_12_x86_64.manylinux2010_x86_64.whl (38.1 MB)
Collecting threadpoolctl>=2.0.0
Using cached threadpoolctl-3.1.0-py3-none-any.whl (14 kB)
Collecting greenlet!=0.4.17
Using cached greenlet-2.0.2-cp37-cp37m-manylinux_2_17_x86_64.manylinux2014_x86_64.whl (566 kB)
Collecting docker>=4.0.0
Using cached docker-6.0.1-py3-none-any.whl (147 kB)
Collecting deprecation
Using cached deprecation-2.1.0-py2.py3-none-any.whl (11 kB)
Collecting wrapt
Using cached wrapt-1.15.0-cp37-cp37m-manylinux_2_5_x86_64.manylinux1_x86_64.manylinux_2_17_x86_64.manylinux2014_x86_64.whl (75 kB)
Collecting pymysql
Using cached PyMySQL-1.0.2-py3-none-any.whl (43 kB)
Collecting pycparser
Using cached pycparser-2.21-py2.py3-none-any.whl (118 kB)
Collecting websocket-client>=0.32.0
Using cached websocket_client-1.5.1-py3-none-any.whl (55 kB)
Collecting googleapis-common-protos<2.0dev,>=1.56.2
Using cached googleapis_common_protos-1.58.0-py2.py3-none-any.whl (223 kB)
Collecting google-crc32c<2.0dev,>=1.0
Using cached google_crc32c-1.5.0-cp37-cp37m-manylinux_2_17_x86_64.manylinux2014_x86_64.whl (32 kB)
Collecting grpcio-status>=1.33.2
Using cached grpcio_status-1.51.1-py3-none-any.whl (5.1 kB)
Using cached grpcio_status-1.50.0-py3-none-any.whl (14 kB)
Using cached grpcio_status-1.49.1-py3-none-any.whl (14 kB)
Using cached grpcio_status-1.48.2-py3-none-any.whl (14 kB)
Requirement already satisfied: zipp>=0.5 in <https://ci-beam.apache.org/job/beam_PerformanceTests_PubsubIOIT_Python_Streaming/ws/src/build/gradleenv/1329484227/lib/python3.7/site-packages> (from importlib-metadata>=0.12->pytest<8.0,>=7.1.2->apache-beam==2.47.0.dev0) (3.15.0)
Collecting PyJWT[crypto]<3,>=1.0.0
Using cached PyJWT-2.6.0-py3-none-any.whl (20 kB)
Collecting portalocker<3,>=1.0
Using cached portalocker-2.7.0-py2.py3-none-any.whl (15 kB)
Collecting pyasn1>=0.1.7
Using cached pyasn1-0.4.8-py2.py3-none-any.whl (77 kB)
Requirement already satisfied: py in <https://ci-beam.apache.org/job/beam_PerformanceTests_PubsubIOIT_Python_Streaming/ws/src/build/gradleenv/1329484227/lib/python3.7/site-packages> (from pytest-forked->pytest-xdist<3,>=2.5.0->apache-beam==2.47.0.dev0) (1.11.0)
Building wheels for collected packages: apache-beam
Building wheel for apache-beam (setup.py): started
Building wheel for apache-beam (setup.py): finished with status 'done'
Created wheel for apache-beam: filename=apache_beam-2.47.0.dev0-py3-none-any.whl size=3044410 sha256=2908c19ada975ad664d84affa3b02290899db32247610f3e6170a43d5afbd3c3
Stored in directory: /home/jenkins/.cache/pip/wheels/ab/30/db/7a1d878abb34081c011192312e662d364ee443467dfb553778
Successfully built apache-beam
Installing collected packages: sortedcontainers, pytz, pyasn1, parameterized, docopt, crcmod, zstandard, wrapt, websocket-client, urllib3, tomli, threadpoolctl, tenacity, sqlparse, scipy, rsa, regex, pyyaml, python-dateutil, pyparsing, pymysql, PyJWT, pyhamcrest, pycparser, pyasn1-modules, pyarrow, psycopg2-binary, proto-plus, portalocker, overrides, orjson, objsize, mock, joblib, jmespath, isodate, iniconfig, idna, greenlet, googleapis-common-protos, google-crc32c, fasteners, fastavro, execnet, exceptiongroup, dnspython, dill, deprecation, cloudpickle, charset-normalizer, certifi, cachetools, attrs, sqlalchemy, scikit-learn, requests, pymongo, pydot, pandas, hypothesis, httplib2, grpcio-status, google-resumable-media, google-auth, freezegun, cffi, botocore, s3transfer, requests_mock, pytest, oauth2client, hdfs, grpc-google-iam-v1, google-auth-httplib2, google-api-core, docker, cryptography, azure-core, testcontainers, pytest-timeout, pytest-forked, google-cloud-core, google-apitools, boto3, azure-storage-blob, apache-beam, pytest-xdist, msal, google-cloud-vision, google-cloud-videointelligence, google-cloud-spanner, google-cloud-recommendations-ai, google-cloud-pubsub, google-cloud-language, google-cloud-dlp, google-cloud-datastore, google-cloud-bigtable, google-cloud-bigquery-storage, google-cloud-bigquery, msal-extensions, google-cloud-pubsublite, azure-identity
Successfully installed PyJWT-2.6.0 apache-beam-2.47.0.dev0 attrs-22.2.0 azure-core-1.26.3 azure-identity-1.12.0 azure-storage-blob-12.15.0 boto3-1.26.89 botocore-1.29.89 cachetools-4.2.4 certifi-2022.12.7 cffi-1.15.1 charset-normalizer-3.1.0 cloudpickle-2.2.1 crcmod-1.7 cryptography-39.0.2 deprecation-2.1.0 dill-0.3.1.1 dnspython-2.3.0 docker-6.0.1 docopt-0.6.2 exceptiongroup-1.1.0 execnet-1.9.0 fastavro-1.7.3 fasteners-0.18 freezegun-1.2.2 google-api-core-2.11.0 google-apitools-0.5.31 google-auth-2.16.2 google-auth-httplib2-0.1.0 google-cloud-bigquery-3.6.0 google-cloud-bigquery-storage-2.16.2 google-cloud-bigtable-1.7.3 google-cloud-core-2.3.2 google-cloud-datastore-1.15.5 google-cloud-dlp-3.12.0 google-cloud-language-1.3.2 google-cloud-pubsub-2.15.0 google-cloud-pubsublite-1.7.0 google-cloud-recommendations-ai-0.7.1 google-cloud-spanner-3.28.0 google-cloud-videointelligence-1.16.3 google-cloud-vision-3.4.0 google-crc32c-1.5.0 google-resumable-media-2.4.1 googleapis-common-protos-1.58.0 greenlet-2.0.2 grpc-google-iam-v1-0.12.6 grpcio-status-1.48.2 hdfs-2.7.0 httplib2-0.21.0 hypothesis-6.68.2 idna-3.4 iniconfig-2.0.0 isodate-0.6.1 jmespath-1.0.1 joblib-1.2.0 mock-5.0.1 msal-1.21.0 msal-extensions-1.0.0 oauth2client-4.1.3 objsize-0.6.1 orjson-3.8.7 overrides-6.5.0 pandas-1.3.5 parameterized-0.8.1 portalocker-2.7.0 proto-plus-1.22.2 psycopg2-binary-2.9.5 pyarrow-9.0.0 pyasn1-0.4.8 pyasn1-modules-0.2.8 pycparser-2.21 pydot-1.4.2 pyhamcrest-1.10.1 pymongo-4.3.3 pymysql-1.0.2 pyparsing-3.0.9 pytest-7.2.2 pytest-forked-1.6.0 pytest-timeout-2.1.0 pytest-xdist-2.5.0 python-dateutil-2.8.2 pytz-2022.7.1 pyyaml-6.0 regex-2022.10.31 requests-2.28.2 requests_mock-1.10.0 rsa-4.9 s3transfer-0.6.0 scikit-learn-1.0.2 scipy-1.7.3 sortedcontainers-2.4.0 sqlalchemy-1.4.46 sqlparse-0.4.3 tenacity-5.1.5 testcontainers-3.7.1 threadpoolctl-3.1.0 tomli-2.0.1 urllib3-1.26.15 websocket-client-1.5.1 wrapt-1.15.0 zstandard-0.20.0
> Task :sdks:python:apache_beam:testing:load_tests:run
INFO:apache_beam.runners.portability.stager:Copying Beam SDK "<https://ci-beam.apache.org/job/beam_PerformanceTests_PubsubIOIT_Python_Streaming/ws/src/sdks/python/build/apache-beam.tar.gz"> to staging location.
INFO:apache_beam.runners.dataflow.dataflow_runner:Pipeline has additional dependencies to be installed in SDK **** container, consider using the SDK container image pre-building workflow to avoid repetitive installations. Learn more on https://cloud.google.com/dataflow/docs/guides/using-custom-containers#prebuild
INFO:root:Default Python SDK image for environment is apache/beam_python3.7_sdk:2.47.0.dev
INFO:root:Using provided Python SDK container image: gcr.io/cloud-dataflow/v1beta3/python37-fnapi:beam-master-20230126
INFO:root:Python SDK container image set to "gcr.io/cloud-dataflow/v1beta3/python37-fnapi:beam-master-20230126" for Docker environment
INFO:apache_beam.runners.dataflow.internal.apiclient:Defaulting to the temp_location as staging_location: gs://temp-storage-for-perf-tests/loadtests
INFO:apache_beam.internal.gcp.auth:Setting socket default timeout to 60 seconds.
INFO:apache_beam.internal.gcp.auth:socket default timeout is 60.0 seconds.
INFO:apache_beam.runners.dataflow.internal.apiclient:Starting GCS upload to gs://temp-storage-for-perf-tests/loadtests/performance-tests-psio-python-2gb0311200430.1678578650.154532/pickled_main_session...
INFO:apache_beam.runners.dataflow.internal.apiclient:Completed GCS upload to gs://temp-storage-for-perf-tests/loadtests/performance-tests-psio-python-2gb0311200430.1678578650.154532/pickled_main_session in 0 seconds.
INFO:apache_beam.runners.dataflow.internal.apiclient:Starting GCS upload to gs://temp-storage-for-perf-tests/loadtests/performance-tests-psio-python-2gb0311200430.1678578650.154532/dataflow_python_sdk.tar...
INFO:apache_beam.runners.dataflow.internal.apiclient:Completed GCS upload to gs://temp-storage-for-perf-tests/loadtests/performance-tests-psio-python-2gb0311200430.1678578650.154532/dataflow_python_sdk.tar in 0 seconds.
INFO:apache_beam.runners.dataflow.internal.apiclient:Starting GCS upload to gs://temp-storage-for-perf-tests/loadtests/performance-tests-psio-python-2gb0311200430.1678578650.154532/pipeline.pb...
INFO:apache_beam.runners.dataflow.internal.apiclient:Completed GCS upload to gs://temp-storage-for-perf-tests/loadtests/performance-tests-psio-python-2gb0311200430.1678578650.154532/pipeline.pb in 0 seconds.
INFO:apache_beam.runners.dataflow.internal.apiclient:Create job: <Job
clientRequestId: '20230311235050155524-4882'
createTime: '2023-03-11T23:50:51.311933Z'
currentStateTime: '1970-01-01T00:00:00Z'
id: '2023-03-11_15_50_50-6104129832924463003'
location: 'us-central1'
name: 'performance-tests-psio-python-2gb0311200430'
projectId: 'apache-beam-testing'
stageStates: []
startTime: '2023-03-11T23:50:51.311933Z'
steps: []
tempFiles: []
type: TypeValueValuesEnum(JOB_TYPE_STREAMING, 2)>
INFO:apache_beam.runners.dataflow.internal.apiclient:Created job with id: [2023-03-11_15_50_50-6104129832924463003]
INFO:apache_beam.runners.dataflow.internal.apiclient:Submitted job: 2023-03-11_15_50_50-6104129832924463003
INFO:apache_beam.runners.dataflow.internal.apiclient:To access the Dataflow monitoring console, please navigate to https://console.cloud.google.com/dataflow/jobs/us-central1/2023-03-11_15_50_50-6104129832924463003?project=apache-beam-testing
INFO:apache_beam.runners.dataflow.test_dataflow_runner:Console log:
INFO:apache_beam.runners.dataflow.test_dataflow_runner:https://console.cloud.google.com/dataflow/jobs/us-central1/2023-03-11_15_50_50-6104129832924463003?project=apache-beam-testing
INFO:apache_beam.runners.dataflow.dataflow_runner:Job 2023-03-11_15_50_50-6104129832924463003 is in state JOB_STATE_RUNNING
INFO:apache_beam.runners.dataflow.dataflow_runner:2023-03-11T23:50:58.513Z: JOB_MESSAGE_BASIC: Worker configuration: e2-standard-2 in us-central1-b.
INFO:apache_beam.runners.dataflow.dataflow_runner:2023-03-11T23:51:04.667Z: JOB_MESSAGE_DETAILED: Expanding SplittableParDo operations into optimizable parts.
INFO:apache_beam.runners.dataflow.dataflow_runner:2023-03-11T23:51:09.699Z: JOB_MESSAGE_DETAILED: Expanding CollectionToSingleton operations into optimizable parts.
INFO:apache_beam.runners.dataflow.dataflow_runner:2023-03-11T23:51:09.755Z: JOB_MESSAGE_DETAILED: Expanding CoGroupByKey operations into optimizable parts.
INFO:apache_beam.runners.dataflow.dataflow_runner:2023-03-11T23:51:09.792Z: JOB_MESSAGE_DETAILED: Expanding SplittableProcessKeyed operations into optimizable parts.
INFO:apache_beam.runners.dataflow.dataflow_runner:2023-03-11T23:51:09.821Z: JOB_MESSAGE_DETAILED: Expanding GroupByKey operations into streaming Read/Write steps
INFO:apache_beam.runners.dataflow.dataflow_runner:2023-03-11T23:51:09.851Z: JOB_MESSAGE_DETAILED: Lifting ValueCombiningMappingFns into MergeBucketsMappingFns
INFO:apache_beam.runners.dataflow.dataflow_runner:2023-03-11T23:51:09.879Z: JOB_MESSAGE_DEBUG: Annotating graph with Autotuner information.
INFO:apache_beam.runners.dataflow.dataflow_runner:2023-03-11T23:51:09.915Z: JOB_MESSAGE_DETAILED: Fusing adjacent ParDo, Read, Write, and Flatten operations
INFO:apache_beam.runners.dataflow.dataflow_runner:2023-03-11T23:51:09.942Z: JOB_MESSAGE_DETAILED: Fusing consumer Create input/Map(<lambda at iobase.py:908>) into Create input/Impulse
INFO:apache_beam.runners.dataflow.dataflow_runner:2023-03-11T23:51:09.976Z: JOB_MESSAGE_DETAILED: Fusing consumer ref_AppliedPTransform_Create-input-SDFBoundedSourceReader-ParDo-SDFBoundedSourceDoFn-_6/PairWithRestriction into Create input/Map(<lambda at iobase.py:908>)
INFO:apache_beam.runners.dataflow.dataflow_runner:2023-03-11T23:51:10.003Z: JOB_MESSAGE_DETAILED: Fusing consumer ref_AppliedPTransform_Create-input-SDFBoundedSourceReader-ParDo-SDFBoundedSourceDoFn-_6/SplitWithSizing into ref_AppliedPTransform_Create-input-SDFBoundedSourceReader-ParDo-SDFBoundedSourceDoFn-_6/PairWithRestriction
INFO:apache_beam.runners.dataflow.dataflow_runner:2023-03-11T23:51:10.026Z: JOB_MESSAGE_DETAILED: Fusing consumer Format to pubsub message in bytes into ref_AppliedPTransform_Create-input-SDFBoundedSourceReader-ParDo-SDFBoundedSourceDoFn-_6/ProcessElementAndRestrictionWithSizing
INFO:apache_beam.runners.dataflow.dataflow_runner:2023-03-11T23:51:10.050Z: JOB_MESSAGE_DETAILED: Fusing consumer Measure time into Format to pubsub message in bytes
INFO:apache_beam.runners.dataflow.dataflow_runner:2023-03-11T23:51:10.071Z: JOB_MESSAGE_DETAILED: Fusing consumer Write to Pubsub/ToProtobuf into Measure time
INFO:apache_beam.runners.dataflow.dataflow_runner:2023-03-11T23:51:10.099Z: JOB_MESSAGE_DETAILED: Fusing consumer Write to Pubsub/Write into Write to Pubsub/ToProtobuf
INFO:apache_beam.runners.dataflow.dataflow_runner:2023-03-11T23:51:10.199Z: JOB_MESSAGE_BASIC: Running job using Streaming Engine
INFO:apache_beam.runners.dataflow.dataflow_runner:2023-03-11T23:51:10.233Z: JOB_MESSAGE_DEBUG: Workflow config is missing a default resource spec.
INFO:apache_beam.runners.dataflow.dataflow_runner:2023-03-11T23:51:10.261Z: JOB_MESSAGE_DEBUG: Adding StepResource setup and teardown to workflow graph.
INFO:apache_beam.runners.dataflow.dataflow_runner:2023-03-11T23:51:10.287Z: JOB_MESSAGE_DEBUG: Adding workflow start and stop steps.
INFO:apache_beam.runners.dataflow.dataflow_runner:2023-03-11T23:51:10.310Z: JOB_MESSAGE_DEBUG: Assigning stage ids.
INFO:apache_beam.runners.dataflow.dataflow_runner:2023-03-11T23:51:11.373Z: JOB_MESSAGE_DEBUG: Starting **** pool setup.
INFO:apache_beam.runners.dataflow.dataflow_runner:2023-03-11T23:51:11.408Z: JOB_MESSAGE_BASIC: Starting 5 ****s in us-central1-b...
INFO:apache_beam.runners.dataflow.dataflow_runner:2023-03-11T23:51:11.452Z: JOB_MESSAGE_DEBUG: Starting **** pool setup.
INFO:apache_beam.runners.dataflow.dataflow_runner:2023-03-11T23:51:34.711Z: JOB_MESSAGE_BASIC: Your project already contains 100 Dataflow-created metric descriptors, so new user metrics of the form custom.googleapis.com/* will not be created. However, all user metrics are also available in the metric dataflow.googleapis.com/job/user_counter. If you rely on the custom metrics, you can delete old / unused metric descriptors. See https://developers.google.com/apis-explorer/#p/monitoring/v3/monitoring.projects.metricDescriptors.list and https://developers.google.com/apis-explorer/#p/monitoring/v3/monitoring.projects.metricDescriptors.delete
INFO:apache_beam.runners.dataflow.dataflow_runner:2023-03-11T23:51:49.909Z: JOB_MESSAGE_DETAILED: Autoscaling: Raised the number of ****s to 5 so that the pipeline can catch up with its backlog and keep up with its input rate.
INFO:apache_beam.runners.dataflow.dataflow_runner:2023-03-11T23:52:24.874Z: JOB_MESSAGE_DETAILED: Workers have started successfully.
INFO:apache_beam.runners.dataflow.dataflow_runner:2023-03-11T23:52:35.007Z: JOB_MESSAGE_DETAILED: All ****s have finished the startup processes and began to receive work requests.
INFO:apache_beam.runners.dataflow.dataflow_runner:2023-03-12T00:01:20.253Z: JOB_MESSAGE_ERROR: generic::aborted: SDK harness sdk-0-0 disconnected.
with MessageCode:
(9250575462f45938): SDK disconnect.
passed through:
==>
dist_proc/dax/workflow/****/fnapi_control_service.cc:217
WARNING:apache_beam.runners.dataflow.dataflow_runner:Timing out on waiting for job 2023-03-11_15_50_50-6104129832924463003 after 722 seconds
INFO:apache_beam.runners.portability.stager:Copying Beam SDK "<https://ci-beam.apache.org/job/beam_PerformanceTests_PubsubIOIT_Python_Streaming/ws/src/sdks/python/build/apache-beam.tar.gz"> to staging location.
INFO:apache_beam.runners.dataflow.dataflow_runner:Pipeline has additional dependencies to be installed in SDK **** container, consider using the SDK container image pre-building workflow to avoid repetitive installations. Learn more on https://cloud.google.com/dataflow/docs/guides/using-custom-containers#prebuild
INFO:root:Default Python SDK image for environment is apache/beam_python3.7_sdk:2.47.0.dev
INFO:root:Using provided Python SDK container image: gcr.io/cloud-dataflow/v1beta3/python37-fnapi:beam-master-20230126
INFO:root:Python SDK container image set to "gcr.io/cloud-dataflow/v1beta3/python37-fnapi:beam-master-20230126" for Docker environment
INFO:apache_beam.runners.dataflow.internal.apiclient:Defaulting to the temp_location as staging_location: gs://temp-storage-for-perf-tests/loadtests
INFO:apache_beam.runners.dataflow.internal.apiclient:Starting GCS upload to gs://temp-storage-for-perf-tests/loadtests/performance-tests-psio-python-2gb0311200430.1678579594.216066/pickled_main_session...
INFO:apache_beam.runners.dataflow.internal.apiclient:Completed GCS upload to gs://temp-storage-for-perf-tests/loadtests/performance-tests-psio-python-2gb0311200430.1678579594.216066/pickled_main_session in 0 seconds.
INFO:apache_beam.runners.dataflow.internal.apiclient:Starting GCS upload to gs://temp-storage-for-perf-tests/loadtests/performance-tests-psio-python-2gb0311200430.1678579594.216066/dataflow_python_sdk.tar...
INFO:apache_beam.runners.dataflow.internal.apiclient:Completed GCS upload to gs://temp-storage-for-perf-tests/loadtests/performance-tests-psio-python-2gb0311200430.1678579594.216066/dataflow_python_sdk.tar in 0 seconds.
INFO:apache_beam.runners.dataflow.internal.apiclient:Starting GCS upload to gs://temp-storage-for-perf-tests/loadtests/performance-tests-psio-python-2gb0311200430.1678579594.216066/pipeline.pb...
INFO:apache_beam.runners.dataflow.internal.apiclient:Completed GCS upload to gs://temp-storage-for-perf-tests/loadtests/performance-tests-psio-python-2gb0311200430.1678579594.216066/pipeline.pb in 0 seconds.
INFO:apache_beam.runners.dataflow.internal.apiclient:Create job: <Job
clientRequestId: '20230312000634217006-5267'
createTime: '2023-03-12T00:06:37.201207Z'
currentStateTime: '1970-01-01T00:00:00Z'
id: '2023-03-11_16_06_34-10778729401192246057'
location: 'us-central1'
name: 'performance-tests-psio-python-2gb0311200430'
projectId: 'apache-beam-testing'
stageStates: []
startTime: '2023-03-12T00:06:37.201207Z'
steps: []
tempFiles: []
type: TypeValueValuesEnum(JOB_TYPE_STREAMING, 2)>
INFO:apache_beam.runners.dataflow.internal.apiclient:Created job with id: [2023-03-11_16_06_34-10778729401192246057]
INFO:apache_beam.runners.dataflow.internal.apiclient:Submitted job: 2023-03-11_16_06_34-10778729401192246057
INFO:apache_beam.runners.dataflow.internal.apiclient:To access the Dataflow monitoring console, please navigate to https://console.cloud.google.com/dataflow/jobs/us-central1/2023-03-11_16_06_34-10778729401192246057?project=apache-beam-testing
INFO:apache_beam.runners.dataflow.test_dataflow_runner:Console log:
INFO:apache_beam.runners.dataflow.test_dataflow_runner:https://console.cloud.google.com/dataflow/jobs/us-central1/2023-03-11_16_06_34-10778729401192246057?project=apache-beam-testing
INFO:apache_beam.runners.dataflow.dataflow_runner:Job 2023-03-11_16_06_34-10778729401192246057 is in state JOB_STATE_RUNNING
INFO:apache_beam.runners.dataflow.dataflow_runner:2023-03-12T00:06:44.057Z: JOB_MESSAGE_BASIC: Worker configuration: e2-standard-2 in us-central1-b.
INFO:apache_beam.runners.dataflow.dataflow_runner:2023-03-12T00:06:46.159Z: JOB_MESSAGE_DETAILED: Expanding SplittableParDo operations into optimizable parts.
INFO:apache_beam.runners.dataflow.dataflow_runner:2023-03-12T00:06:46.189Z: JOB_MESSAGE_DETAILED: Expanding CollectionToSingleton operations into optimizable parts.
INFO:apache_beam.runners.dataflow.dataflow_runner:2023-03-12T00:06:46.269Z: JOB_MESSAGE_DETAILED: Expanding CoGroupByKey operations into optimizable parts.
INFO:apache_beam.runners.dataflow.dataflow_runner:2023-03-12T00:06:46.353Z: JOB_MESSAGE_DETAILED: Expanding SplittableProcessKeyed operations into optimizable parts.
INFO:apache_beam.runners.dataflow.dataflow_runner:2023-03-12T00:06:46.393Z: JOB_MESSAGE_DETAILED: Expanding GroupByKey operations into streaming Read/Write steps
INFO:apache_beam.runners.dataflow.dataflow_runner:2023-03-12T00:06:46.468Z: JOB_MESSAGE_DETAILED: Lifting ValueCombiningMappingFns into MergeBucketsMappingFns
INFO:apache_beam.runners.dataflow.dataflow_runner:2023-03-12T00:06:46.537Z: JOB_MESSAGE_DEBUG: Annotating graph with Autotuner information.
INFO:apache_beam.runners.dataflow.dataflow_runner:2023-03-12T00:06:46.582Z: JOB_MESSAGE_DETAILED: Fusing adjacent ParDo, Read, Write, and Flatten operations
INFO:apache_beam.runners.dataflow.dataflow_runner:2023-03-12T00:06:46.614Z: JOB_MESSAGE_DETAILED: Fusing consumer Read from pubsub/Map(_from_proto_str) into Read from pubsub/Read
INFO:apache_beam.runners.dataflow.dataflow_runner:2023-03-12T00:06:46.657Z: JOB_MESSAGE_DETAILED: Fusing consumer Map(<lambda at pubsub_io_perf_test.py:170>) into Read from pubsub/Map(_from_proto_str)
INFO:apache_beam.runners.dataflow.dataflow_runner:2023-03-12T00:06:46.703Z: JOB_MESSAGE_DETAILED: Fusing consumer Measure time into Map(<lambda at pubsub_io_perf_test.py:170>)
INFO:apache_beam.runners.dataflow.dataflow_runner:2023-03-12T00:06:46.790Z: JOB_MESSAGE_DETAILED: Fusing consumer Window into Measure time
INFO:apache_beam.runners.dataflow.dataflow_runner:2023-03-12T00:06:46.873Z: JOB_MESSAGE_DETAILED: Fusing consumer Count messages/KeyWithVoid into Window
INFO:apache_beam.runners.dataflow.dataflow_runner:2023-03-12T00:06:46.951Z: JOB_MESSAGE_DETAILED: Fusing consumer Count messages/CombinePerKey/Combine/ConvertToAccumulators into Count messages/KeyWithVoid
INFO:apache_beam.runners.dataflow.dataflow_runner:2023-03-12T00:06:47.052Z: JOB_MESSAGE_DETAILED: Fusing consumer Count messages/CombinePerKey/GroupByKey/WriteStream into Count messages/CombinePerKey/Combine/ConvertToAccumulators
INFO:apache_beam.runners.dataflow.dataflow_runner:2023-03-12T00:06:47.100Z: JOB_MESSAGE_DETAILED: Fusing consumer Count messages/CombinePerKey/Combine into Count messages/CombinePerKey/GroupByKey/ReadStream
INFO:apache_beam.runners.dataflow.dataflow_runner:2023-03-12T00:06:47.150Z: JOB_MESSAGE_DETAILED: Fusing consumer Count messages/CombinePerKey/Combine/Extract into Count messages/CombinePerKey/Combine
INFO:apache_beam.runners.dataflow.dataflow_runner:2023-03-12T00:06:47.189Z: JOB_MESSAGE_DETAILED: Fusing consumer Count messages/UnKey into Count messages/CombinePerKey/Combine/Extract
INFO:apache_beam.runners.dataflow.dataflow_runner:2023-03-12T00:06:47.214Z: JOB_MESSAGE_DETAILED: Fusing consumer Convert to bytes into Count messages/UnKey
INFO:apache_beam.runners.dataflow.dataflow_runner:2023-03-12T00:06:47.263Z: JOB_MESSAGE_DETAILED: Fusing consumer Write to Pubsub/ToProtobuf into Convert to bytes
INFO:apache_beam.runners.dataflow.dataflow_runner:2023-03-12T00:06:47.302Z: JOB_MESSAGE_DETAILED: Fusing consumer Write to Pubsub/Write into Write to Pubsub/ToProtobuf
INFO:apache_beam.runners.dataflow.dataflow_runner:2023-03-12T00:06:47.351Z: JOB_MESSAGE_BASIC: Running job using Streaming Engine
INFO:apache_beam.runners.dataflow.dataflow_runner:2023-03-12T00:06:47.383Z: JOB_MESSAGE_DEBUG: Workflow config is missing a default resource spec.
INFO:apache_beam.runners.dataflow.dataflow_runner:2023-03-12T00:06:47.406Z: JOB_MESSAGE_DEBUG: Adding StepResource setup and teardown to workflow graph.
INFO:apache_beam.runners.dataflow.dataflow_runner:2023-03-12T00:06:47.435Z: JOB_MESSAGE_DEBUG: Adding workflow start and stop steps.
INFO:apache_beam.runners.dataflow.dataflow_runner:2023-03-12T00:06:47.474Z: JOB_MESSAGE_DEBUG: Assigning stage ids.
INFO:apache_beam.runners.dataflow.dataflow_runner:2023-03-12T00:06:47.564Z: JOB_MESSAGE_DEBUG: Starting **** pool setup.
INFO:apache_beam.runners.dataflow.dataflow_runner:2023-03-12T00:06:47.598Z: JOB_MESSAGE_BASIC: Starting 5 ****s in us-central1-b...
INFO:apache_beam.runners.dataflow.dataflow_runner:2023-03-12T00:06:47.629Z: JOB_MESSAGE_DEBUG: Starting **** pool setup.
INFO:apache_beam.runners.dataflow.dataflow_runner:2023-03-12T00:06:58.349Z: JOB_MESSAGE_BASIC: Your project already contains 100 Dataflow-created metric descriptors, so new user metrics of the form custom.googleapis.com/* will not be created. However, all user metrics are also available in the metric dataflow.googleapis.com/job/user_counter. If you rely on the custom metrics, you can delete old / unused metric descriptors. See https://developers.google.com/apis-explorer/#p/monitoring/v3/monitoring.projects.metricDescriptors.list and https://developers.google.com/apis-explorer/#p/monitoring/v3/monitoring.projects.metricDescriptors.delete
INFO:apache_beam.runners.dataflow.dataflow_runner:2023-03-12T00:07:28.462Z: JOB_MESSAGE_DETAILED: Autoscaling: Raised the number of ****s to 5 so that the pipeline can catch up with its backlog and keep up with its input rate.
INFO:apache_beam.runners.dataflow.dataflow_runner:2023-03-12T00:07:59.957Z: JOB_MESSAGE_DETAILED: Workers have started successfully.
INFO:apache_beam.runners.dataflow.dataflow_runner:2023-03-12T00:08:09.917Z: JOB_MESSAGE_DETAILED: All ****s have finished the startup processes and began to receive work requests.
WARNING:apache_beam.runners.dataflow.dataflow_runner:Timing out on waiting for job 2023-03-11_16_06_34-10778729401192246057 after 721 seconds
ERROR:apache_beam.io.gcp.tests.pubsub_matcher:Timeout after 900 sec. Received 0 messages from projects/apache-beam-testing/subscriptions/pubsub_io_performance_dab65779-b5b8-4df2-b59b-45f6cd09c0ae_read_matcher.
Traceback (most recent call last):
File "/usr/lib/python3.7/runpy.py", line 193, in _run_module_as_main
"__main__", mod_spec)
File "/usr/lib/python3.7/runpy.py", line 85, in _run_code
exec(code, run_globals)
Worker logs: https://console.cloud.google.com/dataflow/jobs/us-central1/2023-03-11_15_50_50-6104129832924463003?project=apache-beam-testing
Worker logs: https://console.cloud.google.com/dataflow/jobs/us-central1/2023-03-11_16_06_34-10778729401192246057?project=apache-beam-testing
File "<https://ci-beam.apache.org/job/beam_PerformanceTests_PubsubIOIT_Python_Streaming/ws/src/sdks/python/apache_beam/io/gcp/pubsub_io_perf_test.py",> line 222, in <module>
PubsubReadPerfTest().run()
File "<https://ci-beam.apache.org/job/beam_PerformanceTests_PubsubIOIT_Python_Streaming/ws/src/sdks/python/apache_beam/testing/load_tests/load_test.py",> line 150, in run
self.result = self.pipeline.run()
File "<https://ci-beam.apache.org/job/beam_PerformanceTests_PubsubIOIT_Python_Streaming/ws/src/sdks/python/apache_beam/testing/test_pipeline.py",> line 114, in run
False if self.not_use_test_runner_api else test_runner_api))
File "<https://ci-beam.apache.org/job/beam_PerformanceTests_PubsubIOIT_Python_Streaming/ws/src/sdks/python/apache_beam/pipeline.py",> line 577, in run
return self.runner.run_pipeline(self, self._options)
File "<https://ci-beam.apache.org/job/beam_PerformanceTests_PubsubIOIT_Python_Streaming/ws/src/sdks/python/apache_beam/runners/dataflow/test_dataflow_runner.py",> line 70, in run_pipeline
hc_assert_that(self.result, pickler.loads(on_success_matcher))
File "<https://ci-beam.apache.org/job/beam_PerformanceTests_PubsubIOIT_Python_Streaming/ws/src/build/gradleenv/1329484227/lib/python3.7/site-packages/hamcrest/core/assert_that.py",> line 44, in assert_that
_assert_match(actual=arg1, matcher=arg2, reason=arg3)
File "<https://ci-beam.apache.org/job/beam_PerformanceTests_PubsubIOIT_Python_Streaming/ws/src/build/gradleenv/1329484227/lib/python3.7/site-packages/hamcrest/core/assert_that.py",> line 60, in _assert_match
raise AssertionError(description)
AssertionError:
Expected: (Expected 1 messages.)
but: Expected 1 messages. Got 0 messages. Diffs (item, count):
Expected but not in actual: dict_items([(b'2097152', 1)])
Unexpected: dict_items([])
Unexpected (with all details): []
> Task :sdks:python:apache_beam:testing:load_tests:run FAILED
FAILURE: Build failed with an exception.
* Where:
Build file '<https://ci-beam.apache.org/job/beam_PerformanceTests_PubsubIOIT_Python_Streaming/ws/src/sdks/python/apache_beam/testing/load_tests/build.gradle'> line: 63
* What went wrong:
Execution failed for task ':sdks:python:apache_beam:testing:load_tests:run'.
> error occurred
* Try:
> Run with --stacktrace option to get the stack trace.
> Run with --info or --debug option to get more log output.
* Get more help at https://help.gradle.org
Deprecated Gradle features were used in this build, making it incompatible with Gradle 8.0.
You can use '--warning-mode all' to show the individual deprecation warnings and determine if they come from your own scripts or plugins.
See https://docs.gradle.org/7.5.1/userguide/command_line_interface.html#sec:command_line_warnings
BUILD FAILED in 47m 9s
15 actionable tasks: 9 executed, 4 from cache, 2 up-to-date
Publishing build scan...
https://gradle.com/s/4xfs4x7f3iwa6
Build step 'Invoke Gradle script' changed build result to FAILURE
Build step 'Invoke Gradle script' marked build as failure
---------------------------------------------------------------------
To unsubscribe, e-mail: builds-unsubscribe@beam.apache.org
For additional commands, e-mail: builds-help@beam.apache.org
Build failed in Jenkins: beam_PerformanceTests_PubsubIOIT_Python_Streaming #1005
Posted by Apache Jenkins Server <je...@builds.apache.org>.
See <https://ci-beam.apache.org/job/beam_PerformanceTests_PubsubIOIT_Python_Streaming/1005/display/redirect?page=changes>
Changes:
[noreply] Merge pull request #25801: Updates 2.45.0 artifacts to use
------------------------------------------
[...truncated 30.23 KB...]
Collecting certifi>=2017.4.17
Using cached certifi-2022.12.7-py3-none-any.whl (155 kB)
Collecting idna<4,>=2.5
Using cached idna-3.4-py3-none-any.whl (61 kB)
Collecting urllib3<1.27,>=1.21.1
Downloading urllib3-1.26.15-py2.py3-none-any.whl (140 kB)
━━━━━━━━━━━━━━━━━━━━━━━━━━━━━━━━━━━━━━━ 140.9/140.9 kB 2.9 MB/s eta 0:00:00
Collecting scipy>=1.1.0
Using cached scipy-1.7.3-cp37-cp37m-manylinux_2_12_x86_64.manylinux2010_x86_64.whl (38.1 MB)
Collecting threadpoolctl>=2.0.0
Using cached threadpoolctl-3.1.0-py3-none-any.whl (14 kB)
Collecting greenlet!=0.4.17
Using cached greenlet-2.0.2-cp37-cp37m-manylinux_2_17_x86_64.manylinux2014_x86_64.whl (566 kB)
Collecting docker>=4.0.0
Using cached docker-6.0.1-py3-none-any.whl (147 kB)
Collecting deprecation
Using cached deprecation-2.1.0-py2.py3-none-any.whl (11 kB)
Collecting wrapt
Using cached wrapt-1.15.0-cp37-cp37m-manylinux_2_5_x86_64.manylinux1_x86_64.manylinux_2_17_x86_64.manylinux2014_x86_64.whl (75 kB)
Collecting pymysql
Using cached PyMySQL-1.0.2-py3-none-any.whl (43 kB)
Collecting pycparser
Using cached pycparser-2.21-py2.py3-none-any.whl (118 kB)
Collecting websocket-client>=0.32.0
Using cached websocket_client-1.5.1-py3-none-any.whl (55 kB)
Collecting googleapis-common-protos<2.0dev,>=1.56.2
Using cached googleapis_common_protos-1.58.0-py2.py3-none-any.whl (223 kB)
Collecting google-crc32c<2.0dev,>=1.0
Using cached google_crc32c-1.5.0-cp37-cp37m-manylinux_2_17_x86_64.manylinux2014_x86_64.whl (32 kB)
Collecting grpcio-status>=1.33.2
Using cached grpcio_status-1.51.1-py3-none-any.whl (5.1 kB)
Using cached grpcio_status-1.50.0-py3-none-any.whl (14 kB)
Using cached grpcio_status-1.49.1-py3-none-any.whl (14 kB)
Using cached grpcio_status-1.48.2-py3-none-any.whl (14 kB)
Requirement already satisfied: zipp>=0.5 in <https://ci-beam.apache.org/job/beam_PerformanceTests_PubsubIOIT_Python_Streaming/ws/src/build/gradleenv/1329484227/lib/python3.7/site-packages> (from importlib-metadata>=0.12->pytest<8.0,>=7.1.2->apache-beam==2.47.0.dev0) (3.15.0)
Collecting PyJWT[crypto]<3,>=1.0.0
Using cached PyJWT-2.6.0-py3-none-any.whl (20 kB)
Collecting portalocker<3,>=1.0
Using cached portalocker-2.7.0-py2.py3-none-any.whl (15 kB)
Collecting pyasn1>=0.1.7
Using cached pyasn1-0.4.8-py2.py3-none-any.whl (77 kB)
Requirement already satisfied: py in <https://ci-beam.apache.org/job/beam_PerformanceTests_PubsubIOIT_Python_Streaming/ws/src/build/gradleenv/1329484227/lib/python3.7/site-packages> (from pytest-forked->pytest-xdist<3,>=2.5.0->apache-beam==2.47.0.dev0) (1.11.0)
Building wheels for collected packages: apache-beam
Building wheel for apache-beam (setup.py): started
Building wheel for apache-beam (setup.py): finished with status 'done'
Created wheel for apache-beam: filename=apache_beam-2.47.0.dev0-py3-none-any.whl size=3034822 sha256=812630900e697a8c7e46c2d52c9efcaa5063176864a046d6c413feafd476211a
Stored in directory: /home/jenkins/.cache/pip/wheels/ab/30/db/7a1d878abb34081c011192312e662d364ee443467dfb553778
Successfully built apache-beam
Installing collected packages: sortedcontainers, pytz, pyasn1, parameterized, docopt, crcmod, zstandard, wrapt, websocket-client, urllib3, tomli, threadpoolctl, tenacity, sqlparse, scipy, rsa, regex, pyyaml, python-dateutil, pyparsing, pymysql, pymongo, PyJWT, pyhamcrest, pycparser, pyasn1-modules, pyarrow, psycopg2-binary, proto-plus, portalocker, overrides, orjson, objsize, mock, joblib, jmespath, isodate, iniconfig, idna, greenlet, googleapis-common-protos, google-crc32c, fasteners, fastavro, execnet, exceptiongroup, dill, deprecation, cloudpickle, charset-normalizer, certifi, cachetools, attrs, sqlalchemy, scikit-learn, requests, pydot, pandas, hypothesis, httplib2, grpcio-status, google-resumable-media, google-auth, freezegun, cffi, botocore, s3transfer, requests_mock, pytest, oauth2client, hdfs, grpc-google-iam-v1, google-auth-httplib2, google-api-core, docker, cryptography, azure-core, testcontainers, pytest-timeout, pytest-forked, google-cloud-core, google-apitools, boto3, azure-storage-blob, apache-beam, pytest-xdist, msal, google-cloud-vision, google-cloud-videointelligence, google-cloud-spanner, google-cloud-recommendations-ai, google-cloud-pubsub, google-cloud-language, google-cloud-dlp, google-cloud-datastore, google-cloud-bigtable, google-cloud-bigquery-storage, google-cloud-bigquery, msal-extensions, google-cloud-pubsublite, azure-identity
Successfully installed PyJWT-2.6.0 apache-beam-2.47.0.dev0 attrs-22.2.0 azure-core-1.26.3 azure-identity-1.12.0 azure-storage-blob-12.15.0 boto3-1.26.89 botocore-1.29.89 cachetools-4.2.4 certifi-2022.12.7 cffi-1.15.1 charset-normalizer-3.1.0 cloudpickle-2.2.1 crcmod-1.7 cryptography-39.0.2 deprecation-2.1.0 dill-0.3.1.1 docker-6.0.1 docopt-0.6.2 exceptiongroup-1.1.0 execnet-1.9.0 fastavro-1.7.3 fasteners-0.18 freezegun-1.2.2 google-api-core-2.11.0 google-apitools-0.5.31 google-auth-2.16.2 google-auth-httplib2-0.1.0 google-cloud-bigquery-3.6.0 google-cloud-bigquery-storage-2.16.2 google-cloud-bigtable-1.7.3 google-cloud-core-2.3.2 google-cloud-datastore-1.15.5 google-cloud-dlp-3.12.0 google-cloud-language-1.3.2 google-cloud-pubsub-2.15.0 google-cloud-pubsublite-1.7.0 google-cloud-recommendations-ai-0.7.1 google-cloud-spanner-3.28.0 google-cloud-videointelligence-1.16.3 google-cloud-vision-3.4.0 google-crc32c-1.5.0 google-resumable-media-2.4.1 googleapis-common-protos-1.58.0 greenlet-2.0.2 grpc-google-iam-v1-0.12.6 grpcio-status-1.48.2 hdfs-2.7.0 httplib2-0.21.0 hypothesis-6.68.2 idna-3.4 iniconfig-2.0.0 isodate-0.6.1 jmespath-1.0.1 joblib-1.2.0 mock-5.0.1 msal-1.21.0 msal-extensions-1.0.0 oauth2client-4.1.3 objsize-0.6.1 orjson-3.8.7 overrides-6.5.0 pandas-1.3.5 parameterized-0.8.1 portalocker-2.7.0 proto-plus-1.22.2 psycopg2-binary-2.9.5 pyarrow-9.0.0 pyasn1-0.4.8 pyasn1-modules-0.2.8 pycparser-2.21 pydot-1.4.2 pyhamcrest-1.10.1 pymongo-3.13.0 pymysql-1.0.2 pyparsing-3.0.9 pytest-7.2.2 pytest-forked-1.6.0 pytest-timeout-2.1.0 pytest-xdist-2.5.0 python-dateutil-2.8.2 pytz-2022.7.1 pyyaml-6.0 regex-2022.10.31 requests-2.28.2 requests_mock-1.10.0 rsa-4.9 s3transfer-0.6.0 scikit-learn-1.0.2 scipy-1.7.3 sortedcontainers-2.4.0 sqlalchemy-1.4.46 sqlparse-0.4.3 tenacity-5.1.5 testcontainers-3.7.1 threadpoolctl-3.1.0 tomli-2.0.1 urllib3-1.26.15 websocket-client-1.5.1 wrapt-1.15.0 zstandard-0.20.0
> Task :sdks:python:apache_beam:testing:load_tests:run
INFO:apache_beam.runners.portability.stager:Copying Beam SDK "<https://ci-beam.apache.org/job/beam_PerformanceTests_PubsubIOIT_Python_Streaming/ws/src/sdks/python/build/apache-beam.tar.gz"> to staging location.
INFO:apache_beam.runners.dataflow.dataflow_runner:Pipeline has additional dependencies to be installed in SDK **** container, consider using the SDK container image pre-building workflow to avoid repetitive installations. Learn more on https://cloud.google.com/dataflow/docs/guides/using-custom-containers#prebuild
INFO:root:Default Python SDK image for environment is apache/beam_python3.7_sdk:2.47.0.dev
INFO:root:Using provided Python SDK container image: gcr.io/cloud-dataflow/v1beta3/python37-fnapi:beam-master-20230126
INFO:root:Python SDK container image set to "gcr.io/cloud-dataflow/v1beta3/python37-fnapi:beam-master-20230126" for Docker environment
INFO:apache_beam.runners.dataflow.internal.apiclient:Defaulting to the temp_location as staging_location: gs://temp-storage-for-perf-tests/loadtests
INFO:apache_beam.internal.gcp.auth:Setting socket default timeout to 60 seconds.
INFO:apache_beam.internal.gcp.auth:socket default timeout is 60.0 seconds.
INFO:apache_beam.runners.dataflow.internal.apiclient:Starting GCS upload to gs://temp-storage-for-perf-tests/loadtests/performance-tests-psio-python-2gb0310232749.1678493252.345651/pickled_main_session...
INFO:apache_beam.runners.dataflow.internal.apiclient:Completed GCS upload to gs://temp-storage-for-perf-tests/loadtests/performance-tests-psio-python-2gb0310232749.1678493252.345651/pickled_main_session in 0 seconds.
INFO:apache_beam.runners.dataflow.internal.apiclient:Starting GCS upload to gs://temp-storage-for-perf-tests/loadtests/performance-tests-psio-python-2gb0310232749.1678493252.345651/dataflow_python_sdk.tar...
INFO:apache_beam.runners.dataflow.internal.apiclient:Completed GCS upload to gs://temp-storage-for-perf-tests/loadtests/performance-tests-psio-python-2gb0310232749.1678493252.345651/dataflow_python_sdk.tar in 0 seconds.
INFO:apache_beam.runners.dataflow.internal.apiclient:Starting GCS upload to gs://temp-storage-for-perf-tests/loadtests/performance-tests-psio-python-2gb0310232749.1678493252.345651/pipeline.pb...
INFO:apache_beam.runners.dataflow.internal.apiclient:Completed GCS upload to gs://temp-storage-for-perf-tests/loadtests/performance-tests-psio-python-2gb0310232749.1678493252.345651/pipeline.pb in 0 seconds.
INFO:apache_beam.runners.dataflow.internal.apiclient:Create job: <Job
clientRequestId: '20230311000732347382-4594'
createTime: '2023-03-11T00:07:34.047854Z'
currentStateTime: '1970-01-01T00:00:00Z'
id: '2023-03-10_16_07_33-4312121703807663534'
location: 'us-central1'
name: 'performance-tests-psio-python-2gb0310232749'
projectId: 'apache-beam-testing'
stageStates: []
startTime: '2023-03-11T00:07:34.047854Z'
steps: []
tempFiles: []
type: TypeValueValuesEnum(JOB_TYPE_STREAMING, 2)>
INFO:apache_beam.runners.dataflow.internal.apiclient:Created job with id: [2023-03-10_16_07_33-4312121703807663534]
INFO:apache_beam.runners.dataflow.internal.apiclient:Submitted job: 2023-03-10_16_07_33-4312121703807663534
INFO:apache_beam.runners.dataflow.internal.apiclient:To access the Dataflow monitoring console, please navigate to https://console.cloud.google.com/dataflow/jobs/us-central1/2023-03-10_16_07_33-4312121703807663534?project=apache-beam-testing
INFO:apache_beam.runners.dataflow.test_dataflow_runner:Console log:
INFO:apache_beam.runners.dataflow.test_dataflow_runner:https://console.cloud.google.com/dataflow/jobs/us-central1/2023-03-10_16_07_33-4312121703807663534?project=apache-beam-testing
INFO:apache_beam.runners.dataflow.dataflow_runner:Job 2023-03-10_16_07_33-4312121703807663534 is in state JOB_STATE_RUNNING
INFO:apache_beam.runners.dataflow.dataflow_runner:2023-03-11T00:07:40.942Z: JOB_MESSAGE_BASIC: Worker configuration: e2-standard-2 in us-central1-b.
INFO:apache_beam.runners.dataflow.dataflow_runner:2023-03-11T00:07:42.344Z: JOB_MESSAGE_DETAILED: Expanding SplittableParDo operations into optimizable parts.
INFO:apache_beam.runners.dataflow.dataflow_runner:2023-03-11T00:07:42.373Z: JOB_MESSAGE_DETAILED: Expanding CollectionToSingleton operations into optimizable parts.
INFO:apache_beam.runners.dataflow.dataflow_runner:2023-03-11T00:07:42.428Z: JOB_MESSAGE_DETAILED: Expanding CoGroupByKey operations into optimizable parts.
INFO:apache_beam.runners.dataflow.dataflow_runner:2023-03-11T00:07:42.465Z: JOB_MESSAGE_DETAILED: Expanding SplittableProcessKeyed operations into optimizable parts.
INFO:apache_beam.runners.dataflow.dataflow_runner:2023-03-11T00:07:42.492Z: JOB_MESSAGE_DETAILED: Expanding GroupByKey operations into streaming Read/Write steps
INFO:apache_beam.runners.dataflow.dataflow_runner:2023-03-11T00:07:42.513Z: JOB_MESSAGE_DETAILED: Lifting ValueCombiningMappingFns into MergeBucketsMappingFns
INFO:apache_beam.runners.dataflow.dataflow_runner:2023-03-11T00:07:42.547Z: JOB_MESSAGE_DEBUG: Annotating graph with Autotuner information.
INFO:apache_beam.runners.dataflow.dataflow_runner:2023-03-11T00:07:42.582Z: JOB_MESSAGE_DETAILED: Fusing adjacent ParDo, Read, Write, and Flatten operations
INFO:apache_beam.runners.dataflow.dataflow_runner:2023-03-11T00:07:42.616Z: JOB_MESSAGE_DETAILED: Fusing consumer Create input/Map(<lambda at iobase.py:908>) into Create input/Impulse
INFO:apache_beam.runners.dataflow.dataflow_runner:2023-03-11T00:07:42.647Z: JOB_MESSAGE_DETAILED: Fusing consumer ref_AppliedPTransform_Create-input-SDFBoundedSourceReader-ParDo-SDFBoundedSourceDoFn-_6/PairWithRestriction into Create input/Map(<lambda at iobase.py:908>)
INFO:apache_beam.runners.dataflow.dataflow_runner:2023-03-11T00:07:42.679Z: JOB_MESSAGE_DETAILED: Fusing consumer ref_AppliedPTransform_Create-input-SDFBoundedSourceReader-ParDo-SDFBoundedSourceDoFn-_6/SplitWithSizing into ref_AppliedPTransform_Create-input-SDFBoundedSourceReader-ParDo-SDFBoundedSourceDoFn-_6/PairWithRestriction
INFO:apache_beam.runners.dataflow.dataflow_runner:2023-03-11T00:07:42.713Z: JOB_MESSAGE_DETAILED: Fusing consumer Format to pubsub message in bytes into ref_AppliedPTransform_Create-input-SDFBoundedSourceReader-ParDo-SDFBoundedSourceDoFn-_6/ProcessElementAndRestrictionWithSizing
INFO:apache_beam.runners.dataflow.dataflow_runner:2023-03-11T00:07:42.746Z: JOB_MESSAGE_DETAILED: Fusing consumer Measure time into Format to pubsub message in bytes
INFO:apache_beam.runners.dataflow.dataflow_runner:2023-03-11T00:07:42.789Z: JOB_MESSAGE_DETAILED: Fusing consumer Write to Pubsub/ToProtobuf into Measure time
INFO:apache_beam.runners.dataflow.dataflow_runner:2023-03-11T00:07:42.819Z: JOB_MESSAGE_DETAILED: Fusing consumer Write to Pubsub/Write into Write to Pubsub/ToProtobuf
INFO:apache_beam.runners.dataflow.dataflow_runner:2023-03-11T00:07:42.958Z: JOB_MESSAGE_BASIC: Running job using Streaming Engine
INFO:apache_beam.runners.dataflow.dataflow_runner:2023-03-11T00:07:43.013Z: JOB_MESSAGE_DEBUG: Workflow config is missing a default resource spec.
INFO:apache_beam.runners.dataflow.dataflow_runner:2023-03-11T00:07:43.044Z: JOB_MESSAGE_DEBUG: Adding StepResource setup and teardown to workflow graph.
INFO:apache_beam.runners.dataflow.dataflow_runner:2023-03-11T00:07:43.080Z: JOB_MESSAGE_DEBUG: Adding workflow start and stop steps.
INFO:apache_beam.runners.dataflow.dataflow_runner:2023-03-11T00:07:43.114Z: JOB_MESSAGE_DEBUG: Assigning stage ids.
INFO:apache_beam.runners.dataflow.dataflow_runner:2023-03-11T00:07:44.212Z: JOB_MESSAGE_DEBUG: Starting **** pool setup.
INFO:apache_beam.runners.dataflow.dataflow_runner:2023-03-11T00:07:44.245Z: JOB_MESSAGE_DEBUG: Starting **** pool setup.
INFO:apache_beam.runners.dataflow.dataflow_runner:2023-03-11T00:07:44.263Z: JOB_MESSAGE_BASIC: Starting 5 ****s in us-central1-b...
INFO:apache_beam.runners.dataflow.dataflow_runner:2023-03-11T00:08:08.023Z: JOB_MESSAGE_BASIC: Your project already contains 100 Dataflow-created metric descriptors, so new user metrics of the form custom.googleapis.com/* will not be created. However, all user metrics are also available in the metric dataflow.googleapis.com/job/user_counter. If you rely on the custom metrics, you can delete old / unused metric descriptors. See https://developers.google.com/apis-explorer/#p/monitoring/v3/monitoring.projects.metricDescriptors.list and https://developers.google.com/apis-explorer/#p/monitoring/v3/monitoring.projects.metricDescriptors.delete
INFO:apache_beam.runners.dataflow.dataflow_runner:2023-03-11T00:08:30.259Z: JOB_MESSAGE_DETAILED: Autoscaling: Raised the number of ****s to 4 so that the pipeline can catch up with its backlog and keep up with its input rate.
INFO:apache_beam.runners.dataflow.dataflow_runner:2023-03-11T00:08:30.290Z: JOB_MESSAGE_DETAILED: Autoscaling: Resized **** pool to 4, though goal was 5. This could be a quota issue.
INFO:apache_beam.runners.dataflow.dataflow_runner:2023-03-11T00:08:40.012Z: JOB_MESSAGE_DETAILED: Autoscaling: Raised the number of ****s to 5 so that the pipeline can catch up with its backlog and keep up with its input rate.
INFO:apache_beam.runners.dataflow.dataflow_runner:2023-03-11T00:09:06.253Z: JOB_MESSAGE_DETAILED: Workers have started successfully.
INFO:apache_beam.runners.dataflow.dataflow_runner:2023-03-11T00:09:16.834Z: JOB_MESSAGE_DETAILED: All ****s have finished the startup processes and began to receive work requests.
INFO:apache_beam.runners.dataflow.dataflow_runner:2023-03-11T00:17:10.185Z: JOB_MESSAGE_ERROR: generic::aborted: SDK harness sdk-0-0 disconnected.
with MessageCode:
(57d02904bbd62a0a): SDK disconnect.
passed through:
==>
dist_proc/dax/workflow/****/fnapi_control_service.cc:217
WARNING:apache_beam.runners.dataflow.dataflow_runner:Timing out on waiting for job 2023-03-10_16_07_33-4312121703807663534 after 722 seconds
INFO:apache_beam.runners.portability.stager:Copying Beam SDK "<https://ci-beam.apache.org/job/beam_PerformanceTests_PubsubIOIT_Python_Streaming/ws/src/sdks/python/build/apache-beam.tar.gz"> to staging location.
INFO:apache_beam.runners.dataflow.dataflow_runner:Pipeline has additional dependencies to be installed in SDK **** container, consider using the SDK container image pre-building workflow to avoid repetitive installations. Learn more on https://cloud.google.com/dataflow/docs/guides/using-custom-containers#prebuild
INFO:root:Default Python SDK image for environment is apache/beam_python3.7_sdk:2.47.0.dev
INFO:root:Using provided Python SDK container image: gcr.io/cloud-dataflow/v1beta3/python37-fnapi:beam-master-20230126
INFO:root:Python SDK container image set to "gcr.io/cloud-dataflow/v1beta3/python37-fnapi:beam-master-20230126" for Docker environment
INFO:apache_beam.runners.dataflow.internal.apiclient:Defaulting to the temp_location as staging_location: gs://temp-storage-for-perf-tests/loadtests
INFO:apache_beam.runners.dataflow.internal.apiclient:Starting GCS upload to gs://temp-storage-for-perf-tests/loadtests/performance-tests-psio-python-2gb0310232749.1678494156.312927/pickled_main_session...
INFO:apache_beam.runners.dataflow.internal.apiclient:Completed GCS upload to gs://temp-storage-for-perf-tests/loadtests/performance-tests-psio-python-2gb0310232749.1678494156.312927/pickled_main_session in 0 seconds.
INFO:apache_beam.runners.dataflow.internal.apiclient:Starting GCS upload to gs://temp-storage-for-perf-tests/loadtests/performance-tests-psio-python-2gb0310232749.1678494156.312927/dataflow_python_sdk.tar...
INFO:apache_beam.runners.dataflow.internal.apiclient:Completed GCS upload to gs://temp-storage-for-perf-tests/loadtests/performance-tests-psio-python-2gb0310232749.1678494156.312927/dataflow_python_sdk.tar in 0 seconds.
INFO:apache_beam.runners.dataflow.internal.apiclient:Starting GCS upload to gs://temp-storage-for-perf-tests/loadtests/performance-tests-psio-python-2gb0310232749.1678494156.312927/pipeline.pb...
INFO:apache_beam.runners.dataflow.internal.apiclient:Completed GCS upload to gs://temp-storage-for-perf-tests/loadtests/performance-tests-psio-python-2gb0310232749.1678494156.312927/pipeline.pb in 0 seconds.
INFO:apache_beam.runners.dataflow.internal.apiclient:Create job: <Job
clientRequestId: '20230311002236313890-5859'
createTime: '2023-03-11T00:22:37.487730Z'
currentStateTime: '1970-01-01T00:00:00Z'
id: '2023-03-10_16_22_36-14251610113469193672'
location: 'us-central1'
name: 'performance-tests-psio-python-2gb0310232749'
projectId: 'apache-beam-testing'
stageStates: []
startTime: '2023-03-11T00:22:37.487730Z'
steps: []
tempFiles: []
type: TypeValueValuesEnum(JOB_TYPE_STREAMING, 2)>
INFO:apache_beam.runners.dataflow.internal.apiclient:Created job with id: [2023-03-10_16_22_36-14251610113469193672]
INFO:apache_beam.runners.dataflow.internal.apiclient:Submitted job: 2023-03-10_16_22_36-14251610113469193672
INFO:apache_beam.runners.dataflow.internal.apiclient:To access the Dataflow monitoring console, please navigate to https://console.cloud.google.com/dataflow/jobs/us-central1/2023-03-10_16_22_36-14251610113469193672?project=apache-beam-testing
INFO:apache_beam.runners.dataflow.test_dataflow_runner:Console log:
INFO:apache_beam.runners.dataflow.test_dataflow_runner:https://console.cloud.google.com/dataflow/jobs/us-central1/2023-03-10_16_22_36-14251610113469193672?project=apache-beam-testing
INFO:apache_beam.runners.dataflow.dataflow_runner:Job 2023-03-10_16_22_36-14251610113469193672 is in state JOB_STATE_RUNNING
INFO:apache_beam.runners.dataflow.dataflow_runner:2023-03-11T00:22:44.878Z: JOB_MESSAGE_BASIC: Worker configuration: e2-standard-2 in us-central1-b.
INFO:apache_beam.runners.dataflow.dataflow_runner:2023-03-11T00:22:48.740Z: JOB_MESSAGE_DETAILED: Expanding SplittableParDo operations into optimizable parts.
INFO:apache_beam.runners.dataflow.dataflow_runner:2023-03-11T00:22:48.800Z: JOB_MESSAGE_DETAILED: Expanding CollectionToSingleton operations into optimizable parts.
INFO:apache_beam.runners.dataflow.dataflow_runner:2023-03-11T00:22:48.911Z: JOB_MESSAGE_DETAILED: Expanding CoGroupByKey operations into optimizable parts.
INFO:apache_beam.runners.dataflow.dataflow_runner:2023-03-11T00:22:49.018Z: JOB_MESSAGE_DETAILED: Expanding SplittableProcessKeyed operations into optimizable parts.
INFO:apache_beam.runners.dataflow.dataflow_runner:2023-03-11T00:22:49.055Z: JOB_MESSAGE_DETAILED: Expanding GroupByKey operations into streaming Read/Write steps
INFO:apache_beam.runners.dataflow.dataflow_runner:2023-03-11T00:22:49.134Z: JOB_MESSAGE_DETAILED: Lifting ValueCombiningMappingFns into MergeBucketsMappingFns
INFO:apache_beam.runners.dataflow.dataflow_runner:2023-03-11T00:22:49.203Z: JOB_MESSAGE_DEBUG: Annotating graph with Autotuner information.
INFO:apache_beam.runners.dataflow.dataflow_runner:2023-03-11T00:22:49.266Z: JOB_MESSAGE_DETAILED: Fusing adjacent ParDo, Read, Write, and Flatten operations
INFO:apache_beam.runners.dataflow.dataflow_runner:2023-03-11T00:22:49.319Z: JOB_MESSAGE_DETAILED: Fusing consumer Read from pubsub/Map(_from_proto_str) into Read from pubsub/Read
INFO:apache_beam.runners.dataflow.dataflow_runner:2023-03-11T00:22:49.364Z: JOB_MESSAGE_DETAILED: Fusing consumer Map(<lambda at pubsub_io_perf_test.py:170>) into Read from pubsub/Map(_from_proto_str)
INFO:apache_beam.runners.dataflow.dataflow_runner:2023-03-11T00:22:49.408Z: JOB_MESSAGE_DETAILED: Fusing consumer Measure time into Map(<lambda at pubsub_io_perf_test.py:170>)
INFO:apache_beam.runners.dataflow.dataflow_runner:2023-03-11T00:22:49.445Z: JOB_MESSAGE_DETAILED: Fusing consumer Window into Measure time
INFO:apache_beam.runners.dataflow.dataflow_runner:2023-03-11T00:22:49.479Z: JOB_MESSAGE_DETAILED: Fusing consumer Count messages/KeyWithVoid into Window
INFO:apache_beam.runners.dataflow.dataflow_runner:2023-03-11T00:22:49.523Z: JOB_MESSAGE_DETAILED: Fusing consumer Count messages/CombinePerKey/Combine/ConvertToAccumulators into Count messages/KeyWithVoid
INFO:apache_beam.runners.dataflow.dataflow_runner:2023-03-11T00:22:49.568Z: JOB_MESSAGE_DETAILED: Fusing consumer Count messages/CombinePerKey/GroupByKey/WriteStream into Count messages/CombinePerKey/Combine/ConvertToAccumulators
INFO:apache_beam.runners.dataflow.dataflow_runner:2023-03-11T00:22:49.616Z: JOB_MESSAGE_DETAILED: Fusing consumer Count messages/CombinePerKey/Combine into Count messages/CombinePerKey/GroupByKey/ReadStream
INFO:apache_beam.runners.dataflow.dataflow_runner:2023-03-11T00:22:49.666Z: JOB_MESSAGE_DETAILED: Fusing consumer Count messages/CombinePerKey/Combine/Extract into Count messages/CombinePerKey/Combine
INFO:apache_beam.runners.dataflow.dataflow_runner:2023-03-11T00:22:49.701Z: JOB_MESSAGE_DETAILED: Fusing consumer Count messages/UnKey into Count messages/CombinePerKey/Combine/Extract
INFO:apache_beam.runners.dataflow.dataflow_runner:2023-03-11T00:22:49.756Z: JOB_MESSAGE_DETAILED: Fusing consumer Convert to bytes into Count messages/UnKey
INFO:apache_beam.runners.dataflow.dataflow_runner:2023-03-11T00:22:49.819Z: JOB_MESSAGE_DETAILED: Fusing consumer Write to Pubsub/ToProtobuf into Convert to bytes
INFO:apache_beam.runners.dataflow.dataflow_runner:2023-03-11T00:22:49.858Z: JOB_MESSAGE_DETAILED: Fusing consumer Write to Pubsub/Write into Write to Pubsub/ToProtobuf
INFO:apache_beam.runners.dataflow.dataflow_runner:2023-03-11T00:22:49.901Z: JOB_MESSAGE_BASIC: Running job using Streaming Engine
INFO:apache_beam.runners.dataflow.dataflow_runner:2023-03-11T00:22:49.946Z: JOB_MESSAGE_DEBUG: Workflow config is missing a default resource spec.
INFO:apache_beam.runners.dataflow.dataflow_runner:2023-03-11T00:22:49.987Z: JOB_MESSAGE_DEBUG: Adding StepResource setup and teardown to workflow graph.
INFO:apache_beam.runners.dataflow.dataflow_runner:2023-03-11T00:22:50.032Z: JOB_MESSAGE_DEBUG: Adding workflow start and stop steps.
INFO:apache_beam.runners.dataflow.dataflow_runner:2023-03-11T00:22:50.068Z: JOB_MESSAGE_DEBUG: Assigning stage ids.
INFO:apache_beam.runners.dataflow.dataflow_runner:2023-03-11T00:22:51.151Z: JOB_MESSAGE_DEBUG: Starting **** pool setup.
INFO:apache_beam.runners.dataflow.dataflow_runner:2023-03-11T00:22:51.210Z: JOB_MESSAGE_DEBUG: Starting **** pool setup.
INFO:apache_beam.runners.dataflow.dataflow_runner:2023-03-11T00:22:51.253Z: JOB_MESSAGE_BASIC: Starting 5 ****s in us-central1-b...
INFO:apache_beam.runners.dataflow.dataflow_runner:2023-03-11T00:22:55.526Z: JOB_MESSAGE_BASIC: Your project already contains 100 Dataflow-created metric descriptors, so new user metrics of the form custom.googleapis.com/* will not be created. However, all user metrics are also available in the metric dataflow.googleapis.com/job/user_counter. If you rely on the custom metrics, you can delete old / unused metric descriptors. See https://developers.google.com/apis-explorer/#p/monitoring/v3/monitoring.projects.metricDescriptors.list and https://developers.google.com/apis-explorer/#p/monitoring/v3/monitoring.projects.metricDescriptors.delete
INFO:apache_beam.runners.dataflow.dataflow_runner:2023-03-11T00:23:29.509Z: JOB_MESSAGE_DETAILED: Autoscaling: Raised the number of ****s to 5 so that the pipeline can catch up with its backlog and keep up with its input rate.
INFO:apache_beam.runners.dataflow.dataflow_runner:2023-03-11T00:24:01.108Z: JOB_MESSAGE_DETAILED: Workers have started successfully.
INFO:apache_beam.runners.dataflow.dataflow_runner:2023-03-11T00:24:12.221Z: JOB_MESSAGE_DETAILED: All ****s have finished the startup processes and began to receive work requests.
WARNING:apache_beam.runners.dataflow.dataflow_runner:Timing out on waiting for job 2023-03-10_16_22_36-14251610113469193672 after 723 seconds
ERROR:apache_beam.io.gcp.tests.pubsub_matcher:Timeout after 900 sec. Received 0 messages from projects/apache-beam-testing/subscriptions/pubsub_io_performance_ec4464c7-02e1-464b-8564-65c8b91b52d0_read_matcher.
Traceback (most recent call last):
Worker logs: https://console.cloud.google.com/dataflow/jobs/us-central1/2023-03-10_16_07_33-4312121703807663534?project=apache-beam-testing
Worker logs: https://console.cloud.google.com/dataflow/jobs/us-central1/2023-03-10_16_22_36-14251610113469193672?project=apache-beam-testing
File "/usr/lib/python3.7/runpy.py", line 193, in _run_module_as_main
"__main__", mod_spec)
File "/usr/lib/python3.7/runpy.py", line 85, in _run_code
exec(code, run_globals)
File "<https://ci-beam.apache.org/job/beam_PerformanceTests_PubsubIOIT_Python_Streaming/ws/src/sdks/python/apache_beam/io/gcp/pubsub_io_perf_test.py",> line 222, in <module>
PubsubReadPerfTest().run()
File "<https://ci-beam.apache.org/job/beam_PerformanceTests_PubsubIOIT_Python_Streaming/ws/src/sdks/python/apache_beam/testing/load_tests/load_test.py",> line 150, in run
self.result = self.pipeline.run()
File "<https://ci-beam.apache.org/job/beam_PerformanceTests_PubsubIOIT_Python_Streaming/ws/src/sdks/python/apache_beam/testing/test_pipeline.py",> line 114, in run
False if self.not_use_test_runner_api else test_runner_api))
File "<https://ci-beam.apache.org/job/beam_PerformanceTests_PubsubIOIT_Python_Streaming/ws/src/sdks/python/apache_beam/pipeline.py",> line 577, in run
return self.runner.run_pipeline(self, self._options)
File "<https://ci-beam.apache.org/job/beam_PerformanceTests_PubsubIOIT_Python_Streaming/ws/src/sdks/python/apache_beam/runners/dataflow/test_dataflow_runner.py",> line 70, in run_pipeline
hc_assert_that(self.result, pickler.loads(on_success_matcher))
File "<https://ci-beam.apache.org/job/beam_PerformanceTests_PubsubIOIT_Python_Streaming/ws/src/build/gradleenv/1329484227/lib/python3.7/site-packages/hamcrest/core/assert_that.py",> line 44, in assert_that
_assert_match(actual=arg1, matcher=arg2, reason=arg3)
File "<https://ci-beam.apache.org/job/beam_PerformanceTests_PubsubIOIT_Python_Streaming/ws/src/build/gradleenv/1329484227/lib/python3.7/site-packages/hamcrest/core/assert_that.py",> line 60, in _assert_match
raise AssertionError(description)
AssertionError:
Expected: (Expected 1 messages.)
but: Expected 1 messages. Got 0 messages. Diffs (item, count):
Expected but not in actual: dict_items([(b'2097152', 1)])
Unexpected: dict_items([])
Unexpected (with all details): []
> Task :sdks:python:apache_beam:testing:load_tests:run FAILED
FAILURE: Build failed with an exception.
* Where:
Build file '<https://ci-beam.apache.org/job/beam_PerformanceTests_PubsubIOIT_Python_Streaming/ws/src/sdks/python/apache_beam/testing/load_tests/build.gradle'> line: 63
* What went wrong:
Execution failed for task ':sdks:python:apache_beam:testing:load_tests:run'.
> error occurred
* Try:
> Run with --stacktrace option to get the stack trace.
> Run with --info or --debug option to get more log output.
* Get more help at https://help.gradle.org
Deprecated Gradle features were used in this build, making it incompatible with Gradle 8.0.
You can use '--warning-mode all' to show the individual deprecation warnings and determine if they come from your own scripts or plugins.
See https://docs.gradle.org/7.5.1/userguide/command_line_interface.html#sec:command_line_warnings
BUILD FAILED in 48m 11s
15 actionable tasks: 9 executed, 4 from cache, 2 up-to-date
Publishing build scan...
https://gradle.com/s/iy5cmommfpuza
Build step 'Invoke Gradle script' changed build result to FAILURE
Build step 'Invoke Gradle script' marked build as failure
---------------------------------------------------------------------
To unsubscribe, e-mail: builds-unsubscribe@beam.apache.org
For additional commands, e-mail: builds-help@beam.apache.org
Build failed in Jenkins: beam_PerformanceTests_PubsubIOIT_Python_Streaming #1004
Posted by Apache Jenkins Server <je...@builds.apache.org>.
See <https://ci-beam.apache.org/job/beam_PerformanceTests_PubsubIOIT_Python_Streaming/1004/display/redirect>
Changes:
------------------------------------------
[...truncated 30.30 KB...]
Using cached certifi-2022.12.7-py3-none-any.whl (155 kB)
Collecting urllib3<1.27,>=1.21.1
Using cached urllib3-1.26.14-py2.py3-none-any.whl (140 kB)
Collecting charset-normalizer<4,>=2
Using cached charset_normalizer-3.1.0-cp37-cp37m-manylinux_2_17_x86_64.manylinux2014_x86_64.whl (171 kB)
Collecting idna<4,>=2.5
Using cached idna-3.4-py3-none-any.whl (61 kB)
Collecting threadpoolctl>=2.0.0
Using cached threadpoolctl-3.1.0-py3-none-any.whl (14 kB)
Collecting scipy>=1.1.0
Using cached scipy-1.7.3-cp37-cp37m-manylinux_2_12_x86_64.manylinux2010_x86_64.whl (38.1 MB)
Collecting greenlet!=0.4.17
Using cached greenlet-2.0.2-cp37-cp37m-manylinux_2_17_x86_64.manylinux2014_x86_64.whl (566 kB)
Collecting deprecation
Using cached deprecation-2.1.0-py2.py3-none-any.whl (11 kB)
Collecting wrapt
Using cached wrapt-1.15.0-cp37-cp37m-manylinux_2_5_x86_64.manylinux1_x86_64.manylinux_2_17_x86_64.manylinux2014_x86_64.whl (75 kB)
Collecting docker>=4.0.0
Using cached docker-6.0.1-py3-none-any.whl (147 kB)
Collecting pymysql
Using cached PyMySQL-1.0.2-py3-none-any.whl (43 kB)
Collecting pycparser
Using cached pycparser-2.21-py2.py3-none-any.whl (118 kB)
Collecting websocket-client>=0.32.0
Using cached websocket_client-1.5.1-py3-none-any.whl (55 kB)
Collecting googleapis-common-protos<2.0dev,>=1.56.2
Using cached googleapis_common_protos-1.58.0-py2.py3-none-any.whl (223 kB)
Collecting google-crc32c<2.0dev,>=1.0
Using cached google_crc32c-1.5.0-cp37-cp37m-manylinux_2_17_x86_64.manylinux2014_x86_64.whl (32 kB)
Collecting grpcio-status>=1.33.2
Using cached grpcio_status-1.51.1-py3-none-any.whl (5.1 kB)
Using cached grpcio_status-1.50.0-py3-none-any.whl (14 kB)
Using cached grpcio_status-1.49.1-py3-none-any.whl (14 kB)
Using cached grpcio_status-1.48.2-py3-none-any.whl (14 kB)
Requirement already satisfied: zipp>=0.5 in <https://ci-beam.apache.org/job/beam_PerformanceTests_PubsubIOIT_Python_Streaming/ws/src/build/gradleenv/1329484227/lib/python3.7/site-packages> (from importlib-metadata>=0.12->pytest<8.0,>=7.1.2->apache-beam==2.47.0.dev0) (3.15.0)
Collecting PyJWT[crypto]<3,>=1.0.0
Using cached PyJWT-2.6.0-py3-none-any.whl (20 kB)
Collecting portalocker<3,>=1.0
Using cached portalocker-2.7.0-py2.py3-none-any.whl (15 kB)
Collecting pyasn1>=0.1.7
Using cached pyasn1-0.4.8-py2.py3-none-any.whl (77 kB)
Requirement already satisfied: py in <https://ci-beam.apache.org/job/beam_PerformanceTests_PubsubIOIT_Python_Streaming/ws/src/build/gradleenv/1329484227/lib/python3.7/site-packages> (from pytest-forked->pytest-xdist<3,>=2.5.0->apache-beam==2.47.0.dev0) (1.11.0)
Building wheels for collected packages: apache-beam
Building wheel for apache-beam (setup.py): started
Building wheel for apache-beam (setup.py): finished with status 'done'
Created wheel for apache-beam: filename=apache_beam-2.47.0.dev0-py3-none-any.whl size=3034822 sha256=503a13effa9352db4ece9e9a928247b65c3db4860a5cc6835e6a90482463d82e
Stored in directory: /home/jenkins/.cache/pip/wheels/ab/30/db/7a1d878abb34081c011192312e662d364ee443467dfb553778
Successfully built apache-beam
Installing collected packages: sortedcontainers, pytz, pyasn1, parameterized, docopt, crcmod, zstandard, wrapt, websocket-client, urllib3, tomli, threadpoolctl, tenacity, sqlparse, scipy, rsa, regex, pyyaml, python-dateutil, pyparsing, pymysql, pymongo, PyJWT, pyhamcrest, pycparser, pyasn1-modules, pyarrow, psycopg2-binary, proto-plus, portalocker, overrides, orjson, objsize, mock, joblib, jmespath, isodate, iniconfig, idna, greenlet, googleapis-common-protos, google-crc32c, fasteners, fastavro, execnet, exceptiongroup, dill, deprecation, cloudpickle, charset-normalizer, certifi, cachetools, attrs, sqlalchemy, scikit-learn, requests, pydot, pandas, hypothesis, httplib2, grpcio-status, google-resumable-media, google-auth, freezegun, cffi, botocore, s3transfer, requests_mock, pytest, oauth2client, hdfs, grpc-google-iam-v1, google-auth-httplib2, google-api-core, docker, cryptography, azure-core, testcontainers, pytest-timeout, pytest-forked, google-cloud-core, google-apitools, boto3, azure-storage-blob, apache-beam, pytest-xdist, msal, google-cloud-vision, google-cloud-videointelligence, google-cloud-spanner, google-cloud-recommendations-ai, google-cloud-pubsub, google-cloud-language, google-cloud-dlp, google-cloud-datastore, google-cloud-bigtable, google-cloud-bigquery-storage, google-cloud-bigquery, msal-extensions, google-cloud-pubsublite, azure-identity
Successfully installed PyJWT-2.6.0 apache-beam-2.47.0.dev0 attrs-22.2.0 azure-core-1.26.3 azure-identity-1.12.0 azure-storage-blob-12.15.0 boto3-1.26.88 botocore-1.29.88 cachetools-4.2.4 certifi-2022.12.7 cffi-1.15.1 charset-normalizer-3.1.0 cloudpickle-2.2.1 crcmod-1.7 cryptography-39.0.2 deprecation-2.1.0 dill-0.3.1.1 docker-6.0.1 docopt-0.6.2 exceptiongroup-1.1.0 execnet-1.9.0 fastavro-1.7.3 fasteners-0.18 freezegun-1.2.2 google-api-core-2.11.0 google-apitools-0.5.31 google-auth-2.16.2 google-auth-httplib2-0.1.0 google-cloud-bigquery-3.6.0 google-cloud-bigquery-storage-2.16.2 google-cloud-bigtable-1.7.3 google-cloud-core-2.3.2 google-cloud-datastore-1.15.5 google-cloud-dlp-3.12.0 google-cloud-language-1.3.2 google-cloud-pubsub-2.15.0 google-cloud-pubsublite-1.7.0 google-cloud-recommendations-ai-0.7.1 google-cloud-spanner-3.28.0 google-cloud-videointelligence-1.16.3 google-cloud-vision-3.4.0 google-crc32c-1.5.0 google-resumable-media-2.4.1 googleapis-common-protos-1.58.0 greenlet-2.0.2 grpc-google-iam-v1-0.12.6 grpcio-status-1.48.2 hdfs-2.7.0 httplib2-0.21.0 hypothesis-6.68.2 idna-3.4 iniconfig-2.0.0 isodate-0.6.1 jmespath-1.0.1 joblib-1.2.0 mock-5.0.1 msal-1.21.0 msal-extensions-1.0.0 oauth2client-4.1.3 objsize-0.6.1 orjson-3.8.7 overrides-6.5.0 pandas-1.3.5 parameterized-0.8.1 portalocker-2.7.0 proto-plus-1.22.2 psycopg2-binary-2.9.5 pyarrow-9.0.0 pyasn1-0.4.8 pyasn1-modules-0.2.8 pycparser-2.21 pydot-1.4.2 pyhamcrest-1.10.1 pymongo-3.13.0 pymysql-1.0.2 pyparsing-3.0.9 pytest-7.2.2 pytest-forked-1.6.0 pytest-timeout-2.1.0 pytest-xdist-2.5.0 python-dateutil-2.8.2 pytz-2022.7.1 pyyaml-6.0 regex-2022.10.31 requests-2.28.2 requests_mock-1.10.0 rsa-4.9 s3transfer-0.6.0 scikit-learn-1.0.2 scipy-1.7.3 sortedcontainers-2.4.0 sqlalchemy-1.4.46 sqlparse-0.4.3 tenacity-5.1.5 testcontainers-3.7.1 threadpoolctl-3.1.0 tomli-2.0.1 urllib3-1.26.14 websocket-client-1.5.1 wrapt-1.15.0 zstandard-0.20.0
> Task :sdks:python:apache_beam:testing:load_tests:run
INFO:apache_beam.runners.portability.stager:Copying Beam SDK "<https://ci-beam.apache.org/job/beam_PerformanceTests_PubsubIOIT_Python_Streaming/ws/src/sdks/python/build/apache-beam.tar.gz"> to staging location.
INFO:apache_beam.runners.dataflow.dataflow_runner:Pipeline has additional dependencies to be installed in SDK **** container, consider using the SDK container image pre-building workflow to avoid repetitive installations. Learn more on https://cloud.google.com/dataflow/docs/guides/using-custom-containers#prebuild
INFO:root:Default Python SDK image for environment is apache/beam_python3.7_sdk:2.47.0.dev
INFO:root:Using provided Python SDK container image: gcr.io/cloud-dataflow/v1beta3/python37-fnapi:beam-master-20230126
INFO:root:Python SDK container image set to "gcr.io/cloud-dataflow/v1beta3/python37-fnapi:beam-master-20230126" for Docker environment
INFO:apache_beam.runners.dataflow.internal.apiclient:Defaulting to the temp_location as staging_location: gs://temp-storage-for-perf-tests/loadtests
INFO:apache_beam.internal.gcp.auth:Setting socket default timeout to 60 seconds.
INFO:apache_beam.internal.gcp.auth:socket default timeout is 60.0 seconds.
INFO:apache_beam.runners.dataflow.internal.apiclient:Starting GCS upload to gs://temp-storage-for-perf-tests/loadtests/performance-tests-psio-python-2gb0309200435.1678405874.828097/pickled_main_session...
INFO:apache_beam.runners.dataflow.internal.apiclient:Completed GCS upload to gs://temp-storage-for-perf-tests/loadtests/performance-tests-psio-python-2gb0309200435.1678405874.828097/pickled_main_session in 0 seconds.
INFO:apache_beam.runners.dataflow.internal.apiclient:Starting GCS upload to gs://temp-storage-for-perf-tests/loadtests/performance-tests-psio-python-2gb0309200435.1678405874.828097/dataflow_python_sdk.tar...
INFO:apache_beam.runners.dataflow.internal.apiclient:Completed GCS upload to gs://temp-storage-for-perf-tests/loadtests/performance-tests-psio-python-2gb0309200435.1678405874.828097/dataflow_python_sdk.tar in 0 seconds.
INFO:apache_beam.runners.dataflow.internal.apiclient:Starting GCS upload to gs://temp-storage-for-perf-tests/loadtests/performance-tests-psio-python-2gb0309200435.1678405874.828097/pipeline.pb...
INFO:apache_beam.runners.dataflow.internal.apiclient:Completed GCS upload to gs://temp-storage-for-perf-tests/loadtests/performance-tests-psio-python-2gb0309200435.1678405874.828097/pipeline.pb in 0 seconds.
INFO:apache_beam.runners.dataflow.internal.apiclient:Create job: <Job
clientRequestId: '20230309235114829095-8290'
createTime: '2023-03-09T23:51:15.961106Z'
currentStateTime: '1970-01-01T00:00:00Z'
id: '2023-03-09_15_51_15-10668539261918628222'
location: 'us-central1'
name: 'performance-tests-psio-python-2gb0309200435'
projectId: 'apache-beam-testing'
stageStates: []
startTime: '2023-03-09T23:51:15.961106Z'
steps: []
tempFiles: []
type: TypeValueValuesEnum(JOB_TYPE_STREAMING, 2)>
INFO:apache_beam.runners.dataflow.internal.apiclient:Created job with id: [2023-03-09_15_51_15-10668539261918628222]
INFO:apache_beam.runners.dataflow.internal.apiclient:Submitted job: 2023-03-09_15_51_15-10668539261918628222
INFO:apache_beam.runners.dataflow.internal.apiclient:To access the Dataflow monitoring console, please navigate to https://console.cloud.google.com/dataflow/jobs/us-central1/2023-03-09_15_51_15-10668539261918628222?project=apache-beam-testing
INFO:apache_beam.runners.dataflow.test_dataflow_runner:Console log:
INFO:apache_beam.runners.dataflow.test_dataflow_runner:https://console.cloud.google.com/dataflow/jobs/us-central1/2023-03-09_15_51_15-10668539261918628222?project=apache-beam-testing
INFO:apache_beam.runners.dataflow.dataflow_runner:Job 2023-03-09_15_51_15-10668539261918628222 is in state JOB_STATE_RUNNING
INFO:apache_beam.runners.dataflow.dataflow_runner:2023-03-09T23:51:29.577Z: JOB_MESSAGE_BASIC: Worker configuration: e2-standard-2 in us-central1-b.
INFO:apache_beam.runners.dataflow.dataflow_runner:2023-03-09T23:51:35.847Z: JOB_MESSAGE_DETAILED: Expanding SplittableParDo operations into optimizable parts.
INFO:apache_beam.runners.dataflow.dataflow_runner:2023-03-09T23:51:40.878Z: JOB_MESSAGE_DETAILED: Expanding CollectionToSingleton operations into optimizable parts.
INFO:apache_beam.runners.dataflow.dataflow_runner:2023-03-09T23:51:41.023Z: JOB_MESSAGE_BASIC: Your project already contains 100 Dataflow-created metric descriptors, so new user metrics of the form custom.googleapis.com/* will not be created. However, all user metrics are also available in the metric dataflow.googleapis.com/job/user_counter. If you rely on the custom metrics, you can delete old / unused metric descriptors. See https://developers.google.com/apis-explorer/#p/monitoring/v3/monitoring.projects.metricDescriptors.list and https://developers.google.com/apis-explorer/#p/monitoring/v3/monitoring.projects.metricDescriptors.delete
INFO:apache_beam.runners.dataflow.dataflow_runner:2023-03-09T23:51:41.187Z: JOB_MESSAGE_DETAILED: Expanding CoGroupByKey operations into optimizable parts.
INFO:apache_beam.runners.dataflow.dataflow_runner:2023-03-09T23:51:41.224Z: JOB_MESSAGE_DETAILED: Expanding SplittableProcessKeyed operations into optimizable parts.
INFO:apache_beam.runners.dataflow.dataflow_runner:2023-03-09T23:51:41.253Z: JOB_MESSAGE_DETAILED: Expanding GroupByKey operations into streaming Read/Write steps
INFO:apache_beam.runners.dataflow.dataflow_runner:2023-03-09T23:51:41.284Z: JOB_MESSAGE_DETAILED: Lifting ValueCombiningMappingFns into MergeBucketsMappingFns
INFO:apache_beam.runners.dataflow.dataflow_runner:2023-03-09T23:51:41.310Z: JOB_MESSAGE_DEBUG: Annotating graph with Autotuner information.
INFO:apache_beam.runners.dataflow.dataflow_runner:2023-03-09T23:51:41.378Z: JOB_MESSAGE_DETAILED: Fusing adjacent ParDo, Read, Write, and Flatten operations
INFO:apache_beam.runners.dataflow.dataflow_runner:2023-03-09T23:51:41.416Z: JOB_MESSAGE_DETAILED: Fusing consumer Create input/Map(<lambda at iobase.py:908>) into Create input/Impulse
INFO:apache_beam.runners.dataflow.dataflow_runner:2023-03-09T23:51:41.437Z: JOB_MESSAGE_DETAILED: Fusing consumer ref_AppliedPTransform_Create-input-SDFBoundedSourceReader-ParDo-SDFBoundedSourceDoFn-_6/PairWithRestriction into Create input/Map(<lambda at iobase.py:908>)
INFO:apache_beam.runners.dataflow.dataflow_runner:2023-03-09T23:51:41.472Z: JOB_MESSAGE_DETAILED: Fusing consumer ref_AppliedPTransform_Create-input-SDFBoundedSourceReader-ParDo-SDFBoundedSourceDoFn-_6/SplitWithSizing into ref_AppliedPTransform_Create-input-SDFBoundedSourceReader-ParDo-SDFBoundedSourceDoFn-_6/PairWithRestriction
INFO:apache_beam.runners.dataflow.dataflow_runner:2023-03-09T23:51:41.502Z: JOB_MESSAGE_DETAILED: Fusing consumer Format to pubsub message in bytes into ref_AppliedPTransform_Create-input-SDFBoundedSourceReader-ParDo-SDFBoundedSourceDoFn-_6/ProcessElementAndRestrictionWithSizing
INFO:apache_beam.runners.dataflow.dataflow_runner:2023-03-09T23:51:41.537Z: JOB_MESSAGE_DETAILED: Fusing consumer Measure time into Format to pubsub message in bytes
INFO:apache_beam.runners.dataflow.dataflow_runner:2023-03-09T23:51:41.569Z: JOB_MESSAGE_DETAILED: Fusing consumer Write to Pubsub/ToProtobuf into Measure time
INFO:apache_beam.runners.dataflow.dataflow_runner:2023-03-09T23:51:41.594Z: JOB_MESSAGE_DETAILED: Fusing consumer Write to Pubsub/Write into Write to Pubsub/ToProtobuf
INFO:apache_beam.runners.dataflow.dataflow_runner:2023-03-09T23:51:41.703Z: JOB_MESSAGE_BASIC: Running job using Streaming Engine
INFO:apache_beam.runners.dataflow.dataflow_runner:2023-03-09T23:51:41.734Z: JOB_MESSAGE_DEBUG: Workflow config is missing a default resource spec.
INFO:apache_beam.runners.dataflow.dataflow_runner:2023-03-09T23:51:41.766Z: JOB_MESSAGE_DEBUG: Adding StepResource setup and teardown to workflow graph.
INFO:apache_beam.runners.dataflow.dataflow_runner:2023-03-09T23:51:41.802Z: JOB_MESSAGE_DEBUG: Adding workflow start and stop steps.
INFO:apache_beam.runners.dataflow.dataflow_runner:2023-03-09T23:51:41.837Z: JOB_MESSAGE_DEBUG: Assigning stage ids.
INFO:apache_beam.runners.dataflow.dataflow_runner:2023-03-09T23:51:42.903Z: JOB_MESSAGE_DEBUG: Starting **** pool setup.
INFO:apache_beam.runners.dataflow.dataflow_runner:2023-03-09T23:51:42.938Z: JOB_MESSAGE_BASIC: Starting 5 ****s in us-central1-b...
INFO:apache_beam.runners.dataflow.dataflow_runner:2023-03-09T23:51:42.977Z: JOB_MESSAGE_DEBUG: Starting **** pool setup.
INFO:apache_beam.runners.dataflow.dataflow_runner:2023-03-09T23:52:22.340Z: JOB_MESSAGE_DETAILED: Autoscaling: Raised the number of ****s to 5 so that the pipeline can catch up with its backlog and keep up with its input rate.
INFO:apache_beam.runners.dataflow.dataflow_runner:2023-03-09T23:52:55.746Z: JOB_MESSAGE_DETAILED: Workers have started successfully.
INFO:apache_beam.runners.dataflow.dataflow_runner:2023-03-09T23:53:06.591Z: JOB_MESSAGE_DETAILED: All ****s have finished the startup processes and began to receive work requests.
INFO:apache_beam.runners.dataflow.dataflow_runner:2023-03-10T00:00:25.569Z: JOB_MESSAGE_ERROR: generic::aborted: SDK harness sdk-0-1 disconnected.
with MessageCode:
(fcf3ac637f707ac9): SDK disconnect.
passed through:
==>
dist_proc/dax/workflow/****/fnapi_control_service.cc:217
WARNING:apache_beam.runners.dataflow.dataflow_runner:Timing out on waiting for job 2023-03-09_15_51_15-10668539261918628222 after 722 seconds
INFO:apache_beam.runners.portability.stager:Copying Beam SDK "<https://ci-beam.apache.org/job/beam_PerformanceTests_PubsubIOIT_Python_Streaming/ws/src/sdks/python/build/apache-beam.tar.gz"> to staging location.
INFO:apache_beam.runners.dataflow.dataflow_runner:Pipeline has additional dependencies to be installed in SDK **** container, consider using the SDK container image pre-building workflow to avoid repetitive installations. Learn more on https://cloud.google.com/dataflow/docs/guides/using-custom-containers#prebuild
INFO:root:Default Python SDK image for environment is apache/beam_python3.7_sdk:2.47.0.dev
INFO:root:Using provided Python SDK container image: gcr.io/cloud-dataflow/v1beta3/python37-fnapi:beam-master-20230126
INFO:root:Python SDK container image set to "gcr.io/cloud-dataflow/v1beta3/python37-fnapi:beam-master-20230126" for Docker environment
INFO:apache_beam.runners.dataflow.internal.apiclient:Defaulting to the temp_location as staging_location: gs://temp-storage-for-perf-tests/loadtests
INFO:apache_beam.runners.dataflow.internal.apiclient:Starting GCS upload to gs://temp-storage-for-perf-tests/loadtests/performance-tests-psio-python-2gb0309200435.1678406816.284124/pickled_main_session...
INFO:apache_beam.runners.dataflow.internal.apiclient:Completed GCS upload to gs://temp-storage-for-perf-tests/loadtests/performance-tests-psio-python-2gb0309200435.1678406816.284124/pickled_main_session in 0 seconds.
INFO:apache_beam.runners.dataflow.internal.apiclient:Starting GCS upload to gs://temp-storage-for-perf-tests/loadtests/performance-tests-psio-python-2gb0309200435.1678406816.284124/dataflow_python_sdk.tar...
INFO:apache_beam.runners.dataflow.internal.apiclient:Completed GCS upload to gs://temp-storage-for-perf-tests/loadtests/performance-tests-psio-python-2gb0309200435.1678406816.284124/dataflow_python_sdk.tar in 0 seconds.
INFO:apache_beam.runners.dataflow.internal.apiclient:Starting GCS upload to gs://temp-storage-for-perf-tests/loadtests/performance-tests-psio-python-2gb0309200435.1678406816.284124/pipeline.pb...
INFO:apache_beam.runners.dataflow.internal.apiclient:Completed GCS upload to gs://temp-storage-for-perf-tests/loadtests/performance-tests-psio-python-2gb0309200435.1678406816.284124/pipeline.pb in 0 seconds.
INFO:apache_beam.runners.dataflow.internal.apiclient:Create job: <Job
clientRequestId: '20230310000656285704-1374'
createTime: '2023-03-10T00:06:57.804716Z'
currentStateTime: '1970-01-01T00:00:00Z'
id: '2023-03-09_16_06_57-13452293761389090857'
location: 'us-central1'
name: 'performance-tests-psio-python-2gb0309200435'
projectId: 'apache-beam-testing'
stageStates: []
startTime: '2023-03-10T00:06:57.804716Z'
steps: []
tempFiles: []
type: TypeValueValuesEnum(JOB_TYPE_STREAMING, 2)>
INFO:apache_beam.runners.dataflow.internal.apiclient:Created job with id: [2023-03-09_16_06_57-13452293761389090857]
INFO:apache_beam.runners.dataflow.internal.apiclient:Submitted job: 2023-03-09_16_06_57-13452293761389090857
INFO:apache_beam.runners.dataflow.internal.apiclient:To access the Dataflow monitoring console, please navigate to https://console.cloud.google.com/dataflow/jobs/us-central1/2023-03-09_16_06_57-13452293761389090857?project=apache-beam-testing
INFO:apache_beam.runners.dataflow.test_dataflow_runner:Console log:
INFO:apache_beam.runners.dataflow.test_dataflow_runner:https://console.cloud.google.com/dataflow/jobs/us-central1/2023-03-09_16_06_57-13452293761389090857?project=apache-beam-testing
INFO:apache_beam.runners.dataflow.dataflow_runner:Job 2023-03-09_16_06_57-13452293761389090857 is in state JOB_STATE_RUNNING
INFO:apache_beam.runners.dataflow.dataflow_runner:2023-03-10T00:07:09.539Z: JOB_MESSAGE_BASIC: Worker configuration: e2-standard-2 in us-central1-b.
INFO:apache_beam.runners.dataflow.dataflow_runner:2023-03-10T00:07:17.142Z: JOB_MESSAGE_DETAILED: Expanding SplittableParDo operations into optimizable parts.
INFO:apache_beam.runners.dataflow.dataflow_runner:2023-03-10T00:07:18.701Z: JOB_MESSAGE_DETAILED: Expanding CollectionToSingleton operations into optimizable parts.
INFO:apache_beam.runners.dataflow.dataflow_runner:2023-03-10T00:07:18.757Z: JOB_MESSAGE_DETAILED: Expanding CoGroupByKey operations into optimizable parts.
INFO:apache_beam.runners.dataflow.dataflow_runner:2023-03-10T00:07:18.820Z: JOB_MESSAGE_DETAILED: Expanding SplittableProcessKeyed operations into optimizable parts.
INFO:apache_beam.runners.dataflow.dataflow_runner:2023-03-10T00:07:18.850Z: JOB_MESSAGE_DETAILED: Expanding GroupByKey operations into streaming Read/Write steps
INFO:apache_beam.runners.dataflow.dataflow_runner:2023-03-10T00:07:18.916Z: JOB_MESSAGE_DETAILED: Lifting ValueCombiningMappingFns into MergeBucketsMappingFns
INFO:apache_beam.runners.dataflow.dataflow_runner:2023-03-10T00:07:18.971Z: JOB_MESSAGE_DEBUG: Annotating graph with Autotuner information.
INFO:apache_beam.runners.dataflow.dataflow_runner:2023-03-10T00:07:19.011Z: JOB_MESSAGE_DETAILED: Fusing adjacent ParDo, Read, Write, and Flatten operations
INFO:apache_beam.runners.dataflow.dataflow_runner:2023-03-10T00:07:19.036Z: JOB_MESSAGE_DETAILED: Fusing consumer Read from pubsub/Map(_from_proto_str) into Read from pubsub/Read
INFO:apache_beam.runners.dataflow.dataflow_runner:2023-03-10T00:07:19.060Z: JOB_MESSAGE_DETAILED: Fusing consumer Map(<lambda at pubsub_io_perf_test.py:170>) into Read from pubsub/Map(_from_proto_str)
INFO:apache_beam.runners.dataflow.dataflow_runner:2023-03-10T00:07:19.092Z: JOB_MESSAGE_DETAILED: Fusing consumer Measure time into Map(<lambda at pubsub_io_perf_test.py:170>)
INFO:apache_beam.runners.dataflow.dataflow_runner:2023-03-10T00:07:19.126Z: JOB_MESSAGE_DETAILED: Fusing consumer Window into Measure time
INFO:apache_beam.runners.dataflow.dataflow_runner:2023-03-10T00:07:19.149Z: JOB_MESSAGE_DETAILED: Fusing consumer Count messages/KeyWithVoid into Window
INFO:apache_beam.runners.dataflow.dataflow_runner:2023-03-10T00:07:19.179Z: JOB_MESSAGE_DETAILED: Fusing consumer Count messages/CombinePerKey/Combine/ConvertToAccumulators into Count messages/KeyWithVoid
INFO:apache_beam.runners.dataflow.dataflow_runner:2023-03-10T00:07:19.211Z: JOB_MESSAGE_DETAILED: Fusing consumer Count messages/CombinePerKey/GroupByKey/WriteStream into Count messages/CombinePerKey/Combine/ConvertToAccumulators
INFO:apache_beam.runners.dataflow.dataflow_runner:2023-03-10T00:07:19.244Z: JOB_MESSAGE_DETAILED: Fusing consumer Count messages/CombinePerKey/Combine into Count messages/CombinePerKey/GroupByKey/ReadStream
INFO:apache_beam.runners.dataflow.dataflow_runner:2023-03-10T00:07:19.266Z: JOB_MESSAGE_DETAILED: Fusing consumer Count messages/CombinePerKey/Combine/Extract into Count messages/CombinePerKey/Combine
INFO:apache_beam.runners.dataflow.dataflow_runner:2023-03-10T00:07:19.291Z: JOB_MESSAGE_DETAILED: Fusing consumer Count messages/UnKey into Count messages/CombinePerKey/Combine/Extract
INFO:apache_beam.runners.dataflow.dataflow_runner:2023-03-10T00:07:19.315Z: JOB_MESSAGE_DETAILED: Fusing consumer Convert to bytes into Count messages/UnKey
INFO:apache_beam.runners.dataflow.dataflow_runner:2023-03-10T00:07:19.339Z: JOB_MESSAGE_DETAILED: Fusing consumer Write to Pubsub/ToProtobuf into Convert to bytes
INFO:apache_beam.runners.dataflow.dataflow_runner:2023-03-10T00:07:19.372Z: JOB_MESSAGE_DETAILED: Fusing consumer Write to Pubsub/Write into Write to Pubsub/ToProtobuf
INFO:apache_beam.runners.dataflow.dataflow_runner:2023-03-10T00:07:19.412Z: JOB_MESSAGE_BASIC: Running job using Streaming Engine
INFO:apache_beam.runners.dataflow.dataflow_runner:2023-03-10T00:07:19.443Z: JOB_MESSAGE_DEBUG: Workflow config is missing a default resource spec.
INFO:apache_beam.runners.dataflow.dataflow_runner:2023-03-10T00:07:19.474Z: JOB_MESSAGE_DEBUG: Adding StepResource setup and teardown to workflow graph.
INFO:apache_beam.runners.dataflow.dataflow_runner:2023-03-10T00:07:19.499Z: JOB_MESSAGE_DEBUG: Adding workflow start and stop steps.
INFO:apache_beam.runners.dataflow.dataflow_runner:2023-03-10T00:07:19.530Z: JOB_MESSAGE_DEBUG: Assigning stage ids.
INFO:apache_beam.runners.dataflow.dataflow_runner:2023-03-10T00:07:20.591Z: JOB_MESSAGE_DEBUG: Starting **** pool setup.
INFO:apache_beam.runners.dataflow.dataflow_runner:2023-03-10T00:07:20.629Z: JOB_MESSAGE_BASIC: Starting 5 ****s in us-central1-b...
INFO:apache_beam.runners.dataflow.dataflow_runner:2023-03-10T00:07:20.676Z: JOB_MESSAGE_DEBUG: Starting **** pool setup.
INFO:apache_beam.runners.dataflow.dataflow_runner:2023-03-10T00:07:30.344Z: JOB_MESSAGE_BASIC: Your project already contains 100 Dataflow-created metric descriptors, so new user metrics of the form custom.googleapis.com/* will not be created. However, all user metrics are also available in the metric dataflow.googleapis.com/job/user_counter. If you rely on the custom metrics, you can delete old / unused metric descriptors. See https://developers.google.com/apis-explorer/#p/monitoring/v3/monitoring.projects.metricDescriptors.list and https://developers.google.com/apis-explorer/#p/monitoring/v3/monitoring.projects.metricDescriptors.delete
INFO:apache_beam.runners.dataflow.dataflow_runner:2023-03-10T00:07:59.691Z: JOB_MESSAGE_DETAILED: Autoscaling: Raised the number of ****s to 3 so that the pipeline can catch up with its backlog and keep up with its input rate.
INFO:apache_beam.runners.dataflow.dataflow_runner:2023-03-10T00:07:59.721Z: JOB_MESSAGE_DETAILED: Autoscaling: Resized **** pool to 3, though goal was 5. This could be a quota issue.
INFO:apache_beam.runners.dataflow.dataflow_runner:2023-03-10T00:08:09.624Z: JOB_MESSAGE_DETAILED: Autoscaling: Raised the number of ****s to 5 so that the pipeline can catch up with its backlog and keep up with its input rate.
INFO:apache_beam.runners.dataflow.dataflow_runner:2023-03-10T00:08:33.726Z: JOB_MESSAGE_DETAILED: Workers have started successfully.
INFO:apache_beam.runners.dataflow.dataflow_runner:2023-03-10T00:08:44.324Z: JOB_MESSAGE_DETAILED: All ****s have finished the startup processes and began to receive work requests.
WARNING:apache_beam.runners.dataflow.dataflow_runner:Timing out on waiting for job 2023-03-09_16_06_57-13452293761389090857 after 723 seconds
ERROR:apache_beam.io.gcp.tests.pubsub_matcher:Timeout after 900 sec. Received 0 messages from projects/apache-beam-testing/subscriptions/pubsub_io_performance_00337cdf-cfc3-4760-a7cf-793415ff9396_read_matcher.
Traceback (most recent call last):
Worker logs: https://console.cloud.google.com/dataflow/jobs/us-central1/2023-03-09_15_51_15-10668539261918628222?project=apache-beam-testing
File "/usr/lib/python3.7/runpy.py", line 193, in _run_module_as_main
"__main__", mod_spec)
Worker logs: https://console.cloud.google.com/dataflow/jobs/us-central1/2023-03-09_16_06_57-13452293761389090857?project=apache-beam-testing
File "/usr/lib/python3.7/runpy.py", line 85, in _run_code
exec(code, run_globals)
File "<https://ci-beam.apache.org/job/beam_PerformanceTests_PubsubIOIT_Python_Streaming/ws/src/sdks/python/apache_beam/io/gcp/pubsub_io_perf_test.py",> line 222, in <module>
PubsubReadPerfTest().run()
File "<https://ci-beam.apache.org/job/beam_PerformanceTests_PubsubIOIT_Python_Streaming/ws/src/sdks/python/apache_beam/testing/load_tests/load_test.py",> line 150, in run
self.result = self.pipeline.run()
File "<https://ci-beam.apache.org/job/beam_PerformanceTests_PubsubIOIT_Python_Streaming/ws/src/sdks/python/apache_beam/testing/test_pipeline.py",> line 114, in run
False if self.not_use_test_runner_api else test_runner_api))
File "<https://ci-beam.apache.org/job/beam_PerformanceTests_PubsubIOIT_Python_Streaming/ws/src/sdks/python/apache_beam/pipeline.py",> line 577, in run
return self.runner.run_pipeline(self, self._options)
File "<https://ci-beam.apache.org/job/beam_PerformanceTests_PubsubIOIT_Python_Streaming/ws/src/sdks/python/apache_beam/runners/dataflow/test_dataflow_runner.py",> line 70, in run_pipeline
hc_assert_that(self.result, pickler.loads(on_success_matcher))
File "<https://ci-beam.apache.org/job/beam_PerformanceTests_PubsubIOIT_Python_Streaming/ws/src/build/gradleenv/1329484227/lib/python3.7/site-packages/hamcrest/core/assert_that.py",> line 44, in assert_that
_assert_match(actual=arg1, matcher=arg2, reason=arg3)
File "<https://ci-beam.apache.org/job/beam_PerformanceTests_PubsubIOIT_Python_Streaming/ws/src/build/gradleenv/1329484227/lib/python3.7/site-packages/hamcrest/core/assert_that.py",> line 60, in _assert_match
raise AssertionError(description)
AssertionError:
Expected: (Expected 1 messages.)
but: Expected 1 messages. Got 0 messages. Diffs (item, count):
Expected but not in actual: dict_items([(b'2097152', 1)])
Unexpected: dict_items([])
Unexpected (with all details): []
> Task :sdks:python:apache_beam:testing:load_tests:run FAILED
FAILURE: Build failed with an exception.
* Where:
Build file '<https://ci-beam.apache.org/job/beam_PerformanceTests_PubsubIOIT_Python_Streaming/ws/src/sdks/python/apache_beam/testing/load_tests/build.gradle'> line: 63
* What went wrong:
Execution failed for task ':sdks:python:apache_beam:testing:load_tests:run'.
> error occurred
* Try:
> Run with --stacktrace option to get the stack trace.
> Run with --info or --debug option to get more log output.
* Get more help at https://help.gradle.org
Deprecated Gradle features were used in this build, making it incompatible with Gradle 8.0.
You can use '--warning-mode all' to show the individual deprecation warnings and determine if they come from your own scripts or plugins.
See https://docs.gradle.org/7.5.1/userguide/command_line_interface.html#sec:command_line_warnings
BUILD FAILED in 47m 50s
15 actionable tasks: 9 executed, 4 from cache, 2 up-to-date
Publishing build scan...
https://gradle.com/s/ckug2ebak755y
Build step 'Invoke Gradle script' changed build result to FAILURE
Build step 'Invoke Gradle script' marked build as failure
---------------------------------------------------------------------
To unsubscribe, e-mail: builds-unsubscribe@beam.apache.org
For additional commands, e-mail: builds-help@beam.apache.org
Build failed in Jenkins: beam_PerformanceTests_PubsubIOIT_Python_Streaming #1003
Posted by Apache Jenkins Server <je...@builds.apache.org>.
See <https://ci-beam.apache.org/job/beam_PerformanceTests_PubsubIOIT_Python_Streaming/1003/display/redirect>
Changes:
------------------------------------------
[...truncated 30.50 KB...]
Using cached urllib3-1.26.14-py2.py3-none-any.whl (140 kB)
Collecting certifi>=2017.4.17
Using cached certifi-2022.12.7-py3-none-any.whl (155 kB)
Collecting charset-normalizer<4,>=2
Using cached charset_normalizer-3.1.0-cp37-cp37m-manylinux_2_17_x86_64.manylinux2014_x86_64.whl (171 kB)
Collecting idna<4,>=2.5
Using cached idna-3.4-py3-none-any.whl (61 kB)
Collecting scipy>=1.1.0
Using cached scipy-1.7.3-cp37-cp37m-manylinux_2_12_x86_64.manylinux2010_x86_64.whl (38.1 MB)
Collecting threadpoolctl>=2.0.0
Using cached threadpoolctl-3.1.0-py3-none-any.whl (14 kB)
Collecting greenlet!=0.4.17
Using cached greenlet-2.0.2-cp37-cp37m-manylinux_2_17_x86_64.manylinux2014_x86_64.whl (566 kB)
Collecting wrapt
Using cached wrapt-1.15.0-cp37-cp37m-manylinux_2_5_x86_64.manylinux1_x86_64.manylinux_2_17_x86_64.manylinux2014_x86_64.whl (75 kB)
Collecting docker>=4.0.0
Using cached docker-6.0.1-py3-none-any.whl (147 kB)
Collecting deprecation
Using cached deprecation-2.1.0-py2.py3-none-any.whl (11 kB)
Collecting pymysql
Using cached PyMySQL-1.0.2-py3-none-any.whl (43 kB)
Collecting pycparser
Using cached pycparser-2.21-py2.py3-none-any.whl (118 kB)
Collecting websocket-client>=0.32.0
Using cached websocket_client-1.5.1-py3-none-any.whl (55 kB)
Collecting googleapis-common-protos<2.0dev,>=1.56.2
Using cached googleapis_common_protos-1.58.0-py2.py3-none-any.whl (223 kB)
Collecting google-crc32c<2.0dev,>=1.0
Using cached google_crc32c-1.5.0-cp37-cp37m-manylinux_2_17_x86_64.manylinux2014_x86_64.whl (32 kB)
Collecting grpcio-status>=1.33.2
Using cached grpcio_status-1.51.1-py3-none-any.whl (5.1 kB)
Using cached grpcio_status-1.50.0-py3-none-any.whl (14 kB)
Using cached grpcio_status-1.49.1-py3-none-any.whl (14 kB)
Using cached grpcio_status-1.48.2-py3-none-any.whl (14 kB)
Requirement already satisfied: zipp>=0.5 in <https://ci-beam.apache.org/job/beam_PerformanceTests_PubsubIOIT_Python_Streaming/ws/src/build/gradleenv/1329484227/lib/python3.7/site-packages> (from importlib-metadata>=0.12->pytest<8.0,>=7.1.2->apache-beam==2.47.0.dev0) (3.15.0)
Collecting PyJWT[crypto]<3,>=1.0.0
Using cached PyJWT-2.6.0-py3-none-any.whl (20 kB)
Collecting portalocker<3,>=1.0
Using cached portalocker-2.7.0-py2.py3-none-any.whl (15 kB)
Collecting pyasn1>=0.1.7
Using cached pyasn1-0.4.8-py2.py3-none-any.whl (77 kB)
Requirement already satisfied: py in <https://ci-beam.apache.org/job/beam_PerformanceTests_PubsubIOIT_Python_Streaming/ws/src/build/gradleenv/1329484227/lib/python3.7/site-packages> (from pytest-forked->pytest-xdist<3,>=2.5.0->apache-beam==2.47.0.dev0) (1.11.0)
Building wheels for collected packages: apache-beam
Building wheel for apache-beam (setup.py): started
Building wheel for apache-beam (setup.py): finished with status 'done'
Created wheel for apache-beam: filename=apache_beam-2.47.0.dev0-py3-none-any.whl size=3034824 sha256=4047fa7b53bfd1f814eb936bd1bb126bcf0a8041dca7829024566818b7276e75
Stored in directory: /home/jenkins/.cache/pip/wheels/ab/30/db/7a1d878abb34081c011192312e662d364ee443467dfb553778
Successfully built apache-beam
Installing collected packages: sortedcontainers, pytz, pyasn1, parameterized, docopt, crcmod, zstandard, wrapt, websocket-client, urllib3, tomli, threadpoolctl, tenacity, sqlparse, scipy, rsa, regex, pyyaml, python-dateutil, pyparsing, pymysql, pymongo, PyJWT, pyhamcrest, pycparser, pyasn1-modules, pyarrow, psycopg2-binary, proto-plus, portalocker, overrides, orjson, objsize, mock, joblib, jmespath, isodate, iniconfig, idna, greenlet, googleapis-common-protos, google-crc32c, fasteners, fastavro, execnet, exceptiongroup, dill, deprecation, cloudpickle, charset-normalizer, certifi, cachetools, attrs, sqlalchemy, scikit-learn, requests, pydot, pandas, hypothesis, httplib2, grpcio-status, google-resumable-media, google-auth, freezegun, cffi, botocore, s3transfer, requests_mock, pytest, oauth2client, hdfs, grpc-google-iam-v1, google-auth-httplib2, google-api-core, docker, cryptography, azure-core, testcontainers, pytest-timeout, pytest-forked, google-cloud-core, google-apitools, boto3, azure-storage-blob, apache-beam, pytest-xdist, msal, google-cloud-vision, google-cloud-videointelligence, google-cloud-spanner, google-cloud-recommendations-ai, google-cloud-pubsub, google-cloud-language, google-cloud-dlp, google-cloud-datastore, google-cloud-bigtable, google-cloud-bigquery-storage, google-cloud-bigquery, msal-extensions, google-cloud-pubsublite, azure-identity
Successfully installed PyJWT-2.6.0 apache-beam-2.47.0.dev0 attrs-22.2.0 azure-core-1.26.3 azure-identity-1.12.0 azure-storage-blob-12.15.0 boto3-1.26.87 botocore-1.29.87 cachetools-4.2.4 certifi-2022.12.7 cffi-1.15.1 charset-normalizer-3.1.0 cloudpickle-2.2.1 crcmod-1.7 cryptography-39.0.2 deprecation-2.1.0 dill-0.3.1.1 docker-6.0.1 docopt-0.6.2 exceptiongroup-1.1.0 execnet-1.9.0 fastavro-1.7.3 fasteners-0.18 freezegun-1.2.2 google-api-core-2.11.0 google-apitools-0.5.31 google-auth-2.16.2 google-auth-httplib2-0.1.0 google-cloud-bigquery-3.6.0 google-cloud-bigquery-storage-2.16.2 google-cloud-bigtable-1.7.3 google-cloud-core-2.3.2 google-cloud-datastore-1.15.5 google-cloud-dlp-3.12.0 google-cloud-language-1.3.2 google-cloud-pubsub-2.15.0 google-cloud-pubsublite-1.7.0 google-cloud-recommendations-ai-0.7.1 google-cloud-spanner-3.28.0 google-cloud-videointelligence-1.16.3 google-cloud-vision-3.4.0 google-crc32c-1.5.0 google-resumable-media-2.4.1 googleapis-common-protos-1.58.0 greenlet-2.0.2 grpc-google-iam-v1-0.12.6 grpcio-status-1.48.2 hdfs-2.7.0 httplib2-0.21.0 hypothesis-6.68.2 idna-3.4 iniconfig-2.0.0 isodate-0.6.1 jmespath-1.0.1 joblib-1.2.0 mock-5.0.1 msal-1.21.0 msal-extensions-1.0.0 oauth2client-4.1.3 objsize-0.6.1 orjson-3.8.7 overrides-6.5.0 pandas-1.3.5 parameterized-0.8.1 portalocker-2.7.0 proto-plus-1.22.2 psycopg2-binary-2.9.5 pyarrow-9.0.0 pyasn1-0.4.8 pyasn1-modules-0.2.8 pycparser-2.21 pydot-1.4.2 pyhamcrest-1.10.1 pymongo-3.13.0 pymysql-1.0.2 pyparsing-3.0.9 pytest-7.2.2 pytest-forked-1.6.0 pytest-timeout-2.1.0 pytest-xdist-2.5.0 python-dateutil-2.8.2 pytz-2022.7.1 pyyaml-6.0 regex-2022.10.31 requests-2.28.2 requests_mock-1.10.0 rsa-4.9 s3transfer-0.6.0 scikit-learn-1.0.2 scipy-1.7.3 sortedcontainers-2.4.0 sqlalchemy-1.4.46 sqlparse-0.4.3 tenacity-5.1.5 testcontainers-3.7.1 threadpoolctl-3.1.0 tomli-2.0.1 urllib3-1.26.14 websocket-client-1.5.1 wrapt-1.15.0 zstandard-0.20.0
> Task :sdks:python:apache_beam:testing:load_tests:run
INFO:apache_beam.runners.portability.stager:Copying Beam SDK "<https://ci-beam.apache.org/job/beam_PerformanceTests_PubsubIOIT_Python_Streaming/ws/src/sdks/python/build/apache-beam.tar.gz"> to staging location.
INFO:apache_beam.runners.dataflow.dataflow_runner:Pipeline has additional dependencies to be installed in SDK **** container, consider using the SDK container image pre-building workflow to avoid repetitive installations. Learn more on https://cloud.google.com/dataflow/docs/guides/using-custom-containers#prebuild
INFO:root:Default Python SDK image for environment is apache/beam_python3.7_sdk:2.47.0.dev
INFO:root:Using provided Python SDK container image: gcr.io/cloud-dataflow/v1beta3/python37-fnapi:beam-master-20230126
INFO:root:Python SDK container image set to "gcr.io/cloud-dataflow/v1beta3/python37-fnapi:beam-master-20230126" for Docker environment
INFO:apache_beam.runners.dataflow.internal.apiclient:Defaulting to the temp_location as staging_location: gs://temp-storage-for-perf-tests/loadtests
INFO:apache_beam.internal.gcp.auth:Setting socket default timeout to 60 seconds.
INFO:apache_beam.internal.gcp.auth:socket default timeout is 60.0 seconds.
INFO:apache_beam.runners.dataflow.internal.apiclient:Starting GCS upload to gs://temp-storage-for-perf-tests/loadtests/performance-tests-psio-python-2gb0308200444.1678319477.981263/pickled_main_session...
INFO:apache_beam.runners.dataflow.internal.apiclient:Completed GCS upload to gs://temp-storage-for-perf-tests/loadtests/performance-tests-psio-python-2gb0308200444.1678319477.981263/pickled_main_session in 0 seconds.
INFO:apache_beam.runners.dataflow.internal.apiclient:Starting GCS upload to gs://temp-storage-for-perf-tests/loadtests/performance-tests-psio-python-2gb0308200444.1678319477.981263/dataflow_python_sdk.tar...
INFO:apache_beam.runners.dataflow.internal.apiclient:Completed GCS upload to gs://temp-storage-for-perf-tests/loadtests/performance-tests-psio-python-2gb0308200444.1678319477.981263/dataflow_python_sdk.tar in 0 seconds.
INFO:apache_beam.runners.dataflow.internal.apiclient:Starting GCS upload to gs://temp-storage-for-perf-tests/loadtests/performance-tests-psio-python-2gb0308200444.1678319477.981263/pipeline.pb...
INFO:apache_beam.runners.dataflow.internal.apiclient:Completed GCS upload to gs://temp-storage-for-perf-tests/loadtests/performance-tests-psio-python-2gb0308200444.1678319477.981263/pipeline.pb in 0 seconds.
INFO:apache_beam.runners.dataflow.internal.apiclient:Create job: <Job
clientRequestId: '20230308235117982245-4482'
createTime: '2023-03-08T23:51:19.024891Z'
currentStateTime: '1970-01-01T00:00:00Z'
id: '2023-03-08_15_51_18-3554155292261535856'
location: 'us-central1'
name: 'performance-tests-psio-python-2gb0308200444'
projectId: 'apache-beam-testing'
stageStates: []
startTime: '2023-03-08T23:51:19.024891Z'
steps: []
tempFiles: []
type: TypeValueValuesEnum(JOB_TYPE_STREAMING, 2)>
INFO:apache_beam.runners.dataflow.internal.apiclient:Created job with id: [2023-03-08_15_51_18-3554155292261535856]
INFO:apache_beam.runners.dataflow.internal.apiclient:Submitted job: 2023-03-08_15_51_18-3554155292261535856
INFO:apache_beam.runners.dataflow.internal.apiclient:To access the Dataflow monitoring console, please navigate to https://console.cloud.google.com/dataflow/jobs/us-central1/2023-03-08_15_51_18-3554155292261535856?project=apache-beam-testing
INFO:apache_beam.runners.dataflow.test_dataflow_runner:Console log:
INFO:apache_beam.runners.dataflow.test_dataflow_runner:https://console.cloud.google.com/dataflow/jobs/us-central1/2023-03-08_15_51_18-3554155292261535856?project=apache-beam-testing
INFO:apache_beam.runners.dataflow.dataflow_runner:Job 2023-03-08_15_51_18-3554155292261535856 is in state JOB_STATE_RUNNING
INFO:apache_beam.runners.dataflow.dataflow_runner:2023-03-08T23:51:28.484Z: JOB_MESSAGE_BASIC: Worker configuration: e2-standard-2 in us-central1-b.
INFO:apache_beam.runners.dataflow.dataflow_runner:2023-03-08T23:51:32.360Z: JOB_MESSAGE_DETAILED: Expanding SplittableParDo operations into optimizable parts.
INFO:apache_beam.runners.dataflow.dataflow_runner:2023-03-08T23:51:32.403Z: JOB_MESSAGE_DETAILED: Expanding CollectionToSingleton operations into optimizable parts.
INFO:apache_beam.runners.dataflow.dataflow_runner:2023-03-08T23:51:32.456Z: JOB_MESSAGE_DETAILED: Expanding CoGroupByKey operations into optimizable parts.
INFO:apache_beam.runners.dataflow.dataflow_runner:2023-03-08T23:51:32.497Z: JOB_MESSAGE_DETAILED: Expanding SplittableProcessKeyed operations into optimizable parts.
INFO:apache_beam.runners.dataflow.dataflow_runner:2023-03-08T23:51:32.525Z: JOB_MESSAGE_DETAILED: Expanding GroupByKey operations into streaming Read/Write steps
INFO:apache_beam.runners.dataflow.dataflow_runner:2023-03-08T23:51:32.557Z: JOB_MESSAGE_DETAILED: Lifting ValueCombiningMappingFns into MergeBucketsMappingFns
INFO:apache_beam.runners.dataflow.dataflow_runner:2023-03-08T23:51:32.592Z: JOB_MESSAGE_DEBUG: Annotating graph with Autotuner information.
INFO:apache_beam.runners.dataflow.dataflow_runner:2023-03-08T23:51:32.637Z: JOB_MESSAGE_DETAILED: Fusing adjacent ParDo, Read, Write, and Flatten operations
INFO:apache_beam.runners.dataflow.dataflow_runner:2023-03-08T23:51:32.672Z: JOB_MESSAGE_DETAILED: Fusing consumer Create input/Map(<lambda at iobase.py:908>) into Create input/Impulse
INFO:apache_beam.runners.dataflow.dataflow_runner:2023-03-08T23:51:32.701Z: JOB_MESSAGE_DETAILED: Fusing consumer ref_AppliedPTransform_Create-input-SDFBoundedSourceReader-ParDo-SDFBoundedSourceDoFn-_6/PairWithRestriction into Create input/Map(<lambda at iobase.py:908>)
INFO:apache_beam.runners.dataflow.dataflow_runner:2023-03-08T23:51:32.730Z: JOB_MESSAGE_DETAILED: Fusing consumer ref_AppliedPTransform_Create-input-SDFBoundedSourceReader-ParDo-SDFBoundedSourceDoFn-_6/SplitWithSizing into ref_AppliedPTransform_Create-input-SDFBoundedSourceReader-ParDo-SDFBoundedSourceDoFn-_6/PairWithRestriction
INFO:apache_beam.runners.dataflow.dataflow_runner:2023-03-08T23:51:32.756Z: JOB_MESSAGE_DETAILED: Fusing consumer Format to pubsub message in bytes into ref_AppliedPTransform_Create-input-SDFBoundedSourceReader-ParDo-SDFBoundedSourceDoFn-_6/ProcessElementAndRestrictionWithSizing
INFO:apache_beam.runners.dataflow.dataflow_runner:2023-03-08T23:51:32.793Z: JOB_MESSAGE_DETAILED: Fusing consumer Measure time into Format to pubsub message in bytes
INFO:apache_beam.runners.dataflow.dataflow_runner:2023-03-08T23:51:32.825Z: JOB_MESSAGE_DETAILED: Fusing consumer Write to Pubsub/ToProtobuf into Measure time
INFO:apache_beam.runners.dataflow.dataflow_runner:2023-03-08T23:51:32.853Z: JOB_MESSAGE_DETAILED: Fusing consumer Write to Pubsub/Write into Write to Pubsub/ToProtobuf
INFO:apache_beam.runners.dataflow.dataflow_runner:2023-03-08T23:51:32.949Z: JOB_MESSAGE_BASIC: Running job using Streaming Engine
INFO:apache_beam.runners.dataflow.dataflow_runner:2023-03-08T23:51:32.988Z: JOB_MESSAGE_DEBUG: Workflow config is missing a default resource spec.
INFO:apache_beam.runners.dataflow.dataflow_runner:2023-03-08T23:51:33.020Z: JOB_MESSAGE_DEBUG: Adding StepResource setup and teardown to workflow graph.
INFO:apache_beam.runners.dataflow.dataflow_runner:2023-03-08T23:51:33.047Z: JOB_MESSAGE_DEBUG: Adding workflow start and stop steps.
INFO:apache_beam.runners.dataflow.dataflow_runner:2023-03-08T23:51:33.071Z: JOB_MESSAGE_DEBUG: Assigning stage ids.
INFO:apache_beam.runners.dataflow.dataflow_runner:2023-03-08T23:51:34.160Z: JOB_MESSAGE_DEBUG: Starting **** pool setup.
INFO:apache_beam.runners.dataflow.dataflow_runner:2023-03-08T23:51:34.190Z: JOB_MESSAGE_BASIC: Starting 5 ****s in us-central1-b...
INFO:apache_beam.runners.dataflow.dataflow_runner:2023-03-08T23:51:34.238Z: JOB_MESSAGE_DEBUG: Starting **** pool setup.
INFO:apache_beam.runners.dataflow.dataflow_runner:2023-03-08T23:51:52.496Z: JOB_MESSAGE_BASIC: Your project already contains 100 Dataflow-created metric descriptors, so new user metrics of the form custom.googleapis.com/* will not be created. However, all user metrics are also available in the metric dataflow.googleapis.com/job/user_counter. If you rely on the custom metrics, you can delete old / unused metric descriptors. See https://developers.google.com/apis-explorer/#p/monitoring/v3/monitoring.projects.metricDescriptors.list and https://developers.google.com/apis-explorer/#p/monitoring/v3/monitoring.projects.metricDescriptors.delete
INFO:apache_beam.runners.dataflow.dataflow_runner:2023-03-08T23:52:13.713Z: JOB_MESSAGE_DETAILED: Autoscaling: Raised the number of ****s to 5 so that the pipeline can catch up with its backlog and keep up with its input rate.
INFO:apache_beam.runners.dataflow.dataflow_runner:2023-03-08T23:52:44.297Z: JOB_MESSAGE_DETAILED: Workers have started successfully.
INFO:apache_beam.runners.dataflow.dataflow_runner:2023-03-08T23:52:54.761Z: JOB_MESSAGE_DETAILED: All ****s have finished the startup processes and began to receive work requests.
INFO:apache_beam.runners.dataflow.dataflow_runner:2023-03-09T00:00:11.407Z: JOB_MESSAGE_ERROR: generic::aborted: SDK harness sdk-0-1 disconnected.
with MessageCode:
(b2c11d8a1ba97d28): SDK disconnect.
passed through:
==>
dist_proc/dax/workflow/****/fnapi_control_service.cc:217
WARNING:apache_beam.runners.dataflow.dataflow_runner:Timing out on waiting for job 2023-03-08_15_51_18-3554155292261535856 after 722 seconds
INFO:apache_beam.runners.portability.stager:Copying Beam SDK "<https://ci-beam.apache.org/job/beam_PerformanceTests_PubsubIOIT_Python_Streaming/ws/src/sdks/python/build/apache-beam.tar.gz"> to staging location.
INFO:apache_beam.runners.dataflow.dataflow_runner:Pipeline has additional dependencies to be installed in SDK **** container, consider using the SDK container image pre-building workflow to avoid repetitive installations. Learn more on https://cloud.google.com/dataflow/docs/guides/using-custom-containers#prebuild
INFO:root:Default Python SDK image for environment is apache/beam_python3.7_sdk:2.47.0.dev
INFO:root:Using provided Python SDK container image: gcr.io/cloud-dataflow/v1beta3/python37-fnapi:beam-master-20230126
INFO:root:Python SDK container image set to "gcr.io/cloud-dataflow/v1beta3/python37-fnapi:beam-master-20230126" for Docker environment
INFO:apache_beam.runners.dataflow.internal.apiclient:Defaulting to the temp_location as staging_location: gs://temp-storage-for-perf-tests/loadtests
INFO:apache_beam.runners.dataflow.internal.apiclient:Starting GCS upload to gs://temp-storage-for-perf-tests/loadtests/performance-tests-psio-python-2gb0308200444.1678320380.409349/pickled_main_session...
INFO:apache_beam.runners.dataflow.internal.apiclient:Completed GCS upload to gs://temp-storage-for-perf-tests/loadtests/performance-tests-psio-python-2gb0308200444.1678320380.409349/pickled_main_session in 0 seconds.
INFO:apache_beam.runners.dataflow.internal.apiclient:Starting GCS upload to gs://temp-storage-for-perf-tests/loadtests/performance-tests-psio-python-2gb0308200444.1678320380.409349/dataflow_python_sdk.tar...
INFO:apache_beam.runners.dataflow.internal.apiclient:Completed GCS upload to gs://temp-storage-for-perf-tests/loadtests/performance-tests-psio-python-2gb0308200444.1678320380.409349/dataflow_python_sdk.tar in 0 seconds.
INFO:apache_beam.runners.dataflow.internal.apiclient:Starting GCS upload to gs://temp-storage-for-perf-tests/loadtests/performance-tests-psio-python-2gb0308200444.1678320380.409349/pipeline.pb...
INFO:apache_beam.runners.dataflow.internal.apiclient:Completed GCS upload to gs://temp-storage-for-perf-tests/loadtests/performance-tests-psio-python-2gb0308200444.1678320380.409349/pipeline.pb in 0 seconds.
INFO:apache_beam.runners.dataflow.internal.apiclient:Create job: <Job
clientRequestId: '20230309000620410358-3422'
createTime: '2023-03-09T00:06:21.549739Z'
currentStateTime: '1970-01-01T00:00:00Z'
id: '2023-03-08_16_06_21-11363799576275054117'
location: 'us-central1'
name: 'performance-tests-psio-python-2gb0308200444'
projectId: 'apache-beam-testing'
stageStates: []
startTime: '2023-03-09T00:06:21.549739Z'
steps: []
tempFiles: []
type: TypeValueValuesEnum(JOB_TYPE_STREAMING, 2)>
INFO:apache_beam.runners.dataflow.internal.apiclient:Created job with id: [2023-03-08_16_06_21-11363799576275054117]
INFO:apache_beam.runners.dataflow.internal.apiclient:Submitted job: 2023-03-08_16_06_21-11363799576275054117
INFO:apache_beam.runners.dataflow.internal.apiclient:To access the Dataflow monitoring console, please navigate to https://console.cloud.google.com/dataflow/jobs/us-central1/2023-03-08_16_06_21-11363799576275054117?project=apache-beam-testing
INFO:apache_beam.runners.dataflow.test_dataflow_runner:Console log:
INFO:apache_beam.runners.dataflow.test_dataflow_runner:https://console.cloud.google.com/dataflow/jobs/us-central1/2023-03-08_16_06_21-11363799576275054117?project=apache-beam-testing
INFO:apache_beam.runners.dataflow.dataflow_runner:Job 2023-03-08_16_06_21-11363799576275054117 is in state JOB_STATE_RUNNING
INFO:apache_beam.runners.dataflow.dataflow_runner:2023-03-09T00:06:28.864Z: JOB_MESSAGE_BASIC: Worker configuration: e2-standard-2 in us-central1-b.
INFO:apache_beam.runners.dataflow.dataflow_runner:2023-03-09T00:06:31.467Z: JOB_MESSAGE_DETAILED: Expanding SplittableParDo operations into optimizable parts.
INFO:apache_beam.runners.dataflow.dataflow_runner:2023-03-09T00:06:31.500Z: JOB_MESSAGE_DETAILED: Expanding CollectionToSingleton operations into optimizable parts.
INFO:apache_beam.runners.dataflow.dataflow_runner:2023-03-09T00:06:31.586Z: JOB_MESSAGE_DETAILED: Expanding CoGroupByKey operations into optimizable parts.
INFO:apache_beam.runners.dataflow.dataflow_runner:2023-03-09T00:06:31.712Z: JOB_MESSAGE_DETAILED: Expanding SplittableProcessKeyed operations into optimizable parts.
INFO:apache_beam.runners.dataflow.dataflow_runner:2023-03-09T00:06:31.745Z: JOB_MESSAGE_DETAILED: Expanding GroupByKey operations into streaming Read/Write steps
INFO:apache_beam.runners.dataflow.dataflow_runner:2023-03-09T00:06:31.810Z: JOB_MESSAGE_DETAILED: Lifting ValueCombiningMappingFns into MergeBucketsMappingFns
INFO:apache_beam.runners.dataflow.dataflow_runner:2023-03-09T00:06:31.875Z: JOB_MESSAGE_DEBUG: Annotating graph with Autotuner information.
INFO:apache_beam.runners.dataflow.dataflow_runner:2023-03-09T00:06:31.932Z: JOB_MESSAGE_DETAILED: Fusing adjacent ParDo, Read, Write, and Flatten operations
INFO:apache_beam.runners.dataflow.dataflow_runner:2023-03-09T00:06:31.966Z: JOB_MESSAGE_DETAILED: Fusing consumer Read from pubsub/Map(_from_proto_str) into Read from pubsub/Read
INFO:apache_beam.runners.dataflow.dataflow_runner:2023-03-09T00:06:32.005Z: JOB_MESSAGE_DETAILED: Fusing consumer Map(<lambda at pubsub_io_perf_test.py:170>) into Read from pubsub/Map(_from_proto_str)
INFO:apache_beam.runners.dataflow.dataflow_runner:2023-03-09T00:06:32.035Z: JOB_MESSAGE_DETAILED: Fusing consumer Measure time into Map(<lambda at pubsub_io_perf_test.py:170>)
INFO:apache_beam.runners.dataflow.dataflow_runner:2023-03-09T00:06:32.066Z: JOB_MESSAGE_DETAILED: Fusing consumer Window into Measure time
INFO:apache_beam.runners.dataflow.dataflow_runner:2023-03-09T00:06:32.098Z: JOB_MESSAGE_DETAILED: Fusing consumer Count messages/KeyWithVoid into Window
INFO:apache_beam.runners.dataflow.dataflow_runner:2023-03-09T00:06:32.130Z: JOB_MESSAGE_DETAILED: Fusing consumer Count messages/CombinePerKey/Combine/ConvertToAccumulators into Count messages/KeyWithVoid
INFO:apache_beam.runners.dataflow.dataflow_runner:2023-03-09T00:06:32.162Z: JOB_MESSAGE_DETAILED: Fusing consumer Count messages/CombinePerKey/GroupByKey/WriteStream into Count messages/CombinePerKey/Combine/ConvertToAccumulators
INFO:apache_beam.runners.dataflow.dataflow_runner:2023-03-09T00:06:32.194Z: JOB_MESSAGE_DETAILED: Fusing consumer Count messages/CombinePerKey/Combine into Count messages/CombinePerKey/GroupByKey/ReadStream
INFO:apache_beam.runners.dataflow.dataflow_runner:2023-03-09T00:06:32.230Z: JOB_MESSAGE_DETAILED: Fusing consumer Count messages/CombinePerKey/Combine/Extract into Count messages/CombinePerKey/Combine
INFO:apache_beam.runners.dataflow.dataflow_runner:2023-03-09T00:06:32.262Z: JOB_MESSAGE_DETAILED: Fusing consumer Count messages/UnKey into Count messages/CombinePerKey/Combine/Extract
INFO:apache_beam.runners.dataflow.dataflow_runner:2023-03-09T00:06:32.293Z: JOB_MESSAGE_DETAILED: Fusing consumer Convert to bytes into Count messages/UnKey
INFO:apache_beam.runners.dataflow.dataflow_runner:2023-03-09T00:06:32.324Z: JOB_MESSAGE_DETAILED: Fusing consumer Write to Pubsub/ToProtobuf into Convert to bytes
INFO:apache_beam.runners.dataflow.dataflow_runner:2023-03-09T00:06:32.357Z: JOB_MESSAGE_DETAILED: Fusing consumer Write to Pubsub/Write into Write to Pubsub/ToProtobuf
INFO:apache_beam.runners.dataflow.dataflow_runner:2023-03-09T00:06:32.396Z: JOB_MESSAGE_BASIC: Running job using Streaming Engine
INFO:apache_beam.runners.dataflow.dataflow_runner:2023-03-09T00:06:32.444Z: JOB_MESSAGE_DEBUG: Workflow config is missing a default resource spec.
INFO:apache_beam.runners.dataflow.dataflow_runner:2023-03-09T00:06:32.472Z: JOB_MESSAGE_DEBUG: Adding StepResource setup and teardown to workflow graph.
INFO:apache_beam.runners.dataflow.dataflow_runner:2023-03-09T00:06:32.505Z: JOB_MESSAGE_DEBUG: Adding workflow start and stop steps.
INFO:apache_beam.runners.dataflow.dataflow_runner:2023-03-09T00:06:32.537Z: JOB_MESSAGE_DEBUG: Assigning stage ids.
INFO:apache_beam.runners.dataflow.dataflow_runner:2023-03-09T00:06:33.630Z: JOB_MESSAGE_DEBUG: Starting **** pool setup.
INFO:apache_beam.runners.dataflow.dataflow_runner:2023-03-09T00:06:33.664Z: JOB_MESSAGE_BASIC: Starting 5 ****s in us-central1-b...
INFO:apache_beam.runners.dataflow.dataflow_runner:2023-03-09T00:06:33.715Z: JOB_MESSAGE_DEBUG: Starting **** pool setup.
INFO:apache_beam.runners.dataflow.dataflow_runner:2023-03-09T00:06:50.902Z: JOB_MESSAGE_BASIC: Your project already contains 100 Dataflow-created metric descriptors, so new user metrics of the form custom.googleapis.com/* will not be created. However, all user metrics are also available in the metric dataflow.googleapis.com/job/user_counter. If you rely on the custom metrics, you can delete old / unused metric descriptors. See https://developers.google.com/apis-explorer/#p/monitoring/v3/monitoring.projects.metricDescriptors.list and https://developers.google.com/apis-explorer/#p/monitoring/v3/monitoring.projects.metricDescriptors.delete
INFO:apache_beam.runners.dataflow.dataflow_runner:2023-03-09T00:07:12.933Z: JOB_MESSAGE_DETAILED: Autoscaling: Raised the number of ****s to 1 so that the pipeline can catch up with its backlog and keep up with its input rate.
INFO:apache_beam.runners.dataflow.dataflow_runner:2023-03-09T00:07:12.965Z: JOB_MESSAGE_DETAILED: Autoscaling: Resized **** pool to 1, though goal was 5. This could be a quota issue.
INFO:apache_beam.runners.dataflow.dataflow_runner:2023-03-09T00:07:22.720Z: JOB_MESSAGE_DETAILED: Autoscaling: Raised the number of ****s to 5 so that the pipeline can catch up with its backlog and keep up with its input rate.
INFO:apache_beam.runners.dataflow.dataflow_runner:2023-03-09T00:07:50.600Z: JOB_MESSAGE_DETAILED: Workers have started successfully.
INFO:apache_beam.runners.dataflow.dataflow_runner:2023-03-09T00:08:01.032Z: JOB_MESSAGE_DETAILED: All ****s have finished the startup processes and began to receive work requests.
WARNING:apache_beam.runners.dataflow.dataflow_runner:Timing out on waiting for job 2023-03-08_16_06_21-11363799576275054117 after 722 seconds
ERROR:apache_beam.io.gcp.tests.pubsub_matcher:Timeout after 900 sec. Received 0 messages from projects/apache-beam-testing/subscriptions/pubsub_io_performance_99f15c51-8607-43b9-8e90-68911f98dc35_read_matcher.
Traceback (most recent call last):
File "/usr/lib/python3.7/runpy.py", line 193, in _run_module_as_main
"__main__", mod_spec)
File "/usr/lib/python3.7/runpy.py", line 85, in _run_code
exec(code, run_globals)
File "<https://ci-beam.apache.org/job/beam_PerformanceTests_PubsubIOIT_Python_Streaming/ws/src/sdks/python/apache_beam/io/gcp/pubsub_io_perf_test.py",> line 222, in <module>
PubsubReadPerfTest().run()
File "<https://ci-beam.apache.org/job/beam_PerformanceTests_PubsubIOIT_Python_Streaming/ws/src/sdks/python/apache_beam/testing/load_tests/load_test.py",> line 150, in run
self.result = self.pipeline.run()
File "<https://ci-beam.apache.org/job/beam_PerformanceTests_PubsubIOIT_Python_Streaming/ws/src/sdks/python/apache_beam/testing/test_pipeline.py",> line 114, in run
False if self.not_use_test_runner_api else test_runner_api))
File "<https://ci-beam.apache.org/job/beam_PerformanceTests_PubsubIOIT_Python_Streaming/ws/src/sdks/python/apache_beam/pipeline.py",> line 577, in run
return self.runner.run_pipeline(self, self._options)
File "<https://ci-beam.apache.org/job/beam_PerformanceTests_PubsubIOIT_Python_Streaming/ws/src/sdks/python/apache_beam/runners/dataflow/test_dataflow_runner.py",> line 70, in run_pipeline
hc_assert_that(self.result, pickler.loads(on_success_matcher))
File "<https://ci-beam.apache.org/job/beam_PerformanceTests_PubsubIOIT_Python_Streaming/ws/src/build/gradleenv/1329484227/lib/python3.7/site-packages/hamcrest/core/assert_that.py",> line 44, in assert_that
_assert_match(actual=arg1, matcher=arg2, reason=arg3)
File "<https://ci-beam.apache.org/job/beam_PerformanceTests_PubsubIOIT_Python_Streaming/ws/src/build/gradleenv/1329484227/lib/python3.7/site-packages/hamcrest/core/assert_that.py",> line 60, in _assert_match
raise AssertionError(description)
AssertionError:
Expected: (Expected 1 messages.)
but: Expected 1 messages. Got 0 messages. Diffs (item, count):
Expected but not in actual: dict_items([(b'2097152', 1)])
Unexpected: dict_items([])
Unexpected (with all details): []
Worker logs: https://console.cloud.google.com/dataflow/jobs/us-central1/2023-03-08_15_51_18-3554155292261535856?project=apache-beam-testing
Worker logs: https://console.cloud.google.com/dataflow/jobs/us-central1/2023-03-08_16_06_21-11363799576275054117?project=apache-beam-testing
> Task :sdks:python:apache_beam:testing:load_tests:run FAILED
FAILURE: Build failed with an exception.
* Where:
Build file '<https://ci-beam.apache.org/job/beam_PerformanceTests_PubsubIOIT_Python_Streaming/ws/src/sdks/python/apache_beam/testing/load_tests/build.gradle'> line: 63
* What went wrong:
Execution failed for task ':sdks:python:apache_beam:testing:load_tests:run'.
> error occurred
* Try:
> Run with --stacktrace option to get the stack trace.
> Run with --info or --debug option to get more log output.
* Get more help at https://help.gradle.org
Deprecated Gradle features were used in this build, making it incompatible with Gradle 8.0.
You can use '--warning-mode all' to show the individual deprecation warnings and determine if they come from your own scripts or plugins.
See https://docs.gradle.org/7.5.1/userguide/command_line_interface.html#sec:command_line_warnings
BUILD FAILED in 47m 5s
15 actionable tasks: 9 executed, 4 from cache, 2 up-to-date
Publishing build scan...
https://gradle.com/s/rt5y2hbvqq2sg
Build step 'Invoke Gradle script' changed build result to FAILURE
Build step 'Invoke Gradle script' marked build as failure
---------------------------------------------------------------------
To unsubscribe, e-mail: builds-unsubscribe@beam.apache.org
For additional commands, e-mail: builds-help@beam.apache.org